10Nov19rv1_3_1+0817-d484d16121 - detailed test results for MAROUTER

To reconnect the TextTest GUI to these results, run:

texttest -a marouter -d /home/delphi/clangDebug/sumo/tests -reconnect /home/delphi/clangDebug/texttesttmp/clang3_64D.30Nov020347.6520 -g

To start TextTest for these tests, run:

texttest -a marouter -d /home/delphi/clangDebug/sumo/tests


default: 83 tests: 80 succeeded 3 FAILED

Detailed information for the tests that FAILED:

TEST FAILED on ts-sim-build-ba : errors disconnected_ignore ( Last six runs Nov2019 )

---------- Differences in errors ----------
20a21,34
> 
> =================================================================
> ==20428==ERROR: LeakSanitizer: detected memory leaks
> 
> Direct leak of 112 byte(s) in 1 object(s) allocated from:
>     #0 0x853640  (/home/delphi/clangDebug/sumo/bin/marouterD+0x853640)
>     #1 0x9a157e  (/home/delphi/clangDebug/sumo/bin/marouterD+0x9a157e)
>     #2 0x9a30e8  (/home/delphi/clangDebug/sumo/bin/marouterD+0x9a30e8)
>     #3 0x9a9365  (/home/delphi/clangDebug/sumo/bin/marouterD+0x9a9365)
>     #4 0x863faf  (/home/delphi/clangDebug/sumo/bin/marouterD+0x863faf)
>     #5 0x86f9c1  (/home/delphi/clangDebug/sumo/bin/marouterD+0x86f9c1)
>     #6 0x7fac4aad6b96  (/lib/x86_64-linux-gnu/libc.so.6+0x21b96)
> 
> SUMMARY: AddressSanitizer: 112 byte(s) leaked in 1 allocation(s).
---------- New result in exitcode ----------
1

TEST FAILED on ts-sim-build-ba : errors incomplete_connections from_missing1of2_allowed ( Last six runs Nov2019 )

---------- Differences in errors ----------
21a22,35
> 
> =================================================================
> ==20352==ERROR: LeakSanitizer: detected memory leaks
> 
> Direct leak of 112 byte(s) in 1 object(s) allocated from:
>     #0 0x853640  (/home/delphi/clangDebug/sumo/bin/marouterD+0x853640)
>     #1 0x9a157e  (/home/delphi/clangDebug/sumo/bin/marouterD+0x9a157e)
>     #2 0x9a30e8  (/home/delphi/clangDebug/sumo/bin/marouterD+0x9a30e8)
>     #3 0x9a9365  (/home/delphi/clangDebug/sumo/bin/marouterD+0x9a9365)
>     #4 0x863faf  (/home/delphi/clangDebug/sumo/bin/marouterD+0x863faf)
>     #5 0x86f9c1  (/home/delphi/clangDebug/sumo/bin/marouterD+0x86f9c1)
>     #6 0x7f45144e5b96  (/lib/x86_64-linux-gnu/libc.so.6+0x21b96)
> 
> SUMMARY: AddressSanitizer: 112 byte(s) leaked in 1 allocation(s).
---------- New result in exitcode ----------
1

TEST FAILED on ts-sim-build-ba : errors incomplete_connections to_missing2of2_allowed ( Last six runs Nov2019 )

---------- Differences in errors ----------
21a22,35
> 
> =================================================================
> ==20376==ERROR: LeakSanitizer: detected memory leaks
> 
> Direct leak of 112 byte(s) in 1 object(s) allocated from:
>     #0 0x853640  (/home/delphi/clangDebug/sumo/bin/marouterD+0x853640)
>     #1 0x9a157e  (/home/delphi/clangDebug/sumo/bin/marouterD+0x9a157e)
>     #2 0x9a30e8  (/home/delphi/clangDebug/sumo/bin/marouterD+0x9a30e8)
>     #3 0x9a9365  (/home/delphi/clangDebug/sumo/bin/marouterD+0x9a9365)
>     #4 0x863faf  (/home/delphi/clangDebug/sumo/bin/marouterD+0x863faf)
>     #5 0x86f9c1  (/home/delphi/clangDebug/sumo/bin/marouterD+0x86f9c1)
>     #6 0x7ff5a0880b96  (/lib/x86_64-linux-gnu/libc.so.6+0x21b96)
> 
> SUMMARY: AddressSanitizer: 112 byte(s) leaked in 1 allocation(s).
---------- New result in exitcode ----------
1