21Oct19rv1_3_1+0651-1321d97ba1 - detailed test results for MAROUTER

To reconnect the TextTest GUI to these results, run:

texttest -a marouter -d /home/delphi/clangDebug/sumo/tests -reconnect /home/delphi/clangDebug/texttesttmp/clang3_64D.31Oct020238.4316 -g

To start TextTest for these tests, run:

texttest -a marouter -d /home/delphi/clangDebug/sumo/tests


default: 83 tests: 80 succeeded 3 FAILED

Detailed information for the tests that FAILED:

TEST FAILED on ts-sim-build-ba : errors disconnected_ignore ( Last six runs Oct2019 )

---------- Differences in errors ----------
20a21,34
> 
> =================================================================
> ==6122==ERROR: LeakSanitizer: detected memory leaks
> 
> Direct leak of 112 byte(s) in 1 object(s) allocated from:
>     #0 0x8526a0  (/home/delphi/clangDebug/sumo/bin/marouterD+0x8526a0)
>     #1 0x9a05de  (/home/delphi/clangDebug/sumo/bin/marouterD+0x9a05de)
>     #2 0x9a2148  (/home/delphi/clangDebug/sumo/bin/marouterD+0x9a2148)
>     #3 0x9a83c5  (/home/delphi/clangDebug/sumo/bin/marouterD+0x9a83c5)
>     #4 0x86300f  (/home/delphi/clangDebug/sumo/bin/marouterD+0x86300f)
>     #5 0x86ea21  (/home/delphi/clangDebug/sumo/bin/marouterD+0x86ea21)
>     #6 0x7fe8f3b31b96  (/lib/x86_64-linux-gnu/libc.so.6+0x21b96)
> 
> SUMMARY: AddressSanitizer: 112 byte(s) leaked in 1 allocation(s).
---------- New result in exitcode ----------
1

TEST FAILED on ts-sim-build-ba : errors incomplete_connections from_missing1of2_allowed ( Last six runs Oct2019 )

---------- Differences in errors ----------
21a22,35
> 
> =================================================================
> ==6057==ERROR: LeakSanitizer: detected memory leaks
> 
> Direct leak of 112 byte(s) in 1 object(s) allocated from:
>     #0 0x8526a0  (/home/delphi/clangDebug/sumo/bin/marouterD+0x8526a0)
>     #1 0x9a05de  (/home/delphi/clangDebug/sumo/bin/marouterD+0x9a05de)
>     #2 0x9a2148  (/home/delphi/clangDebug/sumo/bin/marouterD+0x9a2148)
>     #3 0x9a83c5  (/home/delphi/clangDebug/sumo/bin/marouterD+0x9a83c5)
>     #4 0x86300f  (/home/delphi/clangDebug/sumo/bin/marouterD+0x86300f)
>     #5 0x86ea21  (/home/delphi/clangDebug/sumo/bin/marouterD+0x86ea21)
>     #6 0x7fa7336a5b96  (/lib/x86_64-linux-gnu/libc.so.6+0x21b96)
> 
> SUMMARY: AddressSanitizer: 112 byte(s) leaked in 1 allocation(s).
---------- New result in exitcode ----------
1

TEST FAILED on ts-sim-build-ba : errors incomplete_connections to_missing2of2_allowed ( Last six runs Oct2019 )

---------- Differences in errors ----------
21a22,35
> 
> =================================================================
> ==6064==ERROR: LeakSanitizer: detected memory leaks
> 
> Direct leak of 112 byte(s) in 1 object(s) allocated from:
>     #0 0x8526a0  (/home/delphi/clangDebug/sumo/bin/marouterD+0x8526a0)
>     #1 0x9a05de  (/home/delphi/clangDebug/sumo/bin/marouterD+0x9a05de)
>     #2 0x9a2148  (/home/delphi/clangDebug/sumo/bin/marouterD+0x9a2148)
>     #3 0x9a83c5  (/home/delphi/clangDebug/sumo/bin/marouterD+0x9a83c5)
>     #4 0x86300f  (/home/delphi/clangDebug/sumo/bin/marouterD+0x86300f)
>     #5 0x86ea21  (/home/delphi/clangDebug/sumo/bin/marouterD+0x86ea21)
>     #6 0x7f3c58813b96  (/lib/x86_64-linux-gnu/libc.so.6+0x21b96)
> 
> SUMMARY: AddressSanitizer: 112 byte(s) leaked in 1 allocation(s).
---------- New result in exitcode ----------
1