25Sep26rv1_27_1+0768-9755c12bafb - detailed test results for MAROUTER

To reconnect the TextTest GUI to these results, run:

texttest -a marouter -d /home/delphi/clangDebug/sumo/tests -reconnect /home/delphi/clangDebug/texttesttmp/clangD.29Sep070658.1501412 -g

To start TextTest for these tests, run:

texttest -a marouter -d /home/delphi/clangDebug/sumo/tests


default: 116 tests: 112 succeeded 4 FAILED

Detailed information for the tests that FAILED:

3 TESTS FAILED on bsvusimbld :

---------- Differences in errors ----------
0a1,6
> /home/delphi/clangDebug/sumo/src/foreign/RoutingKit/src/customizable_contraction_hierarchy.cpp:424:49: runtime error: unsigned integer overflow: 0 - 1 cannot be represented in type 'unsigned int'
> SUMMARY: UndefinedBehaviorSanitizer: undefined-behavior /home/delphi/clangDebug/sumo/src/foreign/RoutingKit/src/customizable_contraction_hierarchy.cpp:424:49 
> /home/delphi/clangDebug/sumo/src/foreign/RoutingKit/src/customizable_contraction_hierarchy.cpp:1224:58: runtime error: unsigned integer overflow: 0 - 1 cannot be represented in type 'unsigned int'
> SUMMARY: UndefinedBehaviorSanitizer: undefined-behavior /home/delphi/clangDebug/sumo/src/foreign/RoutingKit/src/customizable_contraction_hierarchy.cpp:1224:58 
> /home/delphi/clangDebug/sumo/src/foreign/RoutingKit/src/customizable_contraction_hierarchy.cpp:1250:58: runtime error: unsigned integer overflow: 0 - 1 cannot be represented in type 'unsigned int'
> SUMMARY: UndefinedBehaviorSanitizer: undefined-behavior /home/delphi/clangDebug/sumo/src/foreign/RoutingKit/src/customizable_contraction_hierarchy.cpp:1250:58 
incremental cch ( Last six runs Sep2026 )
incremental cch_threading ( Last six runs Sep2026 )
sue cch_reset_regression ( Last six runs Sep2026 )

TEST FAILED on bsvusimbld : sue warn_CCH ( Last six runs Sep2026 )

---------- Differences in errors ----------
1a2,7
> /home/delphi/clangDebug/sumo/src/foreign/RoutingKit/src/customizable_contraction_hierarchy.cpp:424:49: runtime error: unsigned integer overflow: 0 - 1 cannot be represented in type 'unsigned int'
> SUMMARY: UndefinedBehaviorSanitizer: undefined-behavior /home/delphi/clangDebug/sumo/src/foreign/RoutingKit/src/customizable_contraction_hierarchy.cpp:424:49 
> /home/delphi/clangDebug/sumo/src/foreign/RoutingKit/src/customizable_contraction_hierarchy.cpp:1224:58: runtime error: unsigned integer overflow: 0 - 1 cannot be represented in type 'unsigned int'
> SUMMARY: UndefinedBehaviorSanitizer: undefined-behavior /home/delphi/clangDebug/sumo/src/foreign/RoutingKit/src/customizable_contraction_hierarchy.cpp:1224:58 
> /home/delphi/clangDebug/sumo/src/foreign/RoutingKit/src/customizable_contraction_hierarchy.cpp:1250:58: runtime error: unsigned integer overflow: 0 - 1 cannot be represented in type 'unsigned int'
> SUMMARY: UndefinedBehaviorSanitizer: undefined-behavior /home/delphi/clangDebug/sumo/src/foreign/RoutingKit/src/customizable_contraction_hierarchy.cpp:1250:58