18Oct19rv1_3_1+0634-7b09a416a6 - detailed test results for COMPLEX

To reconnect the TextTest GUI to these results, run:

texttest -a complex -d /Users/sumo/clangMacOS/sumo/tests -reconnect /Users/sumo/clangMacOS/texttesttmp/clangMacOS.31Oct001502.73729 -g

To start TextTest for these tests, run:

texttest -a complex -d /Users/sumo/clangMacOS/sumo/tests


default: 298 tests: 250 succeeded 33 FAILED 15 known bugs

Detailed information for the tests that FAILED:

TEST FAILED on SUMO-mac : netconvert osm_roundtrip ( Last six runs Oct2019 )

---------- Differences in net ----------
22c22
<     <type id="highway.secondary" priority="11" numLanes="2" speed="27.78" disallow="tram rail_urban rail rail_electric rail_fast ship" oneway="0"/>
---
>     <type id="highway.secondary" priority="11" numLanes="1" speed="27.78" disallow="tram rail_urban rail rail_electric rail_fast ship" oneway="0"/>

TEST FAILED on SUMO-mac : simpla config ( Last six runs Oct2019 )

---------- Differences in errors ----------
1,22c1,10
< .....WARNING: No typeSubstring given. Managing all vehicles. (PlatoonManager)
< .
< ----------------------------------------------------------------------
< Ran 6 tests in <ELAPSED>s
< 
< OK
< -- Unordered text as found by filter '^WARNING:' --
< WARNING: Encountered unknown configuration parameter 'UnknownConfigParam'! (Config)
< WARNING: Given lane change mode '-1' lies out of admissible range [0,255]. Using default mode instead. (Config)
< WARNING: Given lane change mode '100000' lies out of admissible range [0,255]. Using default mode instead. (Config)
< WARNING: Given speedFactor -1.0 is invalid. Using default value. (Config)
< WARNING: Given speedFactor -4.0 is invalid. Using default value. (Config)
< WARNING: Given speedFactor 0.0 is invalid. Using default value. (Config)
< WARNING: No attributes found for tag 'vehicleSelectors'. (Config)
< WARNING: Parameter catchupDist must be positive. Ignoring given value: -1.0 (Config)
< WARNING: Parameter controlRate must be positive. Ignoring given value: 0.0 (Config)
< WARNING: Parameter maxPlatoonGap must be positive. Ignoring given value: -1.0 (Config)
< WARNING: Parameter platoonSplitTime must be non-negative. Ignoring given value: -1.0 (Config)
< WARNING: Parameter switchImpatienceFactor must be non-negative. Ignoring given value: -1.0 (Config)
< WARNING: Verbosity must be one of [0, 1, 2, 3, 4]! Ignoring given value: 200 (Config)
< WARNING: vTypeMap must specify original type. Ignoring malformed vTypeMap element. (Config)
< 
---
> Traceback (most recent call last):
>   File "/Users/sumo/clangMacOS/sumo/tests/../tests/complex/simpla/config/test.py", line 27, in <module>
>     import simpla  # noqa
>   File "/Users/sumo/clangMacOS/sumo/tools/simpla/__init__.py", line 62, in <module>
>     import simpla._config  # noqa
>   File "/Users/sumo/clangMacOS/sumo/tools/simpla/_config.py", line 26, in <module>
<truncated after showing first 30 lines>
---------- Differences in output ----------
1,43d0
< Loading configuration... done.
< Loading configuration... done.
< Loading configuration... done.
< Loading configuration... done.
< Loading configuration... done.
< Loading configuration... done.
< Testing config warnings...
< Testing exception messages...
< Testing malformed vtype map file causing exception...
< Testing empty config...
< Testing standard config...
< Loading vehicle type mappings from file '<vtype.map>'...
< original type: 'pkwFern5' (Config)
< platoon leader type: 'pkwFern5_pLeader' (Config)
< platoon follower type: 'pkwFern5_pFollower' (Config)
< catchup type: 'pkwFern5_pCatchup' (Config)
< catchup follower type: 'pkwFern5_pCatchupFollower' (Config)
< original type: 'pkwFern4' (Config)
< platoon leader type: 'pkwFern4_pLeader' (Config)
< platoon follower type: 'pkwFern4_pFollower' (Config)
< catchup type: 'pkwFern4_pCatchup' (Config)
< catchup follower type: 'pkwFern4_pCatchupFollower' (Config)
< original type: 'pkwFern3' (Config)
< platoon leader type: 'pkwFern3_pLeader' (Config)
< platoon follower type: 'pkwFern3_pFollower' (Config)
< catchup type: 'pkwFern3_pCatchup' (Config)
< catchup follower type: 'pkwFern3_pCatchupFollower' (Config)
< original type: 'pkwFern1' (Config)
< platoon leader type: 'pkwFern1_pLeader' (Config)
<truncated after showing first 30 lines>

TEST FAILED on SUMO-mac : simpla openGap ( Last six runs Oct2019 )

---------- Differences in errors ----------
0a1,10
> Traceback (most recent call last):
>   File "/Users/sumo/clangMacOS/sumo/tests/../tests/complex/simpla/openGap/runner.py", line 26, in <module>
>     import simpla  # noqa
>   File "/Users/sumo/clangMacOS/sumo/tools/simpla/__init__.py", line 62, in <module>
>     import simpla._config  # noqa
>   File "/Users/sumo/clangMacOS/sumo/tools/simpla/_config.py", line 26, in <module>
>     from simpla._platoonmode import PlatoonMode  # noqa
>   File "/Users/sumo/clangMacOS/sumo/tools/simpla/_platoonmode.py", line 15, in <module>
>     from enum import Enum
> ImportError: No module named enum
---------- Differences in output ----------
1,11499d0
< Loading configuration... done.
< 
< # step 0.0
< # Follower:
< examining follower
< speed 0.0
< speed w/o traci 0.0
< acceleration 0.0
< lane 5/1to6/1_0
< lanePos 972.24
< # Leader:
< examining leader
< speed 0.0
< speed w/o traci 0.0
< acceleration 0.0
< lane 5/1to6/1_0
< lanePos 979.84
< 
< # gap = 0.1
< # speedDiff = 0.0
< 
< 
< # step 1.0
< # Follower:
< examining follower
< speed 0.099
< speed w/o traci 0.099
< acceleration 0.099
< lane 5/1to6/1_0
<truncated after showing first 30 lines>

TEST FAILED on SUMO-mac : simpla platoon_manager ( Last six runs Oct2019 )

---------- Differences in errors ----------
1,26c1,10
< ...Warning: Value of 'emergencyDecel' (0.50) should be higher than 'decel' (1.70) for vType 'connected_pCatchup'.
< Warning: Value of 'emergencyDecel' (0.50) is lower than 'apparentDecel' (1.70) for vType 'connected_pCatchup' may cause collisions.
< Consider decreasing simpla's control rate instead. (PlatoonManager)
< ..Warning: Value of 'emergencyDecel' (0.50) should be higher than 'decel' (1.70) for vType 'connected_pCatchup'.
< Warning: Value of 'emergencyDecel' (0.50) is lower than 'apparentDecel' (1.70) for vType 'connected_pCatchup' may cause collisions.
< .
< ----------------------------------------------------------------------
< Ran 6 tests in <ELAPSED>s
< 
< OK
< -- Unordered text as found by filter '^This will probably' --
< This will probably lead to collisions. (PlatoonManager)
< This will probably lead to collisions. (PlatoonManager)
< 
< -- Unordered text as found by filter '^[0-9]*\.*[0-9]*: WARNING:' --
< 1.0: WARNING: Step lengths that differ from SUMO's simulation step length are not supported and probably lead to undesired behavior.
< 
< -- Unordered text as found by filter '^WARNING:' --
< WARNING: No typeSubstring given. Managing all vehicles. (PlatoonManager)
< WARNING: Restricting given control rate (= 1000 per sec.) to 1 per timestep (= 10 per sec.) (PlatoonManager)
< WARNING: emergencyDecel of mapped vType 'connected_pCatchup' (0.5m.) does not equal emergencyDecel of original vType 'connected' (4.5m.) (PlatoonManager)
< WARNING: emergencyDecel of mapped vType 'connected_pCatchupFollower' (10.5m.) does not equal emergencyDecel of original vType 'connected' (4.5m.) (PlatoonManager)
< WARNING: emergencyDecel of mapped vType 'connected_pFollower' (1.7m.) does not equal emergencyDecel of original vType 'connected' (4.5m.) (PlatoonManager)
< WARNING: length of mapped vType 'connected_pCatchupFollower' (3.0m.) does not equal length of original vType 'connected' (5.0m.)
< WARNING: length of mapped vType 'connected_pLeader' (10.0m.) does not equal length of original vType 'connected' (5.0m.)
< 
---
> Traceback (most recent call last):
>   File "/Users/sumo/clangMacOS/sumo/tests/../tests/complex/simpla/platoon_manager/test.py", line 28, in <module>
<truncated after showing first 30 lines>
---------- Differences in output ----------
1,75d0
< Loading configuration... done.
< Loading configuration... done.
< Loading configuration... done.
< Loading configuration... done.
< Loading configuration... done.
< Loading configuration... done.
< 
< 
< Testing adding and removing connected vehicles...
< Loading vehicle type mappings from file '<vtype.map>'...
< original type: 'connected' (Config)
< platoon leader type: 'connected_pLeader' (Config)
< platoon follower type: 'connected_pFollower' (Config)
< catchup type: 'connected_pCatchup' (Config)
< catchup follower type: 'connected_pCatchupFollower' (Config)
< Initializing simpla.PlatoonManager... (PlatoonManager)
< Managing all vTypes selected by ['connected'] (PlatoonManager)
< 0.1: Adding vehicle 'connected.1' (PlatoonManager)
< 3.1: Adding vehicle 'IAMconnectedTOO' (PlatoonManager)
< 11.4: Platoon '1' joined Platoon '0', which now contains vehicles:
< ['connected.1', 'IAMconnectedTOO'] (PlatoonManager)
< 16.0: Platoon '0' splits (ID of new platoon: '2'):
<     Platoon '0': ['connected.1']
<     Platoon '2': ['IAMconnectedTOO'] (PlatoonManager)
< 17.3: Removing arrived vehicle 'connected.1' (PlatoonManager)
< 19.8: Removing arrived vehicle 'IAMconnectedTOO' (PlatoonManager)
< 
< 
< Testing platoon manager initialization...
<truncated after showing first 30 lines>

TEST FAILED on SUMO-mac : state diff_begin ( Last six runs Oct2019 )

---------- Differences in errors ----------
1c1,2
< Warning: State was written at a different time 50.00 than the begin time 10!
---
> Error: Key not found.
> Quitting (on error).
---------- Differences in vehroutes ----------
5,12d4
<     <vehicle id="0" type="DEFAULT_VEHTYPE" depart="0.00" departPos="100.00" departSpeed="10.00" arrival="174.00">
<         <route edges="4/1to3/1 3/1to2/1 2/1to1/1 1/1to0/1"/>
<     </vehicle>
< 
<     <vehicle id="1" type="DEFAULT_VEHTYPE" depart="5.00" departPos="100.00" departSpeed="10.00" arrival="176.00">
<         <route edges="4/1to3/1 3/1to2/1 2/1to1/1 1/1to0/1"/>
<     </vehicle>
< 

TEST FAILED on SUMO-mac : state disconnected ( Last six runs Oct2019 )

---------- Differences in errors ----------
5,8c5,6
< Warning: Teleporting vehicle '0'; waited too long (wrong lane), lane='4/1to3/1_0', time=332.00.
< Warning: Vehicle '0' ends teleporting on edge '2/1to1/1', time 332.00.
< Warning: Teleporting vehicle '1'; waited too long (wrong lane), lane='4/1to3/1_0', time=637.00.
< Warning: Vehicle '1' ends teleporting on edge '2/1to1/1', time 637.00.
---
> Error: Key not found.
> Quitting (on error).
---------- Differences in vehroutes ----------
5,12d4
<     <vehicle id="0" type="DEFAULT_VEHTYPE" depart="0.00" departPos="100.00" departSpeed="10.00" arrival="432.00">
<         <route edges="4/1to3/1 2/1to1/1 1/1to0/1"/>
<     </vehicle>
< 
<     <vehicle id="1" type="DEFAULT_VEHTYPE" depart="5.00" departPos="100.00" departSpeed="10.00" arrival="776.00">
<         <route edges="4/1to3/1 2/1to1/1 1/1to0/1"/>
<     </vehicle>
< 

2 TESTS FAILED on SUMO-mac :

---------- Differences in errors ----------
0a1,2
> Error: Key not found.
> Quitting (on error).
---------- Differences in vehroutes ----------
5,12d4
<     <vehicle id="0" type="DEFAULT_VEHTYPE" depart="0.00" departPos="100.00" departSpeed="10.00" arrival="260.00">
<         <route edges="4/1to3/1 3/1to2/1 2/1to1/1 1/1to0/1"/>
<     </vehicle>
< 
<     <vehicle id="1" type="DEFAULT_VEHTYPE" depart="5.00" departPos="100.00" departSpeed="10.00" arrival="262.00">
<         <route edges="4/1to3/1 3/1to2/1 2/1to1/1 1/1to0/1"/>
<     </vehicle>
< 
state dists ( Last six runs Oct2019 )
state prefix ( Last six runs Oct2019 )

TEST FAILED on SUMO-mac : state plain ( Last six runs Oct2019 )

---------- Differences in errors ----------
0a1,2
> Error: Key not found.
> Quitting (on error).
---------- Differences in tls_state ----------
5,217d4
<     <tlsState time="50.00" id="0/0" programID="0" phase="2" state="GrGg"/>
<     <tlsState time="51.00" id="0/0" programID="0" phase="2" state="GrGg"/>
<     <tlsState time="52.00" id="0/0" programID="0" phase="2" state="GrGg"/>
<     <tlsState time="53.00" id="0/0" programID="0" phase="2" state="GrGg"/>
<     <tlsState time="54.00" id="0/0" programID="0" phase="2" state="GrGg"/>
<     <tlsState time="55.00" id="0/0" programID="0" phase="2" state="GrGg"/>
<     <tlsState time="56.00" id="0/0" programID="0" phase="2" state="GrGg"/>
<     <tlsState time="57.00" id="0/0" programID="0" phase="2" state="GrGg"/>
<     <tlsState time="58.00" id="0/0" programID="0" phase="2" state="GrGg"/>
<     <tlsState time="59.00" id="0/0" programID="0" phase="2" state="GrGg"/>
<     <tlsState time="60.00" id="0/0" programID="0" phase="2" state="GrGg"/>
<     <tlsState time="61.00" id="0/0" programID="0" phase="2" state="GrGg"/>
<     <tlsState time="62.00" id="0/0" programID="0" phase="2" state="GrGg"/>
<     <tlsState time="63.00" id="0/0" programID="0" phase="2" state="GrGg"/>
<     <tlsState time="64.00" id="0/0" programID="0" phase="2" state="GrGg"/>
<     <tlsState time="65.00" id="0/0" programID="0" phase="3" state="yryy"/>
<     <tlsState time="66.00" id="0/0" programID="0" phase="3" state="yryy"/>
<     <tlsState time="67.00" id="0/0" programID="0" phase="3" state="yryy"/>
<     <tlsState time="68.00" id="0/0" programID="0" phase="0" state="GgGr"/>
<     <tlsState time="69.00" id="0/0" programID="0" phase="0" state="GgGr"/>
<     <tlsState time="70.00" id="0/0" programID="0" phase="0" state="GgGr"/>
<     <tlsState time="71.00" id="0/0" programID="0" phase="0" state="GgGr"/>
<     <tlsState time="72.00" id="0/0" programID="0" phase="0" state="GgGr"/>
<     <tlsState time="73.00" id="0/0" programID="0" phase="0" state="GgGr"/>
<     <tlsState time="74.00" id="0/0" programID="0" phase="0" state="GgGr"/>
<     <tlsState time="75.00" id="0/0" programID="0" phase="0" state="GgGr"/>
<     <tlsState time="76.00" id="0/0" programID="0" phase="0" state="GgGr"/>
<     <tlsState time="77.00" id="0/0" programID="0" phase="0" state="GgGr"/>
<     <tlsState time="78.00" id="0/0" programID="0" phase="0" state="GgGr"/>
<truncated after showing first 30 lines>
---------- Differences in vehroutes ----------
5,13d4
<     <vehicle id="0" type="DEFAULT_VEHTYPE" depart="0.00" departPos="100.00" departSpeed="10.00" arrival="260.00">
<         <route edges="4/1to3/1 3/1to2/1 2/1to1/1 1/1to0/1"/>
<     </vehicle>
< 
<     <vehicle id="1" type="DEFAULT_VEHTYPE" depart="5.00" departPos="100.00" departSpeed="10.00" arrival="262.00">
<         <route edges="4/1to3/1 3/1to2/1 2/1to1/1 1/1to0/1"/>
<         <stop lane="3/1to2/1_0" startPos="399.80" endPos="400.00" duration="10.00"/>
<     </vehicle>
< 

TEST FAILED on SUMO-mac : sumo ToCDevice ToC_with_sampled_responseTime ( Last six runs Oct2019 )

---------- Differences in fcd ----------
627c627
<         <vehicle id="ToC_veh" x="11.97" y="1458.37" angle="162.00" type="automated@ToC_veh" speed="19.60" pos="53.99" lane="6/1to7/1_0" slope="0.00"/>
---
>         <vehicle id="ToC_veh" x="11.84" y="1458.77" angle="162.00" type="manual" speed="19.18" pos="53.57" lane="6/1to7/1_0" slope="0.00"/>
630c630
<         <vehicle id="ToC_veh" x="18.03" y="1439.73" angle="162.00" type="automated@ToC_veh" speed="19.60" pos="73.59" lane="6/1to7/1_0" slope="0.00"/>
---
>         <vehicle id="ToC_veh" x="17.85" y="1440.27" angle="162.00" type="manual" speed="19.45" pos="73.02" lane="6/1to7/1_0" slope="0.00"/>
633c633
<         <vehicle id="ToC_veh" x="24.09" y="1421.09" angle="162.00" type="automated@ToC_veh" speed="19.60" pos="93.19" lane="6/1to7/1_0" slope="0.00"/>
---
>         <vehicle id="ToC_veh" x="23.72" y="1422.23" angle="162.00" type="manual" speed="18.97" pos="91.99" lane="6/1to7/1_0" slope="0.00"/>
636c636
<         <vehicle id="ToC_veh" x="30.14" y="1402.45" angle="162.00" type="automated@ToC_veh" speed="19.60" pos="112.79" lane="6/1to7/1_0" slope="0.00"/>
---
>         <vehicle id="ToC_veh" x="29.50" y="1404.42" angle="162.00" type="manual" speed="18.73" pos="110.72" lane="6/1to7/1_0" slope="0.00"/>
639c639
<         <vehicle id="ToC_veh" x="36.20" y="1383.81" angle="162.00" type="automated@ToC_veh" speed="19.60" pos="132.39" lane="6/1to7/1_0" slope="0.00"/>
---
>         <vehicle id="ToC_veh" x="35.20" y="1386.88" angle="162.00" type="manual" speed="18.44" pos="129.16" lane="6/1to7/1_0" slope="0.00"/>
642c642
<         <vehicle id="ToC_veh" x="42.26" y="1365.17" angle="162.00" type="automated@ToC_veh" speed="19.60" pos="151.99" lane="6/1to7/1_0" slope="0.00"/>
---
>         <vehicle id="ToC_veh" x="41.07" y="1368.81" angle="162.00" type="manual" speed="18.99" pos="148.16" lane="6/1to7/1_0" slope="0.00"/>
645c645
<         <vehicle id="ToC_veh" x="48.31" y="1346.53" angle="162.00" type="automated@ToC_veh" speed="19.60" pos="171.59" lane="6/1to7/1_0" slope="0.00"/>
---
>         <vehicle id="ToC_veh" x="47.02" y="1350.52" angle="162.00" type="manual" speed="19.23" pos="167.39" lane="6/1to7/1_0" slope="0.00"/>
648c648
<         <vehicle id="ToC_veh" x="54.37" y="1327.89" angle="162.00" type="automated@ToC_veh" speed="19.60" pos="191.19" lane="6/1to7/1_0" slope="0.00"/>
<truncated after showing first 30 lines>
---------- Differences in output ----------
1053,1055c1053,1055
<   currentAwareness = 1.00
<   currentSpeed = 19.6
<   state = PREPARING_TOC
---
>   currentAwareness = 0.25
>   currentSpeed = 19.1809747301
>   state = RECOVERING
1058,1060c1058,1060
<   currentAwareness = 1.00
<   currentSpeed = 19.6
<   state = PREPARING_TOC
---
>   currentAwareness = 0.35
>   currentSpeed = 19.4507216304
>   state = RECOVERING
1063,1065c1063,1065
<   currentAwareness = 1.00
<   currentSpeed = 19.6
<   state = PREPARING_TOC
---
>   currentAwareness = 0.45
>   currentSpeed = 18.9702641872
>   state = RECOVERING
1068,1070c1068,1070
<   currentAwareness = 1.00
<   currentSpeed = 19.6
<   state = PREPARING_TOC
---
>   currentAwareness = 0.55
<truncated after showing first 30 lines>
---------- Differences in tocs ----------
6c6
<     <ToCdown id="ToC_veh" t="215.00" lane="6/1to7/1_0" lanePos="0.19"/>
---
>     <ToCdown id="ToC_veh" t="207.00" lane="6/1to7/1_0" lanePos="0.03"/>

TEST FAILED on SUMO-mac : sumo ToCDevice dynamic_ToC ( Last six runs Oct2019 )

---------- Differences in output ----------
330,353d329
<   currentAwareness = 1.00
<   currentSpeed = 13.89
<   state = PREPARING_TOC
< Time 51.0: Current lane of veh 'ToC_veh': WE_1
< time 51.0
< ToC device infos for vehicle 'ToC_veh'
<   currentAwareness = 1.00
<   currentSpeed = 13.89
<   state = PREPARING_TOC
< Time 52.0: Current lane of veh 'ToC_veh': WE_1
< time 52.0
< ToC device infos for vehicle 'ToC_veh'
<   currentAwareness = 1.00
<   currentSpeed = 13.89
<   state = PREPARING_TOC
< Time 53.0: Current lane of veh 'ToC_veh': WE_1
< time 53.0
< ToC device infos for vehicle 'ToC_veh'
<   currentAwareness = 1.00
<   currentSpeed = 13.89
<   state = PREPARING_TOC
< Time 54.0: Current lane of veh 'ToC_veh': WE_1
< time 54.0
< ToC device infos for vehicle 'ToC_veh'
355c331
<   currentSpeed = 13.1714961264
---
>   currentSpeed = 13.0917288732
358,359c334,335
<truncated after showing first 30 lines>
---------- Differences in tocs ----------
7c7
<     <ToCdown id="ToC_veh" t="53.00" lane="WE_1" lanePos="0.69"/>
---
>     <ToCdown id="ToC_veh" t="49.00" lane="WE_1" lanePos="0.64"/>

TEST FAILED on SUMO-mac : sumo ToCDevice dynamic_ToC_aborted ( Last six runs Oct2019 )

---------- Differences in output ----------
322,324c322,324
<   currentAwareness = 1.00
<   currentSpeed = 13.89
<   state = PREPARING_TOC
---
>   currentAwareness = 0.25
>   currentSpeed = 13.0917288732
>   state = RECOVERING
329,331c329,331
<   currentAwareness = 1.00
<   currentSpeed = 13.89
<   state = PREPARING_TOC
---
>   currentAwareness = 0.35
>   currentSpeed = 12.9180522858
>   state = RECOVERING
335,337c335,337
<   currentAwareness = 1.00
<   currentSpeed = 13.89
<   state = AUTOMATED
---
>   currentAwareness = 0.45
>   currentSpeed = 13.3196243835
>   state = RECOVERING
341,343c341,343
<   currentAwareness = 1.00
<   currentSpeed = 13.89
<   state = AUTOMATED
---
>   currentAwareness = 0.55
<truncated after showing first 30 lines>
---------- Differences in tocs ----------
7,8c7
<     <~DYNTOR id="ToC_veh" t="51.00" lane="WE_0" lanePos="0.68"/>
<     <ToCup id="ToC_veh" t="51.00" lane="WE_0" lanePos="0.68"/>
---
>     <ToCdown id="ToC_veh" t="49.00" lane="WE_1" lanePos="0.64"/>

TEST FAILED on SUMO-mac : sumo ToCDevice dynamic_ToC_stop ( Last six runs Oct2019 )

---------- Differences in output ----------
538,561d537
<   currentAwareness = 1.00
<   currentSpeed = 2.399
<   state = PREPARING_TOC
< Time 87.0: Current lane of veh 'ToC_veh': WE_1
< time 87.0
< ToC device infos for vehicle 'ToC_veh'
<   currentAwareness = 1.00
<   currentSpeed = 0.0
<   state = PREPARING_TOC
< Time 88.0: Current lane of veh 'ToC_veh': WE_1
< time 88.0
< ToC device infos for vehicle 'ToC_veh'
<   currentAwareness = 1.00
<   currentSpeed = 0.0
<   state = PREPARING_TOC
< Time 89.0: Current lane of veh 'ToC_veh': WE_1
< time 89.0
< ToC device infos for vehicle 'ToC_veh'
<   currentAwareness = 1.00
<   currentSpeed = 0.0
<   state = PREPARING_TOC
< Time 90.0: Current lane of veh 'ToC_veh': WE_1
< time 90.0
< ToC device infos for vehicle 'ToC_veh'
563c539
<   currentSpeed = 0.0
---
>   currentSpeed = 2.20930391098
566,567c542,543
<truncated after showing first 30 lines>
---------- Differences in tocs ----------
7c7
<     <ToCdown id="ToC_veh" t="89.00" lane="WE_1" lanePos="0.99"/>
---
>     <ToCdown id="ToC_veh" t="85.00" lane="WE_1" lanePos="0.99"/>

TEST FAILED on SUMO-mac : sumo ToCDevice incomplete_spec1 ( Last six runs Oct2019 )

---------- Differences in errors ----------
2a3,4
> sumo(35516,0x7fff8af33380) malloc: *** error for object 0x7f8242e2aad0: incorrect checksum for freed object - object was probably modified after being freed.
> *** set a breakpoint in malloc_error_break to debug

TEST FAILED on SUMO-mac : sumo ToCDevice incomplete_spec2 ( Last six runs Oct2019 )

---------- Differences in errors ----------
2a3,4
> sumo(35517,0x7fff8af33380) malloc: *** error for object 0x7fc11e58ac00: incorrect checksum for freed object - object was probably modified after being freed.
> *** set a breakpoint in malloc_error_break to debug

TEST FAILED on SUMO-mac : sumo ToCDevice invalid_vType ( Last six runs Oct2019 )

---------- Differences in errors ----------
2a3,4
> sumo(35527,0x7fff8af33380) malloc: *** error for object 0x7fa5c4d7be90: incorrect checksum for freed object - object was probably modified after being freed.
> *** set a breakpoint in malloc_error_break to debug

TEST FAILED on SUMO-mac : sumo ToCDevice invalid_vType_param ( Last six runs Oct2019 )

---------- Differences in errors ----------
2a3,4
> sumo(35528,0x7fff8af33380) malloc: *** error for object 0x7f9f06560df0: incorrect checksum for freed object - object was probably modified after being freed.
> *** set a breakpoint in malloc_error_break to debug

TEST FAILED on SUMO-mac : sumo binary ( Last six runs Oct2019 )

---------- Differences in errors ----------
0a1,2
> Error: Key not found.
> Quitting (on error).

TEST FAILED on SUMO-mac : sumo protobuf ( Last six runs Oct2019 )

---------- Differences in errors ----------
0a1,26
> Traceback (most recent call last):
>   File "/Users/sumo/clangMacOS/sumo/tools/xml/protobuf2xml.py", line 27, in <module>
>     import google.protobuf.descriptor
> ImportError: No module named google.protobuf.descriptor
> Traceback (most recent call last):
>   File "/Users/sumo/clangMacOS/sumo/tools/xml/xml2protobuf.py", line 199, in <module>
>     main()
>   File "/Users/sumo/clangMacOS/sumo/tools/xml/xml2protobuf.py", line 186, in main
>     attrFinder.xsdStruc._namedEnumerations, options.protodir, base)
>   File "/Users/sumo/clangMacOS/sumo/tools/xml/xml2protobuf.py", line 174, in generateProto
>     ["protoc", "%s.proto" % base, "--python_out=%s" % protodir])
>   File "/Library/Frameworks/Python.framework/Versions/2.7/lib/python2.7/subprocess.py", line 172, in call
>     return Popen(*popenargs, **kwargs).wait()
>   File "/Library/Frameworks/Python.framework/Versions/2.7/lib/python2.7/subprocess.py", line 394, in __init__
>     errread, errwrite)
>   File "/Library/Frameworks/Python.framework/Versions/2.7/lib/python2.7/subprocess.py", line 1047, in _execute_child
>     raise child_exception
> OSError: [Errno 2] No such file or directory
> Traceback (most recent call last):
>   File "/Users/sumo/clangMacOS/sumo/tests/../tests/complex/sumo/protobuf/runner.py", line 79, in <module>
>     connect(IN_PORT, OUT_PORT)
>   File "/Users/sumo/clangMacOS/sumo/tests/../tests/complex/sumo/protobuf/runner.py", line 35, in connect
>     i.connect(("localhost", inPort))
>   File "/Library/Frameworks/Python.framework/Versions/2.7/lib/python2.7/socket.py", line 228, in meth
>     return getattr(self._sock,name)(*args)
> socket.error: [Errno 61] Connection refused
---------- Differences in output ----------
3,7d2
< --- 
< +++ 
< -
< -<trajectories xmlns:xsi="http://www.w3.org/2001/XMLSchema-instance" xsi:noNamespaceSchemaLocation="http://sumo.dlr.de/xsd/amitran/trajectories.xsd" timeStepSize="1000">
< +<trajectories timeStepSize="1000">

TEST FAILED on SUMO-mac : traas api ( Last six runs Oct2019 )

---------- Differences in errors ----------
1,2c1,4
< Note: data/APITest.java uses unchecked or unsafe operations.
< Note: Recompile with -Xlint:unchecked for details.
---
> Traceback (most recent call last):
>   File "/Users/sumo/clangMacOS/sumo/tests/../tests/complex/traas/runner.py", line 35, in <module>
>     assert(os.path.exists(traasJar))
> AssertionError
---------- Differences in output ----------
1,77d0
< findRoute result stage:
<   gneE0
<   -gneE2
<   gneE2
< findIntermodalRoute result stages:
<   gneE0
<   gneE2
< Step 1.0, tlsPhase 0 (North-South)
< Step 2.0, tlsPhase 0 (North-South)
< Step 3.0, tlsPhase 0 (North-South)
< Step 4.0, tlsPhase 0 (North-South)
< Step 5.0, tlsPhase 0 (North-South)
< Step 6.0, tlsPhase 0 (North-South)
< Step 7.0, tlsPhase 0 (North-South)
< Step 8.0, tlsPhase 0 (North-South)
< Step 9.0, tlsPhase 0 (North-South)
< Step 10.0, tlsPhase 0 (North-South)
< Step 11.0, tlsPhase 0 (North-South)
< Step 12.0, tlsPhase 0 (North-South)
< Step 13.0, tlsPhase 0 (North-South)
< Step 14.0, tlsPhase 0 (North-South)
< Step 15.0, tlsPhase 0 (North-South)
< Step 16.0, tlsPhase 0 (North-South)
< Step 17.0, tlsPhase 0 (North-South)
< Step 18.0, tlsPhase 0 (North-South)
< Step 19.0, tlsPhase 0 (North-South)
< Step 20.0, tlsPhase 0 (North-South)
< Step 21.0, tlsPhase 0 (North-South)
< Step 22.0, tlsPhase 0 (North-South)
<truncated after showing first 30 lines>

TEST FAILED on SUMO-mac : traas multiclient ( Last six runs Oct2019 )

---------- Differences in errors ----------
0a1,4
> Traceback (most recent call last):
>   File "/Users/sumo/clangMacOS/sumo/tests/../tests/complex/traas/runner.py", line 35, in <module>
>     assert(os.path.exists(traasJar))
> AssertionError
---------- Differences in output ----------
1,4656d0
< Step 0.1, tlsPhase 0 (North-South)
< Step 0.1
< Step 0.2
< Step 0.3
< Step 0.4
< Step 0.5
< Step 0.6
< Step 0.7
< Step 0.8
< Step 0.9
< Step 1.0
< Step 1.1
< Step 1.2
< Step 1.3
< Step 1.4
< Step 1.5
< Step 1.6
< Step 1.7
< Step 1.8
< Step 1.9
< Step 2.0
< Step 2.1
< Step 2.2
< Step 2.3
< Step 2.4
< Step 2.5
< Step 2.6
< Step 2.7
< Step 2.8
<truncated after showing first 30 lines>

TEST FAILED on SUMO-mac : traas simple ( Last six runs Oct2019 )

---------- Differences in errors ----------
0a1,4
> Traceback (most recent call last):
>   File "/Users/sumo/clangMacOS/sumo/tests/../tests/complex/traas/runner.py", line 35, in <module>
>     assert(os.path.exists(traasJar))
> AssertionError
---------- Differences in output ----------
1,4643d0
< Step 0.1, tlsPhase 0 (North-South)
< Step 0.2, tlsPhase 0 (North-South)
< Step 0.3, tlsPhase 0 (North-South)
< Step 0.4, tlsPhase 0 (North-South)
< Step 0.5, tlsPhase 0 (North-South)
< Step 0.6, tlsPhase 0 (North-South)
< Step 0.7, tlsPhase 0 (North-South)
< Step 0.8, tlsPhase 0 (North-South)
< Step 0.9, tlsPhase 0 (North-South)
< Step 1.0, tlsPhase 0 (North-South)
< Step 1.1, tlsPhase 0 (North-South)
< Step 1.2, tlsPhase 0 (North-South)
< Step 1.3, tlsPhase 0 (North-South)
< Step 1.4, tlsPhase 0 (North-South)
< Step 1.5, tlsPhase 0 (North-South)
< Step 1.6, tlsPhase 0 (North-South)
< Step 1.7, tlsPhase 0 (North-South)
< Step 1.8, tlsPhase 0 (North-South)
< Step 1.9, tlsPhase 0 (North-South)
< Step 2.0, tlsPhase 0 (North-South)
< Step 2.1, tlsPhase 0 (North-South)
< Step 2.2, tlsPhase 0 (North-South)
< Step 2.3, tlsPhase 0 (North-South)
< Step 2.4, tlsPhase 0 (North-South)
< Step 2.5, tlsPhase 0 (North-South)
< Step 2.6, tlsPhase 0 (North-South)
< Step 2.7, tlsPhase 0 (North-South)
< Step 2.8, tlsPhase 0 (North-South)
< Step 2.9, tlsPhase 0 (North-South)
<truncated after showing first 30 lines>

TEST FAILED on SUMO-mac : traas subscription ( Last six runs Oct2019 )

---------- Differences in errors ----------
0a1,4
> Traceback (most recent call last):
>   File "/Users/sumo/clangMacOS/sumo/tests/../tests/complex/traas/runner.py", line 35, in <module>
>     assert(os.path.exists(traasJar))
> AssertionError
---------- Differences in output ----------
1,88d0
< Step: 0
< Subscription Departed vehicles: v0
< Step: 1
< Subscription Departed vehicles: v1
< Position of vehicle v0: x = 14.723087073160213 y = -4.8
< Speed of vehicle v0: 14.723087073160213
< Step: 2
< Subscription Departed vehicles: v2
< Position of vehicle v0: x = 29.446174146320427 y = -4.8
< Speed of vehicle v0: 14.723087073160213
< Position of vehicle v1: x = 13.033068701216276 y = -4.8
< Speed of vehicle v1: 13.033068701216276
< Step: 3
< Subscription Departed vehicles: v3
< Position of vehicle v0: x = 44.16926121948064 y = -4.8
< Speed of vehicle v0: 14.723087073160213
< Position of vehicle v1: x = 26.066137402432553 y = -4.8
< Speed of vehicle v1: 13.033068701216276
< Position of vehicle v2: x = 11.791085876520345 y = -4.8
< Speed of vehicle v2: 11.791085876520345
< Step: 4
< Subscription Departed vehicles: v4
< Position of vehicle v0: x = 58.892348292640854 y = -4.8
< Speed of vehicle v0: 14.723087073160213
< Position of vehicle v1: x = 39.099206103648825 y = -4.8
< Speed of vehicle v1: 13.033068701216276
< Position of vehicle v2: x = 23.872351142675807 y = -1.6
< Speed of vehicle v2: 12.081265266155462
< Position of vehicle v3: x = 10.290835876520346 y = -4.8
<truncated after showing first 30 lines>

TEST FAILED on SUMO-mac : traas webservice ( Last six runs Oct2019 )

---------- Differences in errors ----------
0a1,4
> Traceback (most recent call last):
>   File "/Users/sumo/clangMacOS/sumo/tests/../tests/complex/traas/webservice/runner.py", line 32, in <module>
>     assert(os.path.exists(traasJar))
> AssertionError
---------- Differences in output ----------
1,17d0
< Sumo Webservice is going to start
< WSDL wird geparst ...
< 
< 
< 
< Die WSDL und die zugehrigen Metadaten werden heruntergeladen
< 
< 
< Code wird generiert ...
< 
< 
< Code wird kompiliert ...
< 
< 
< Die generierten Artefakte werden in ./webservice.jar archiviert.
< 
< Benutzer user startet den Sumo Webservice Service

TEST FAILED on SUMO-mac : traci busySocket sumo-gui ( Last six runs Oct2019 )

---------- Differences in errors ----------
1,2c1,4
< Error: tcpip::Socket::accept() Unable to create listening socket: Address already in use
< Quitting (on error).
---
> FXApp::openDisplay: unable to open display :0.0
> Traceback (most recent call last):
>     raise FatalTraCIError("Could not connect in %s tries" % (numRetries + 1))
> traci.exceptions.FatalTraCIError: Could not connect in 11 tries
---------- Differences in output ----------
1,2d0
< Loading configuration... done.
< Loading configuration... done.

TEST FAILED on SUMO-mac : traci clientCloses sumo-gui ( Last six runs Oct2019 )

---------- Differences in errors ----------
0a1,4
> FXApp::openDisplay: unable to open display :0.0
> Traceback (most recent call last):
>     raise FatalTraCIError("Could not connect in %s tries" % (numRetries + 1))
> traci.exceptions.FatalTraCIError: Could not connect in 11 tries
---------- Differences in output ----------
3,21d2
< Loading configuration... done.
< Print ended at step 100
< ----------- SUMO end time is not given -----------
< Loading configuration... done.
< Print ended at step 100
< =========== empty routes in SUMO ===========
< ----------- SUMO end time is smaller than TraCI's -----------
< Loading configuration... done.
< Print ended at step 100
< ----------- SUMO end time is not given -----------
< Loading configuration... done.
< Print ended at step 100
< =========== vehicle leaves before TraCI ends ===========
< ----------- SUMO end time is smaller than TraCI's -----------
< Loading configuration... done.
< Print ended at step 100
< ----------- SUMO end time is not given -----------
< Loading configuration... done.
< Print ended at step 100

TEST FAILED on SUMO-mac : traci closingOutput sumo-gui ( Last six runs Oct2019 )

---------- Differences in errors ----------
0a1,34
> FXApp::openDisplay: unable to open display :0.0
> UserWarning: Could not connect to TraCI server using port 52955. Retrying with different port.
>   warnings.warn("Could not connect to TraCI server using port %s. Retrying with different port." % sumoPort)
> FXApp::openDisplay: unable to open display :0.0
> UserWarning: Could not connect to TraCI server using port 52962. Retrying with different port.
>   warnings.warn("Could not connect to TraCI server using port %s. Retrying with different port." % sumoPort)
> FXApp::openDisplay: unable to open display :0.0
> UserWarning: Could not connect to TraCI server using port 52968. Retrying with different port.
>   warnings.warn("Could not connect to TraCI server using port %s. Retrying with different port." % sumoPort)
> FXApp::openDisplay: unable to open display :0.0
> UserWarning: Could not connect to TraCI server using port 52976. Retrying with different port.
>   warnings.warn("Could not connect to TraCI server using port %s. Retrying with different port." % sumoPort)
> FXApp::openDisplay: unable to open display :0.0
> UserWarning: Could not connect to TraCI server using port 52983. Retrying with different port.
>   warnings.warn("Could not connect to TraCI server using port %s. Retrying with different port." % sumoPort)
> FXApp::openDisplay: unable to open display :0.0
> UserWarning: Could not connect to TraCI server using port 52989. Retrying with different port.
>   warnings.warn("Could not connect to TraCI server using port %s. Retrying with different port." % sumoPort)
> FXApp::openDisplay: unable to open display :0.0
> UserWarning: Could not connect to TraCI server using port 52994. Retrying with different port.
>   warnings.warn("Could not connect to TraCI server using port %s. Retrying with different port." % sumoPort)
> FXApp::openDisplay: unable to open display :0.0
> UserWarning: Could not connect to TraCI server using port 52999. Retrying with different port.
>   warnings.warn("Could not connect to TraCI server using port %s. Retrying with different port." % sumoPort)
> FXApp::openDisplay: unable to open display :0.0
> UserWarning: Could not connect to TraCI server using port 53005. Retrying with different port.
>   warnings.warn("Could not connect to TraCI server using port %s. Retrying with different port." % sumoPort)
> FXApp::openDisplay: unable to open display :0.0
> UserWarning: Could not connect to TraCI server using port 53010. Retrying with different port.
<truncated after showing first 30 lines>
---------- Differences in output ----------
1d0
< Loading configuration... done.
---------- Missing result in state ----------
<?xml version="1.0" encoding="UTF-8"?>


<netstate xmlns:xsi="http://www.w3.org/2001/XMLSchema-instance" xsi:noNamespaceSchemaLocation="http://sumo.dlr.de/xsd/netstate_file.xsd">
    <timestep time="0.00">
        <edge id="2fi">
            <lane id="2fi_0">
                <vehicle id="horiz" pos="5.10" speed="0.00"/>
            </lane>
        </edge>
    </timestep>
    <timestep time="1.00">
        <edge id="2fi">
            <lane id="2fi_0">
                <vehicle id="horiz" pos="6.53" speed="1.43"/>
            </lane>
        </edge>
    </timestep>
    <timestep time="2.00">
        <edge id="2fi">
            <lane id="2fi_0">
                <vehicle id="horiz" pos="10.57" speed="4.03"/>
            </lane>
        </edge>
    </timestep>
    <timestep time="3.00">
        <edge id="2fi">
            <lane id="2fi_0">
                <vehicle id="horiz" pos="16.77" speed="6.21"/>
            </lane>
<truncated after showing first 30 lines>
---------- Missing result in tripinfo ----------
<?xml version="1.0" encoding="UTF-8"?>


<tripinfos xmlns:xsi="http://www.w3.org/2001/XMLSchema-instance" xsi:noNamespaceSchemaLocation="http://sumo.dlr.de/xsd/tripinfo_file.xsd">
</tripinfos>

TEST FAILED on SUMO-mac : traci multipleConnections basic sumo-gui ( Last six runs Oct2019 )

---------- Differences in errors ----------
0a1,136
> FXApp::openDisplay: unable to open display :0.0
> Process Process-1:
> Traceback (most recent call last):
>     raise FatalTraCIError("Could not connect in %s tries" % (numRetries + 1))
> FatalTraCIError: Could not connect in 11 tries
> Process Process-2:
> Traceback (most recent call last):
>     raise FatalTraCIError("Could not connect in %s tries" % (numRetries + 1))
> FatalTraCIError: Could not connect in 11 tries
> FXApp::openDisplay: unable to open display :0.0
> Process Process-3:
> Process Process-4:
> Traceback (most recent call last):
>     raise FatalTraCIError("Could not connect in %s tries" % (numRetries + 1))
> FatalTraCIError: Could not connect in 11 tries
>     _connections[label] = connect(port, numRetries, host, proc)
>   File "/Users/sumo/clangMacOS/sumo/tools/traci/main.py", line 99, in connect
>     raise FatalTraCIError("Could not connect in %s tries" % (numRetries + 1))
> FatalTraCIError: Could not connect in 11 tries
> FXApp::openDisplay: unable to open display :0.0
> Process Process-5:
> Traceback (most recent call last):
>     raise FatalTraCIError("Could not connect in %s tries" % (numRetries + 1))
> FatalTraCIError: Could not connect in 11 tries
> Process Process-6:
> Traceback (most recent call last):
>     raise FatalTraCIError("Could not connect in %s tries" % (numRetries + 1))
> FatalTraCIError: Could not connect in 11 tries
> Process Process-7:
<truncated after showing first 30 lines>
---------- Differences in output ----------
4,6d3
< Loading configuration... done.
< Process 1 ended at step 99
< Process 2 ended at step 99
8,10d4
< Loading configuration... done.
< Process 1 ended at step 99
< Process 2 ended at step 99
13,18d6
< Loading configuration... done.
< Process 1 ended at step 99
< Process 2 ended at step 99
< Process 3 ended at step 99
< Process 4 ended at step 99
< Process 5 ended at step 99
20,25d7
< Loading configuration... done.
< Process 1 ended at step 99
< Process 2 ended at step 99
< Process 3 ended at step 99
< Process 4 ended at step 99
< Process 5 ended at step 99
29,31d10
< Loading configuration... done.
< Process 1 ended at step 99
< Process 2 ended at step 99
33,35d11
< Loading configuration... done.
< Process 1 ended at step 99
< Process 2 ended at step 99
<truncated after showing first 30 lines>

TEST FAILED on SUMO-mac : traci pythonApi gui ( Last six runs Oct2019 )

---------- Differences in errors ----------
0a1,34
> FXApp::openDisplay: unable to open display :0.0
> UserWarning: Could not connect to TraCI server using port 52293. Retrying with different port.
>   warnings.warn("Could not connect to TraCI server using port %s. Retrying with different port." % sumoPort)
> FXApp::openDisplay: unable to open display :0.0
> UserWarning: Could not connect to TraCI server using port 52300. Retrying with different port.
>   warnings.warn("Could not connect to TraCI server using port %s. Retrying with different port." % sumoPort)
> FXApp::openDisplay: unable to open display :0.0
> UserWarning: Could not connect to TraCI server using port 52310. Retrying with different port.
>   warnings.warn("Could not connect to TraCI server using port %s. Retrying with different port." % sumoPort)
> FXApp::openDisplay: unable to open display :0.0
> UserWarning: Could not connect to TraCI server using port 52317. Retrying with different port.
>   warnings.warn("Could not connect to TraCI server using port %s. Retrying with different port." % sumoPort)
> FXApp::openDisplay: unable to open display :0.0
> UserWarning: Could not connect to TraCI server using port 52325. Retrying with different port.
>   warnings.warn("Could not connect to TraCI server using port %s. Retrying with different port." % sumoPort)
> FXApp::openDisplay: unable to open display :0.0
> UserWarning: Could not connect to TraCI server using port 52336. Retrying with different port.
>   warnings.warn("Could not connect to TraCI server using port %s. Retrying with different port." % sumoPort)
> FXApp::openDisplay: unable to open display :0.0
> UserWarning: Could not connect to TraCI server using port 52343. Retrying with different port.
>   warnings.warn("Could not connect to TraCI server using port %s. Retrying with different port." % sumoPort)
> FXApp::openDisplay: unable to open display :0.0
> UserWarning: Could not connect to TraCI server using port 52353. Retrying with different port.
>   warnings.warn("Could not connect to TraCI server using port %s. Retrying with different port." % sumoPort)
> FXApp::openDisplay: unable to open display :0.0
> UserWarning: Could not connect to TraCI server using port 52361. Retrying with different port.
>   warnings.warn("Could not connect to TraCI server using port %s. Retrying with different port." % sumoPort)
> FXApp::openDisplay: unable to open display :0.0
> UserWarning: Could not connect to TraCI server using port 52368. Retrying with different port.
<truncated after showing first 30 lines>
---------- Differences in output ----------
1,20d0
< Loading configuration... done.
< step 0
< step 1
< step 2
< hasGUI True
< views ('View #0',)
< examining View #0
< zoom 100.0
< offset (500.0, 500.0)
< schema standard
< visible boundary ((-457.2093023255814, -4.0), (1457.2093023255813, 1004.0))
< has view View #0 True
< has view 'foo' False
< {0: ('View #0',)}
< step 3
< {0: ('View #0',)}
< step 4
< {0: ('View #0',)}
< step 5
< {0: ('View #0',)}
---------- Missing result in png ----------
PNG


IHDRߊ	IDATxU@d օWy_ɧED}݈ڥąFĠEz35=hK7
[Ukz'                                                                                                                        
                                                                                                                        ffzU{x 
ulkSO8+tq/ArY.	:x @ @ @ @ @ @ @ @ @ @ @ @ @ @ @ @ @ @ @ @ @ @ @ @ @ @ @ @ @ @ @ @ @ @ @ @ @ @ @ @ @ @ @ @ @ @ @ @ @ @ @ @ @ @ @ @ @ @ @ @ @ @ @ @ @ @ @ @ @ @ @ @ @ @ @ @ @ @ @ @ @ @ @ @ @ @ @ @ @ @ @ @ @ @ @ @ @ @ @ @ @ @ @ @ @ @ @ @ @ @ @ @
 @ @ @ @ @ @ @ @ @ @ @ @ @ @ @ @ @ @ @ @ @ @ @ @ @ @ @ @ @ @ @ @ @ @ @ @ @ @ @ @ @ @ @ @ @ @ @ @ @ @ @ @ @ @ @ @ @ @ @ @ @ @ @ @ @ @ @ @ @ @ @ @ @ @ @ @ @ @ @ @ @ @ @ @ @ @ @ @ @ @ @ @ @ @ @ @ @ @ @ @ @ @ @ @ @ @ @ @ @ @ @ @ @ @ }/}w>#nG% 
  po̚9싹<3{fΏc̓oYb|}63_df\	Z|>{'k}{83{ߟ/
Z_~Xk{|p{=ãg/捙ytyz6ef歙b`ѥ{}8Pm5{_Z߼i*=/m7ƃ{23?g݋glt[ꙠVj߭죽;'ϵ73_{{;gӣ\Cx=n{h?[+Aw`?pV  p_ޮ-s%3׻M8= @ K
7IENDB`

TEST FAILED on SUMO-mac : traci pythonApi load ( Last six runs Oct2019 )

---------- Differences in errors ----------
2a3,36
> FXApp::openDisplay: unable to open display :0.0
> UserWarning: Could not connect to TraCI server using port 52463. Retrying with different port.
>   warnings.warn("Could not connect to TraCI server using port %s. Retrying with different port." % sumoPort)
> FXApp::openDisplay: unable to open display :0.0
> UserWarning: Could not connect to TraCI server using port 52475. Retrying with different port.
>   warnings.warn("Could not connect to TraCI server using port %s. Retrying with different port." % sumoPort)
> FXApp::openDisplay: unable to open display :0.0
> UserWarning: Could not connect to TraCI server using port 52482. Retrying with different port.
>   warnings.warn("Could not connect to TraCI server using port %s. Retrying with different port." % sumoPort)
> FXApp::openDisplay: unable to open display :0.0
> UserWarning: Could not connect to TraCI server using port 52492. Retrying with different port.
>   warnings.warn("Could not connect to TraCI server using port %s. Retrying with different port." % sumoPort)
> FXApp::openDisplay: unable to open display :0.0
> UserWarning: Could not connect to TraCI server using port 52498. Retrying with different port.
>   warnings.warn("Could not connect to TraCI server using port %s. Retrying with different port." % sumoPort)
> FXApp::openDisplay: unable to open display :0.0
> UserWarning: Could not connect to TraCI server using port 52509. Retrying with different port.
>   warnings.warn("Could not connect to TraCI server using port %s. Retrying with different port." % sumoPort)
> FXApp::openDisplay: unable to open display :0.0
> UserWarning: Could not connect to TraCI server using port 52517. Retrying with different port.
>   warnings.warn("Could not connect to TraCI server using port %s. Retrying with different port." % sumoPort)
> FXApp::openDisplay: unable to open display :0.0
> UserWarning: Could not connect to TraCI server using port 52524. Retrying with different port.
>   warnings.warn("Could not connect to TraCI server using port %s. Retrying with different port." % sumoPort)
> FXApp::openDisplay: unable to open display :0.0
> UserWarning: Could not connect to TraCI server using port 52535. Retrying with different port.
>   warnings.warn("Could not connect to TraCI server using port %s. Retrying with different port." % sumoPort)
> FXApp::openDisplay: unable to open display :0.0
> UserWarning: Could not connect to TraCI server using port 52543. Retrying with different port.
<truncated after showing first 30 lines>
---------- Differences in output ----------
2,368d1
< Loading configuration... done.
< Loading configuration... done.
< step=1 departed=('horiz',)
< step=2 departed=()
< step=3 departed=()
< reloading
< step=1 departed=('horiz',)
< step=2 departed=()
< step=3 departed=()
< step=4 departed=()
< step=5 departed=()
< step=6 departed=()
< step=7 departed=()
< step=8 departed=()
< step=9 departed=()
< step=10 departed=()
< step=11 departed=()
< step=12 departed=()
< step=13 departed=()
< step=14 departed=()
< step=15 departed=()
< step=16 departed=()
< step=17 departed=()
< step=18 departed=()
< step=19 departed=()
< step=20 departed=()
< step=21 departed=()
< step=22 departed=()
< step=23 departed=()
<truncated after showing first 30 lines>
---------- Missing result in log ----------
***Starting server on port <PORT> ***
Loading net-file from 'input_net.net.xml'... done ((TIME)).
Loading additional-files from 'input_additional2.add.xml'... done ((TIME)).
Loading done.
Simulation started with time: 0.00
Simulation ended at time: 4.00
Reason: TraCI issued load command.

TEST FAILED on SUMO-mac : traci pythonApi polygon_dynamics_gui ( Last six runs Oct2019 )

---------- Differences in errors ----------
0a1,34
> FXApp::openDisplay: unable to open display :0.0
> UserWarning: Could not connect to TraCI server using port 52377. Retrying with different port.
>   warnings.warn("Could not connect to TraCI server using port %s. Retrying with different port." % sumoPort)
> FXApp::openDisplay: unable to open display :0.0
> UserWarning: Could not connect to TraCI server using port 52391. Retrying with different port.
>   warnings.warn("Could not connect to TraCI server using port %s. Retrying with different port." % sumoPort)
> FXApp::openDisplay: unable to open display :0.0
> UserWarning: Could not connect to TraCI server using port 52400. Retrying with different port.
>   warnings.warn("Could not connect to TraCI server using port %s. Retrying with different port." % sumoPort)
> FXApp::openDisplay: unable to open display :0.0
> UserWarning: Could not connect to TraCI server using port 52407. Retrying with different port.
>   warnings.warn("Could not connect to TraCI server using port %s. Retrying with different port." % sumoPort)
> FXApp::openDisplay: unable to open display :0.0
> UserWarning: Could not connect to TraCI server using port 52417. Retrying with different port.
>   warnings.warn("Could not connect to TraCI server using port %s. Retrying with different port." % sumoPort)
> FXApp::openDisplay: unable to open display :0.0
> UserWarning: Could not connect to TraCI server using port 52423. Retrying with different port.
>   warnings.warn("Could not connect to TraCI server using port %s. Retrying with different port." % sumoPort)
> FXApp::openDisplay: unable to open display :0.0
> UserWarning: Could not connect to TraCI server using port 52432. Retrying with different port.
>   warnings.warn("Could not connect to TraCI server using port %s. Retrying with different port." % sumoPort)
> FXApp::openDisplay: unable to open display :0.0
> UserWarning: Could not connect to TraCI server using port 52442. Retrying with different port.
>   warnings.warn("Could not connect to TraCI server using port %s. Retrying with different port." % sumoPort)
> FXApp::openDisplay: unable to open display :0.0
> UserWarning: Could not connect to TraCI server using port 52450. Retrying with different port.
>   warnings.warn("Could not connect to TraCI server using port %s. Retrying with different port." % sumoPort)
> FXApp::openDisplay: unable to open display :0.0
> UserWarning: Could not connect to TraCI server using port 52458. Retrying with different port.
<truncated after showing first 30 lines>
---------- Differences in output ----------
1,257d0
< Loading configuration... done.
< step 0
< step 1
< step 2
< adding poly0
< polygons ('poly0',)
< polygon count 1
< # examining poly0
< shape ((960.0, 510.0), (960.0, 550.0), (1000.0, 550.0), (1000.0, 510.0))
< type test
< color (100, 200, 0, 255)
< filled True
< step 3
< step 4
< step 5
< # (1) Adding underspecified dynamics...
< Caught TraCIException
< # (2) Adding malformed dynamics 1 ...
< Caught TraCIException
< # (3) Adding malformed dynamics 2 ...
< Caught TraCIException
< # (4) Adding malformed dynamics 3 ...
< Caught TraCIException
< # (5) Adding malformed dynamics 4 ...
< Caught TraCIException
< # (6) Adding malformed dynamics 5 ...
< Caught TraCIException
< # examining poly0
< shape ((960.0, 510.0), (960.0, 550.0), (1000.0, 550.0), (1000.0, 510.0))
<truncated after showing first 30 lines>

TEST FAILED on SUMO-mac : traci repeatedConnection sumo-gui ( Last six runs Oct2019 )

---------- Differences in errors ----------
0a1,4
> FXApp::openDisplay: unable to open display :0.0
> Traceback (most recent call last):
>     raise FatalTraCIError("Could not connect in %s tries" % (numRetries + 1))
> traci.exceptions.FatalTraCIError: Could not connect in 11 tries
---------- Differences in output ----------
2d1
< Loading configuration... done.
4,62d2
< Print ended at step 100
< Loading configuration... done.
<  Run 1
< Print ended at step 100
< Loading configuration... done.
<  Run 2
< Print ended at step 100
< Loading configuration... done.
<  Run 3
< Print ended at step 100
< Loading configuration... done.
<  Run 4
< Print ended at step 100
< Loading configuration... done.
<  Run 5
< Print ended at step 100
< Loading configuration... done.
<  Run 6
< Print ended at step 100
< Loading configuration... done.
<  Run 7
< Print ended at step 100
< Loading configuration... done.
<  Run 8
< Print ended at step 100
< Loading configuration... done.
<  Run 9
<truncated after showing first 30 lines>

TEST FAILED on SUMO-mac : tutorial city_mobil ( Last six runs Oct2019 )

---------- Differences in output ----------
4c4
< waiting time (max, mean, dev): True True True
---
> waiting time (max, mean, dev): False True False
13c13
< ('footmainout', 'footmain0to1') True True True
---
> ('footmainout', 'footmain0to1') True True False
19,20c19,20
< ('footmainout', 'footmain6to7') True True True
< ('footmainout', 'footmain7to8') True True True
---
> ('footmainout', 'footmain6to7') True True False
> ('footmainout', 'footmain7to8') True True False
22c22
< waiting time (max, mean, dev): True True True
---
> waiting time (max, mean, dev): False True False
31c31
< ('footmainout', 'footmain0to1') True True True
---
> ('footmainout', 'footmain0to1') True True False
37,38c37,38
< ('footmainout', 'footmain6to7') True True True
< ('footmainout', 'footmain7to8') True True True
---
> ('footmainout', 'footmain6to7') True True False
> ('footmainout', 'footmain7to8') True True False

Detailed information for the tests that had known bugs:

TEST had known bugs (bug 1691 (NONEXISTENT)) on SUMO-mac : netconvert dlr-navteq_roundtrip ( Last six runs Oct2019 )

Failed to open URL 'https://sumo.dlr.de/trac.wsgi/ticket/1691?format=tab': HTTP Error 404: Not Found.

Please make sure that bug 1691 exists
and that the configuration entry 'bug_system_location' points to the correct trac instance.
The current value is 'https://sumo.dlr.de/trac.wsgi/'.
(This bug was triggered by text found in file 'net' matching '.*')
---------- Differences in net ----------
4c4
< <net version="1.1" junctionCornerDetail="5" limitTurnSpeed="5.50" xmlns:xsi="http://www.w3.org/2001/XMLSchema-instance" xsi:noNamespaceSchemaLocation="http://sumo.dlr.de/xsd/net_file.xsd">
---
> <net version="1.3" junctionCornerDetail="5" limitTurnSpeed="5.50" xmlns:xsi="http://www.w3.org/2001/XMLSchema-instance" xsi:noNamespaceSchemaLocation="http://sumo.dlr.de/xsd/net_file.xsd">
2768c2768
<     <connection from="-26816553" to="26816541" fromLane="0" toLane="0" via=":294168098_5_0" dir="L" state="="/>
---
>     <connection from="-26816553" to="26816541" fromLane="0" toLane="0" via=":294168098_5_0" dir="l" state="="/>
2975c2975
<     <connection from="27445116" to="27445117" fromLane="0" toLane="0" via=":294169338_0_0" dir="s" state="="/>
---
>     <connection from="27445116" to="27445117" fromLane="0" toLane="0" via=":294169338_0_0" dir="R" state="="/>
3216c3216
<     <connection from=":294168098_5" to="26816541" fromLane="0" toLane="0" dir="L" state="M"/>
---
>     <connection from=":294168098_5" to="26816541" fromLane="0" toLane="0" dir="l" state="M"/>
3241c3241
<     <connection from=":294169338_0" to="27445117" fromLane="0" toLane="0" dir="s" state="M"/>
---
>     <connection from=":294169338_0" to="27445117" fromLane="0" toLane="0" dir="R" state="M"/>

TEST had known bugs (bug 1691 (NONEXISTENT)) on SUMO-mac : netconvert matsim_roundtrip ( Last six runs Oct2019 )

Failed to open URL 'https://sumo.dlr.de/trac.wsgi/ticket/1691?format=tab': HTTP Error 404: Not Found.

Please make sure that bug 1691 exists
and that the configuration entry 'bug_system_location' points to the correct trac instance.
The current value is 'https://sumo.dlr.de/trac.wsgi/'.
(This bug was triggered by text found in file 'net' matching '.*')
---------- Differences in net ----------
4c4
< <net version="1.1" junctionCornerDetail="5" limitTurnSpeed="5.50" xmlns:xsi="http://www.w3.org/2001/XMLSchema-instance" xsi:noNamespaceSchemaLocation="http://sumo.dlr.de/xsd/net_file.xsd">
---
> <net version="1.3" junctionCornerDetail="5" limitTurnSpeed="5.50" xmlns:xsi="http://www.w3.org/2001/XMLSchema-instance" xsi:noNamespaceSchemaLocation="http://sumo.dlr.de/xsd/net_file.xsd">
880c880
<         <lane id=":294830184_7_0" index="0" speed="5.56" length="14.38" shape="915.07,462.77 918.06,460.17 921.14,459.20 924.29,459.87 927.52,462.17"/>
---
>         <lane id=":294830184_7_0" index="0" speed="5.56" length="13.52" shape="915.07,462.77 917.74,460.95 921.19,460.22 924.69,460.61 927.52,462.17"/>
3708c3708
<     <connection from="-26004787#2" to="26004966#2" fromLane="0" toLane="0" via=":283722837_12_0" dir="s" state="="/>
---
>     <connection from="-26004787#2" to="26004966#2" fromLane="0" toLane="0" via=":283722837_12_0" dir="R" state="="/>
3724c3724
<     <connection from="-26004868#0" to="-5198585#7" fromLane="0" toLane="0" via=":283719736_13_0" dir="R" state="m"/>
---
>     <connection from="-26004868#0" to="-5198585#7" fromLane="0" toLane="0" via=":283719736_13_0" dir="r" state="m"/>
3747c3747
<     <connection from="-26816553" to="-26816413#1" fromLane="0" toLane="0" via=":294168098_4_0" dir="R" state="="/>
---
>     <connection from="-26816553" to="-26816413#1" fromLane="0" toLane="0" via=":294168098_4_0" dir="r" state="="/>
4015c4015
<     <connection from="26816413#1" to="26816553" fromLane="0" toLane="0" via=":294168098_1_0" dir="L" state="="/>
---
>     <connection from="26816413#1" to="26816553" fromLane="0" toLane="0" via=":294168098_1_0" dir="l" state="="/>
4023c4023
<     <connection from="26816590#0" to="26816590#1" fromLane="0" toLane="0" via=":294169338_0_0" dir="s" state="="/>
---
>     <connection from="26816590#0" to="26816590#1" fromLane="0" toLane="0" via=":294169338_0_0" dir="R" state="="/>
4037c4037
<     <connection from="26843038#0" to="26843038#1" fromLane="0" toLane="0" via=":294830184_7_0" dir="L" state="="/>
<truncated after showing first 30 lines>

TEST had known bugs (see #254) on SUMO-mac : sumo output one_vehicle ( Last six runs Oct2019 )

different outputs from detectors which should detect the same
(This bug was triggered by text found in file 'output' matching 'failed')
---------- Differences in output ----------
10c10
< success 0.1 ['--step-length', '.1', '--end', '100'] ['3/1to2/1_0']
---
> failed 0.1 ['--step-length', '.1', '--end', '100'] 3/1to2/1_0 (71.3, 71.4) [('e2', 10.0), ('e3', -1.0), ('edge', -1.0), ('lane', -1.0)]
12c12
< success 1 ['--step-length', '.1', '--end', '100'] ['3/1to2/1_0']
---
> failed 1 ['--step-length', '.1', '--end', '100'] 3/1to2/1_0 (72.0, 73.0) [('e2', 10.0), ('e3', -1.0), ('edge', -1.0), ('lane', -1.0)]
14c14
< success 10 ['--step-length', '.1', '--end', '100'] ['3/1to2/1_0']
---
> failed 10 ['--step-length', '.1', '--end', '100'] 3/1to2/1_0 (80.0, 90.0) [('e2', 10.0), ('e3', -1.0), ('edge', -1.0), ('lane', -1.0)]
18c18
< success 0.1 ['--step-length', '.1', '--end', '1000'] ['3/1to2/1_0']
---
> failed 0.1 ['--step-length', '.1', '--end', '1000'] 3/1to2/1_0 (71.3, 71.4) [('e2', 10.0), ('e3', -1.0), ('edge', -1.0), ('lane', -1.0)]
20c20
< success 1 ['--step-length', '.1', '--end', '1000'] ['3/1to2/1_0']
---
> failed 1 ['--step-length', '.1', '--end', '1000'] 3/1to2/1_0 (72.0, 73.0) [('e2', 10.0), ('e3', -1.0), ('edge', -1.0), ('lane', -1.0)]
22c22
< success 10 ['--step-length', '.1', '--end', '1000'] ['3/1to2/1_0']
---
> failed 10 ['--step-length', '.1', '--end', '1000'] 3/1to2/1_0 (80.0, 90.0) [('e2', 10.0), ('e3', -1.0), ('edge', -1.0), ('lane', -1.0)]
24c24
< success 100 ['--step-length', '.1', '--end', '1000'] ['3/1to2/1_0']
---
> failed 100 ['--step-length', '.1', '--end', '1000'] 3/1to2/1_0 (100.0, 200.0) [('e1', -1.0), ('e2', 10.0), ('e3', -1.0), ('edge', -1.0), ('lane', -1.0)]
34c34
< success 0.1 ['--step-length', '1', '--end', '100'] ['3/1to2/1_0']
<truncated after showing first 30 lines>

TEST had known bugs (see #254) on SUMO-mac : sumo output teleport ( Last six runs Oct2019 )

different outputs from detectors which should detect the same
(This bug was triggered by text found in file 'output' matching 'failed')
---------- Differences in output ----------
2c2
< success ['--step-length', '.1', '--end', '51'] ['2/1to1/1_0']
---
> success 0.1 ['--step-length', '.1', '--end', '51'] ['2/1to1/1_0']
4c4
< success ['--step-length', '.1', '--end', '51'] ['2/1to1/1_0', '1/1to0/1_0']
---
> success 0.1 ['--step-length', '.1', '--end', '51'] ['2/1to1/1_0', '1/1to0/1_0']
6c6
< success ['--step-length', '.1', '--end', '51'] ['2/1to1/1_0']
---
> success 1 ['--step-length', '.1', '--end', '51'] ['2/1to1/1_0']
8c8
< success ['--step-length', '.1', '--end', '51'] ['2/1to1/1_0', '1/1to0/1_0']
---
> success 1 ['--step-length', '.1', '--end', '51'] ['2/1to1/1_0', '1/1to0/1_0']
10c10
< success ['--step-length', '.1', '--end', '51'] ['2/1to1/1_0']
---
> success 10 ['--step-length', '.1', '--end', '51'] ['2/1to1/1_0']
12c12
< success ['--step-length', '.1', '--end', '51'] ['2/1to1/1_0', '1/1to0/1_0']
---
> success 10 ['--step-length', '.1', '--end', '51'] ['2/1to1/1_0', '1/1to0/1_0']
14c14
< success ['--step-length', '.1', '--end', '51'] ['2/1to1/1_0']
---
> success 100 ['--step-length', '.1', '--end', '51'] ['2/1to1/1_0']
16c16
< success ['--step-length', '.1', '--end', '51'] ['2/1to1/1_0', '1/1to0/1_0']
<truncated after showing first 30 lines>

TEST had known bugs (see #254) on SUMO-mac : sumo output teleport_multihop ( Last six runs Oct2019 )

different outputs from detectors which should detect the same
(This bug was triggered by text found in file 'output' matching 'failed')
---------- Differences in output ----------
34c34
< success 0.1 ['--step-length', '.1', '--end', '1000'] 2/1to1/1_0 (230.0, 230.1) [('e2', 9.99), ('e3', 10.0), ('edge', 9.99), ('lane', 9.99)]
---
> failed 0.1 ['--step-length', '.1', '--end', '1000'] 2/1to1/1_0 (149.0, 149.1) [('e2', 9.99), ('e3', 10.0), ('edge', 10.0), ('lane', 10.0)]
36c36
< success 0.1 ['--step-length', '.1', '--end', '1000'] 1/1to0/1_0 (148.1, 148.2) [('e2', 9.99), ('e3', 10.0), ('edge', 9.99), ('lane', 9.99)]
---
> failed 0.1 ['--step-length', '.1', '--end', '1000'] 2/1to1/1_0 (149.0, 149.1) [('e2', 9.99), ('e3', 10.0), ('edge', 10.0), ('lane', 10.0)]
38c38
< success 1 ['--step-length', '.1', '--end', '1000'] 2/1to1/1_0 (230.0, 231.0) [('e2', 9.99), ('e3', 10.0), ('edge', 9.99), ('lane', 9.99)]
---
> failed 1 ['--step-length', '.1', '--end', '1000'] 2/1to1/1_0 (149.0, 150.0) [('e2', 9.93), ('e3', 10.0), ('edge', 10.0), ('lane', 10.0)]
40c40
< success 1 ['--step-length', '.1', '--end', '1000'] 1/1to0/1_0 (148.0, 149.0) [('e2', 9.91), ('e3', 10.0), ('edge', 9.91), ('lane', 9.91)]
---
> failed 1 ['--step-length', '.1', '--end', '1000'] 2/1to1/1_0 (149.0, 150.0) [('e2', 9.93), ('e3', 10.0), ('edge', 10.0), ('lane', 10.0)]
42c42
< success 10 ['--step-length', '.1', '--end', '1000'] 2/1to1/1_0 (230.0, 240.0) [('e2', 9.42), ('e3', 9.9), ('edge', 9.42), ('lane', 9.42)]
---
> failed 10 ['--step-length', '.1', '--end', '1000'] 2/1to1/1_0 (140.0, 150.0) [('e2', 9.99), ('e3', 10.0), ('edge', 10.0), ('lane', 10.0)]
44c44
< success 10 ['--step-length', '.1', '--end', '1000'] 1/1to0/1_0 (140.0, 150.0) [('e2', 9.96), ('e3', 9.99), ('edge', 9.96), ('lane', 9.96)]
---
> failed 10 ['--step-length', '.1', '--end', '1000'] 2/1to1/1_0 (140.0, 150.0) [('e2', 9.99), ('e3', 10.0), ('edge', 10.0), ('lane', 10.0)]
46c46
< success 100 ['--step-length', '.1', '--end', '1000'] 2/1to1/1_0 (200.0, 300.0) [('e1', 10.0), ('e2', 9.22), ('e3', 5.71), ('edge', 9.22), ('lane', 9.22)]
---
> failed 100 ['--step-length', '.1', '--end', '1000'] 2/1to1/1_0 (100.0, 200.0) [('e1', 10.0), ('e2', 7.95), ('e3', 10.0), ('edge', 10.0), ('lane', 10.0)]
48c48
< success 100 ['--step-length', '.1', '--end', '1000'] 1/1to0/1_0 (100.0, 200.0) [('e1', 9.53), ('e2', 5.82), ('e3', 6.93), ('edge', 5.82), ('lane', 5.82)]
<truncated after showing first 30 lines>

TEST had known bugs (see #254) on SUMO-mac : sumo output teleport_multihop_newDefaults ( Last six runs Oct2019 )

different outputs from detectors which should detect the same
(This bug was triggered by text found in file 'output' matching 'failed')
---------- Differences in output ----------
18c18
< success 0.1 ['--step-length', '.1', '--end', '100'] ['2/1to1/1_0']
---
> failed 0.1 ['--step-length', '.1', '--end', '100'] 2/1to1/1_0 (76.2, 76.3) [('e2', 10.49), ('e3', 10.35), ('edge', 10.49), ('lane', 10.49)]
20c20
< success 0.1 ['--step-length', '.1', '--end', '100'] ['2/1to1/1_0', '1/1to0/1_0']
---
> failed 0.1 ['--step-length', '.1', '--end', '100'] 2/1to1/1_0 (76.2, 76.3) [('e2', 10.49), ('e3', 10.35), ('edge', 10.49), ('lane', 10.49)]
22c22
< success 1 ['--step-length', '.1', '--end', '100'] ['2/1to1/1_0']
---
> failed 1 ['--step-length', '.1', '--end', '100'] 2/1to1/1_0 (76.0, 77.0) [('e2', 10.39), ('e3', 10.35), ('edge', 10.39), ('lane', 10.39)]
24c24
< success 1 ['--step-length', '.1', '--end', '100'] ['2/1to1/1_0', '1/1to0/1_0']
---
> failed 1 ['--step-length', '.1', '--end', '100'] 2/1to1/1_0 (76.0, 77.0) [('e2', 10.39), ('e3', 10.35), ('edge', 10.39), ('lane', 10.39)]
26c26
< success 10 ['--step-length', '.1', '--end', '100'] ['2/1to1/1_0']
---
> failed 10 ['--step-length', '.1', '--end', '100'] 2/1to1/1_0 (70.0, 80.0) [('e2', 10.42), ('e3', 10.25), ('edge', 10.42), ('lane', 10.42)]
28c28
< success 10 ['--step-length', '.1', '--end', '100'] ['2/1to1/1_0', '1/1to0/1_0']
---
> failed 10 ['--step-length', '.1', '--end', '100'] 2/1to1/1_0 (70.0, 80.0) [('e2', 10.42), ('e3', 10.25), ('edge', 10.42), ('lane', 10.42)]
30c30
< success 100 ['--step-length', '.1', '--end', '100'] ['2/1to1/1_0']
---
> failed 100 ['--step-length', '.1', '--end', '100'] 2/1to1/1_0 (0.0, 100.0) [('e1', 10.27), ('e2', 10.24), ('e3', 9.59), ('edge', 10.24), ('lane', 10.24)]
32c32
< success 100 ['--step-length', '.1', '--end', '100'] ['2/1to1/1_0', '1/1to0/1_0']
<truncated after showing first 30 lines>

TEST had known bugs (see #254) on SUMO-mac : sumo output two_same_vehicles ( Last six runs Oct2019 )

different outputs from detectors which should detect the same
(This bug was triggered by text found in file 'output' matching 'failed')
---------- Differences in output ----------
10c10
< success 0.1 ['--step-length', '.1', '--end', '100'] ['3/1to2/1_0']
---
> failed 0.1 ['--step-length', '.1', '--end', '100'] 3/1to2/1_0 (75.4, 75.5) [('e2', 10.0), ('e3', -1.0), ('edge', -1.0), ('lane', -1.0)]
12c12
< success 1 ['--step-length', '.1', '--end', '100'] ['3/1to2/1_0']
---
> failed 1 ['--step-length', '.1', '--end', '100'] 3/1to2/1_0 (76.0, 77.0) [('e2', 10.0), ('e3', -1.0), ('edge', -1.0), ('lane', -1.0)]
14c14
< success 10 ['--step-length', '.1', '--end', '100'] ['3/1to2/1_0']
---
> failed 10 ['--step-length', '.1', '--end', '100'] 3/1to2/1_0 (80.0, 90.0) [('e2', 10.0), ('e3', -1.0), ('edge', -1.0), ('lane', -1.0)]
18c18
< success 0.1 ['--step-length', '.1', '--end', '1000'] ['3/1to2/1_0']
---
> failed 0.1 ['--step-length', '.1', '--end', '1000'] 3/1to2/1_0 (75.4, 75.5) [('e2', 10.0), ('e3', -1.0), ('edge', -1.0), ('lane', -1.0)]
20c20
< success 1 ['--step-length', '.1', '--end', '1000'] ['3/1to2/1_0']
---
> failed 1 ['--step-length', '.1', '--end', '1000'] 3/1to2/1_0 (76.0, 77.0) [('e2', 10.0), ('e3', -1.0), ('edge', -1.0), ('lane', -1.0)]
22c22
< success 10 ['--step-length', '.1', '--end', '1000'] ['3/1to2/1_0']
---
> failed 10 ['--step-length', '.1', '--end', '1000'] 3/1to2/1_0 (80.0, 90.0) [('e2', 10.0), ('e3', -1.0), ('edge', -1.0), ('lane', -1.0)]
24c24
< success 100 ['--step-length', '.1', '--end', '1000'] ['3/1to2/1_0']
---
> failed 100 ['--step-length', '.1', '--end', '1000'] 3/1to2/1_0 (100.0, 200.0) [('e1', -1.0), ('e2', 10.0), ('e3', -1.0), ('edge', -1.0), ('lane', -1.0)]
34c34
< success 0.1 ['--step-length', '1', '--end', '100'] ['3/1to2/1_0']
<truncated after showing first 30 lines>

TEST had known bugs (see #254) on SUMO-mac : sumo output two_vehicles_diff_length ( Last six runs Oct2019 )

different outputs from detectors which should detect the same
(This bug was triggered by text found in file 'output' matching 'failed')
---------- Differences in output ----------
10c10
< success 0.1 ['--step-length', '.1', '--end', '100'] ['3/1to2/1_0']
---
> failed 0.1 ['--step-length', '.1', '--end', '100'] 3/1to2/1_0 (76.4, 76.5) [('e2', 10.0), ('e3', -1.0), ('edge', -1.0), ('lane', -1.0)]
12c12
< success 1 ['--step-length', '.1', '--end', '100'] ['3/1to2/1_0']
---
> failed 1 ['--step-length', '.1', '--end', '100'] 3/1to2/1_0 (77.0, 78.0) [('e2', 10.0), ('e3', -1.0), ('edge', -1.0), ('lane', -1.0)]
14c14
< success 10 ['--step-length', '.1', '--end', '100'] ['3/1to2/1_0']
---
> failed 10 ['--step-length', '.1', '--end', '100'] 3/1to2/1_0 (80.0, 90.0) [('e2', 10.0), ('e3', -1.0), ('edge', -1.0), ('lane', -1.0)]
18c18
< success 0.1 ['--step-length', '.1', '--end', '1000'] ['3/1to2/1_0']
---
> failed 0.1 ['--step-length', '.1', '--end', '1000'] 3/1to2/1_0 (76.4, 76.5) [('e2', 10.0), ('e3', -1.0), ('edge', -1.0), ('lane', -1.0)]
20c20
< success 1 ['--step-length', '.1', '--end', '1000'] ['3/1to2/1_0']
---
> failed 1 ['--step-length', '.1', '--end', '1000'] 3/1to2/1_0 (77.0, 78.0) [('e2', 10.0), ('e3', -1.0), ('edge', -1.0), ('lane', -1.0)]
22c22
< success 10 ['--step-length', '.1', '--end', '1000'] ['3/1to2/1_0']
---
> failed 10 ['--step-length', '.1', '--end', '1000'] 3/1to2/1_0 (80.0, 90.0) [('e2', 10.0), ('e3', -1.0), ('edge', -1.0), ('lane', -1.0)]
24c24
< success 100 ['--step-length', '.1', '--end', '1000'] ['3/1to2/1_0']
---
> failed 100 ['--step-length', '.1', '--end', '1000'] 3/1to2/1_0 (100.0, 200.0) [('e1', -1.0), ('e2', 10.0), ('e3', -1.0), ('edge', -1.0), ('lane', -1.0)]
34c34
< success 0.1 ['--step-length', '1', '--end', '100'] ['3/1to2/1_0']
<truncated after showing first 30 lines>

TEST had known bugs (see #254) on SUMO-mac : sumo output two_vehicles_diff_speed ( Last six runs Oct2019 )

different outputs from detectors which should detect the same
(This bug was triggered by text found in file 'output' matching 'failed')
---------- Differences in output ----------
0a1,48
> Loading configuration... done.
> failed 0.1 ['--step-length', '.1', '--end', '51'] 3/1to2/1_0 (38.4, 38.5) [('e2', 9.6), ('e3', 9.5), ('edge', 9.6), ('lane', 9.6)]
> Loading configuration... done.
> failed 1 ['--step-length', '.1', '--end', '51'] 3/1to2/1_0 (38.0, 39.0) [('e2', 9.64), ('e3', 9.5), ('edge', 9.64), ('lane', 9.64)]
> Loading configuration... done.
> failed 10 ['--step-length', '.1', '--end', '51'] 3/1to2/1_0 (30.0, 40.0) [('e2', 9.86), ('e3', 9.5), ('edge', 9.86), ('lane', 9.86)]
> Loading configuration... done.
> failed 100 ['--step-length', '.1', '--end', '51'] 3/1to2/1_0 (0.0, 51.0) [('e2', 9.62), ('e3', 9.5), ('edge', 9.62), ('lane', 9.62)]
> Loading configuration... done.
> failed 0.1 ['--step-length', '.1', '--end', '100'] 3/1to2/1_0 (38.4, 38.5) [('e2', 9.6), ('e3', 9.5), ('edge', 9.6), ('lane', 9.6)]
> Loading configuration... done.
> failed 1 ['--step-length', '.1', '--end', '100'] 3/1to2/1_0 (38.0, 39.0) [('e2', 9.64), ('e3', 9.5), ('edge', 9.64), ('lane', 9.64)]
> Loading configuration... done.
> failed 10 ['--step-length', '.1', '--end', '100'] 3/1to2/1_0 (30.0, 40.0) [('e2', 9.86), ('e3', 9.5), ('edge', 9.86), ('lane', 9.86)]
> Loading configuration... done.
> failed 100 ['--step-length', '.1', '--end', '100'] 3/1to2/1_0 (0.0, 100.0) [('e1', 9.5), ('e2', 9.53), ('e3', 9.5), ('edge', 9.47), ('lane', 9.47)]
> Loading configuration... done.
> failed 0.1 ['--step-length', '.1', '--end', '1000'] 3/1to2/1_0 (38.4, 38.5) [('e2', 9.6), ('e3', 9.5), ('edge', 9.6), ('lane', 9.6)]
> Loading configuration... done.
> failed 1 ['--step-length', '.1', '--end', '1000'] 3/1to2/1_0 (38.0, 39.0) [('e2', 9.64), ('e3', 9.5), ('edge', 9.64), ('lane', 9.64)]
> Loading configuration... done.
> failed 10 ['--step-length', '.1', '--end', '1000'] 3/1to2/1_0 (30.0, 40.0) [('e2', 9.86), ('e3', 9.5), ('edge', 9.86), ('lane', 9.86)]
> Loading configuration... done.
> failed 100 ['--step-length', '.1', '--end', '1000'] 3/1to2/1_0 (0.0, 100.0) [('e1', 9.5), ('e2', 9.53), ('e3', 9.5), ('edge', 9.47), ('lane', 9.47)]
> Loading configuration... done.
> failed 0.1 ['--step-length', '1', '--end', '51'] 3/1to2/1_0 (39.0, 40.0) [('e2', 9.6), ('e3', 9.5), ('edge', 9.6), ('lane', 9.6)]
> Loading configuration... done.
> failed 1 ['--step-length', '1', '--end', '51'] 3/1to2/1_0 (39.0, 40.0) [('e2', 9.6), ('e3', 9.5), ('edge', 9.6), ('lane', 9.6)]
> Loading configuration... done.
<truncated after showing first 30 lines>

TEST had known bugs (#4727) on SUMO-mac : traci ContextSubscriptionFilters leadFollow carFollowing ( Last six runs Oct2019 )

#4727
(This bug was triggered by text found in file 'output' matching '.')
---------- Differences in output ----------
4d3
< lead_straight
6d4
< [002] Context results for vehicle 'ego':
7a6
> [002] Context results for vehicle 'ego':
9d7
< [003] Context results for vehicle 'ego':
10a9
> [003] Context results for vehicle 'ego':
12d10
< [004] Context results for vehicle 'ego':
13a12
> [004] Context results for vehicle 'ego':
15d13
< [005] Context results for vehicle 'ego':
16a15
> [005] Context results for vehicle 'ego':
18d16
< [006] Context results for vehicle 'ego':
19a18
> [006] Context results for vehicle 'ego':
21d19
< [007] Context results for vehicle 'ego':
22a21
> [007] Context results for vehicle 'ego':
24d22
< [008] Context results for vehicle 'ego':
25a24
> [008] Context results for vehicle 'ego':
<truncated after showing first 30 lines>

2 TESTS had known bugs (#4727) on SUMO-mac :

#4727
(This bug was triggered by text found in file 'output' matching '.')
---------- Differences in output ----------
4a5
> follow_straight
7d7
< follow_straight
9a10
> follow_straight
12d12
< follow_straight
14a15
> follow_straight
17d17
< follow_straight
19a20
> follow_straight
22d22
< follow_straight
24a25
> follow_straight
27d27
< follow_straight
29a30
> follow_straight
32d32
< follow_straight
34a35
> follow_straight
37d37
< follow_straight
39a40
> follow_straight
<truncated after showing first 30 lines>
traci ContextSubscriptionFilters leadFollow laneChangeLeft ( Last six runs Oct2019 )
traci ContextSubscriptionFilters leadFollow laneChangeRight ( Last six runs Oct2019 )

TEST had known bugs (#4727) on SUMO-mac : traci ContextSubscriptionFilters leadFollow laneChangeNeighbors ( Last six runs Oct2019 )

#4727
(This bug was triggered by text found in file 'output' matching '.')
---------- Differences in output ----------
4,5d3
< follow_straight
< follow_right
6a5,7
> follow_right
> follow_straight
> lead_left
9d9
< lead_left
11,12d10
< follow_straight
< follow_right
13a12,14
> follow_right
> follow_straight
> lead_left
16d16
< lead_left
18,19d17
< follow_straight
< follow_right
20a19,21
> follow_right
> follow_straight
> lead_left
23d23
< lead_left
25,26d24
< follow_straight
< follow_right
<truncated after showing first 30 lines>

TEST had known bugs (see #3263) on SUMO-mac : traci pythonApi moveToXY keepRoute2 ( Last six runs Oct2019 )

mapping failure
(This bug was triggered by text found in file 'output' matching 'failed')
---------- Differences in output ----------
0a1,2
> internal corner (inside, segment2) failed: x=198, x2=198.0,   y=1.9, y2=1.9,   lane=middle_0, lane2=middle_0, pos=102, pos2=98.0   posLat=2.0 posLat2=1.9
> internal corner (outside, far) failed: x=203, x2=203.0,   y=-4, y2=-4.0,   lane=, lane2=middle_0, pos=-1073741824.0, pos2=100.0   posLat=-1073741824.0 posLat2=-1.41421356237

TEST had known bugs (see #5383) on SUMO-mac : traci pythonApi moveToXY permissions ( Last six runs Oct2019 )

mapping failure
(This bug was triggered by text found in file 'output' matching 'failed')
---------- Differences in output ----------
0a1,2
> shifted to left lane (permissions) failed: mode=2 x=40, x2=40.0,   y=-1.5, y2=-1.5,   lane=beg_1, lane2=, pos=40, pos2=-1073741824.0   posLat=0.0 posLat2=-1073741824.0
> right lane (ignore permissions) failed: mode=6 x=40, x2=40.0,   y=-1.6, y2=-1.6,   lane=beg_0, lane2=, pos=40, pos2=-1073741824.0   posLat=0.0 posLat2=-1073741824.0