20Mar22rv1_12_0+1541-77deb7a3227 - detailed test results for COMPLEX

To reconnect the TextTest GUI to these results, run:

texttest -a complex -d /Users/sumo/clangMacOS/sumo/tests -reconnect /Users/sumo/clangMacOS/texttesttmp/clangMacOS.31Mar000857.99350 -g

To start TextTest for these tests, run:

texttest -a complex -d /Users/sumo/clangMacOS/sumo/tests


default: 613 tests: 580 succeeded 21 FAILED 10 known bugs 2 killed

Detailed information for the tests that FAILED:

TEST FAILED on ts-sim-mac-ba : fmi model_validation ( Last six runs Mar2022 )

---------- Differences in errors ----------
0a1,4
> Traceback (most recent call last):
>   File "/Users/sumo/clangMacOS/sumo/tests/../tests/complex/fmi/runner.py", line 28, in <module>
>     from fmpy import read_model_description, extract
> ImportError: No module named fmpy
---------- Differences in output ----------
1,3d0
< FMU validation successful
< Simulating libsumofmi2 (model name 'SUMO', FMI v2.0)...
< Print ended at step 60.0

TEST FAILED on ts-sim-mac-ba : fmi vehicle_getIDCount ( Last six runs Mar2022 )

---------- Differences in errors ----------
0a1,4
> Traceback (most recent call last):
>   File "/Users/sumo/clangMacOS/sumo/tests/../tests/complex/fmi/runner.py", line 28, in <module>
>     from fmpy import read_model_description, extract
> ImportError: No module named fmpy
---------- Differences in output ----------
1,63d0
< FMU validation successful
< Simulating libsumofmi2 (model name 'SUMO', FMI v2.0)...
< TIME 1.0: vehicle.getIDCount = 6
< TIME 2.0: vehicle.getIDCount = 6
< TIME 3.0: vehicle.getIDCount = 6
< TIME 4.0: vehicle.getIDCount = 7
< TIME 5.0: vehicle.getIDCount = 7
< TIME 6.0: vehicle.getIDCount = 8
< TIME 7.0: vehicle.getIDCount = 8
< TIME 8.0: vehicle.getIDCount = 9
< TIME 9.0: vehicle.getIDCount = 9
< TIME 10.0: vehicle.getIDCount = 9
< TIME 11.0: vehicle.getIDCount = 9
< TIME 12.0: vehicle.getIDCount = 9
< TIME 13.0: vehicle.getIDCount = 10
< TIME 14.0: vehicle.getIDCount = 10
< TIME 15.0: vehicle.getIDCount = 10
< TIME 16.0: vehicle.getIDCount = 11
< TIME 17.0: vehicle.getIDCount = 11
< TIME 18.0: vehicle.getIDCount = 12
< TIME 19.0: vehicle.getIDCount = 12
< TIME 20.0: vehicle.getIDCount = 12
< TIME 21.0: vehicle.getIDCount = 13
< TIME 22.0: vehicle.getIDCount = 13
< TIME 23.0: vehicle.getIDCount = 13
< TIME 24.0: vehicle.getIDCount = 13
< TIME 25.0: vehicle.getIDCount = 13
< TIME 26.0: vehicle.getIDCount = 12
< TIME 27.0: vehicle.getIDCount = 10
<truncated after showing first 30 lines>

TEST FAILED on ts-sim-mac-ba : fmi vehicle_getParameterWithKey ( Last six runs Mar2022 )

---------- Differences in errors ----------
0a1,4
> Traceback (most recent call last):
>   File "/Users/sumo/clangMacOS/sumo/tests/../tests/complex/fmi/runner.py", line 28, in <module>
>     from fmpy import read_model_description, extract
> ImportError: No module named fmpy
---------- Differences in output ----------
1,4d0
< FMU validation successful
< Simulating libsumofmi2 (model name 'SUMO', FMI v2.0)...
< key, value: 'meaningOfLife', '42'
< Print ended at step 60.0

TEST FAILED on ts-sim-mac-ba : fmi vehicle_moveToXY ( Last six runs Mar2022 )

---------- Differences in errors ----------
0a1,4
> Traceback (most recent call last):
>   File "/Users/sumo/clangMacOS/sumo/tests/../tests/complex/fmi/runner.py", line 28, in <module>
>     from fmpy import read_model_description, extract
> ImportError: No module named fmpy
---------- Differences in output ----------
1,91d0
< FMU validation successful
< Simulating libsumofmi2 (model name 'SUMO', FMI v2.0)...
< TIME 0: laneID = ''
< TIME 1.0: laneID = 'WE1_0'
< currentPos = [0.0, -1.6]
< targetPos = (10.0, -1.6)
< TIME 2.0: laneID = 'WE1_0'
< currentPos = [10.0, -1.6]
< targetPos = (20.0, -1.6)
< TIME 3.0: laneID = 'WE1_0'
< currentPos = [20.0, -1.6]
< targetPos = (30.0, -1.6)
< TIME 4.0: laneID = 'WE1_0'
< currentPos = [30.0, -1.6]
< targetPos = (40.0, -1.6)
< TIME 5.0: laneID = 'WE1_0'
< currentPos = [40.0, -1.6]
< targetPos = (50.0, -1.6)
< TIME 6.0: laneID = ':J1_10_0'
< currentPos = [50.0, -1.6]
< targetPos = (60.0, -1.6)
< TIME 7.0: laneID = 'WE2_0'
< currentPos = [60.0, -1.6]
< targetPos = (70.0, -1.6)
< TIME 8.0: laneID = 'WE2_0'
< currentPos = [70.0, -1.6]
< targetPos = (80.0, -1.6)
< TIME 9.0: laneID = 'WE2_0'
< currentPos = [80.0, -1.6]
<truncated after showing first 30 lines>

TEST FAILED on ts-sim-mac-ba : sumo protobuf ( Last six runs Mar2022 )

---------- Differences in errors ----------
0a1,28
> Traceback (most recent call last):
>   File "/Users/sumo/clangMacOS/sumo/tools/xml/protobuf2xml.py", line 32, in <module>
>     import google.protobuf.descriptor  # we need to do this late because the xml2protobuf import modifies sys.path
> ImportError: No module named google.protobuf.descriptor
> Traceback (most recent call last):
>   File "/Users/sumo/clangMacOS/sumo/tools/xml/xml2protobuf.py", line 210, in <module>
>     main()
>   File "/Users/sumo/clangMacOS/sumo/tools/xml/xml2protobuf.py", line 197, in main
>     attrFinder.xsdStruc._namedEnumerations, options.protodir, base)
>   File "/Users/sumo/clangMacOS/sumo/tools/xml/xml2protobuf.py", line 185, in generateProto
>     subprocess.call([protoc, "%s.proto" % base, "--python_out=%s" % protodir])
>   File "/System/Library/Frameworks/Python.framework/Versions/2.7/lib/python2.7/subprocess.py", line 172, in call
>     return Popen(*popenargs, **kwargs).wait()
>   File "/System/Library/Frameworks/Python.framework/Versions/2.7/lib/python2.7/subprocess.py", line 394, in __init__
>     errread, errwrite)
>   File "/System/Library/Frameworks/Python.framework/Versions/2.7/lib/python2.7/subprocess.py", line 1047, in _execute_child
>     raise child_exception
> OSError: [Errno 2] No such file or directory
> Error: send failed: Software caused tcpip::Socket abort
> Quitting (on error).
> Traceback (most recent call last):
>   File "/Users/sumo/clangMacOS/sumo/tests/../tests/complex/sumo/protobuf/runner.py", line 82, in <module>
>     connect(IN_PORT, OUT_PORT)
>   File "/Users/sumo/clangMacOS/sumo/tests/../tests/complex/sumo/protobuf/runner.py", line 38, in connect
>     i.connect(("localhost", inPort))
>   File "/System/Library/Frameworks/Python.framework/Versions/2.7/lib/python2.7/socket.py", line 228, in meth
>     return getattr(self._sock,name)(*args)
> socket.error: [Errno 61] Connection refused
---------- Differences in output ----------
1,5d0
< --- 
< +++ 
< -
< -<trajectories xmlns:xsi="http://www.w3.org/2001/XMLSchema-instance" xsi:noNamespaceSchemaLocation="http://sumo.dlr.de/xsd/amitran/trajectories.xsd" timeStepSize="1000">
< +<trajectories timeStepSize="1000">

TEST FAILED on ts-sim-mac-ba : sumo speedMap ( Last six runs Mar2022 )

---------- Differences in errors ----------
0a1,2
> /System/Library/Frameworks/Python.framework/Versions/2.7/Extras/lib/python/matplotlib/colorbar.py:829: RuntimeWarning: invalid value encountered in divide
>   z = np.take(y, i0) + (xn - np.take(b, i0)) * dy / db

TEST FAILED on ts-sim-mac-ba : traci connection clientCloses sumo-gui ( Last six runs Mar2022 )

---------- Differences in errors ----------
0a1,4
> FXApp::openDisplay: unable to open display :0.0
> Traceback (most recent call last):
>     raise FatalTraCIError("Could not connect in %s tries" % (numRetries + 1))
> traci.exceptions.FatalTraCIError: Could not connect in 61 tries
---------- Differences in output ----------
3,15d2
< Print ended at step 100.0
< ----------- SUMO end time is not given -----------
< Print ended at step 100.0
< =========== empty routes in SUMO ===========
< ----------- SUMO end time is smaller than TraCI's -----------
< Print ended at step 100.0
< ----------- SUMO end time is not given -----------
< Print ended at step 100.0
< =========== vehicle leaves before TraCI ends ===========
< ----------- SUMO end time is smaller than TraCI's -----------
< Print ended at step 100.0
< ----------- SUMO end time is not given -----------
< Print ended at step 100.0

TEST FAILED on ts-sim-mac-ba : traci connection closingOutput sumo-gui ( Last six runs Mar2022 )

---------- Differences in errors ----------
0a1,185
> FXApp::openDisplay: unable to open display :0.0
>   " Retrying with different port.") % (sumoPort, e))
> FXApp::openDisplay: unable to open display :0.0
>   " Retrying with different port.") % (sumoPort, e))
> FXApp::openDisplay: unable to open display :0.0
>   " Retrying with different port.") % (sumoPort, e))
> FXApp::openDisplay: unable to open display :0.0
>   " Retrying with different port.") % (sumoPort, e))
> FXApp::openDisplay: unable to open display :0.0
>   " Retrying with different port.") % (sumoPort, e))
> FXApp::openDisplay: unable to open display :0.0
>   " Retrying with different port.") % (sumoPort, e))
> FXApp::openDisplay: unable to open display :0.0
>   " Retrying with different port.") % (sumoPort, e))
> FXApp::openDisplay: unable to open display :0.0
>   " Retrying with different port.") % (sumoPort, e))
> FXApp::openDisplay: unable to open display :0.0
>   " Retrying with different port.") % (sumoPort, e))
> FXApp::openDisplay: unable to open display :0.0
>   " Retrying with different port.") % (sumoPort, e))
> FXApp::openDisplay: unable to open display :0.0
>   " Retrying with different port.") % (sumoPort, e))
> FXApp::openDisplay: unable to open display :0.0
>   " Retrying with different port.") % (sumoPort, e))
> FXApp::openDisplay: unable to open display :0.0
>   " Retrying with different port.") % (sumoPort, e))
> FXApp::openDisplay: unable to open display :0.0
>   " Retrying with different port.") % (sumoPort, e))
> FXApp::openDisplay: unable to open display :0.0
<truncated after showing first 30 lines>
---------- Missing result in state ----------
<?xml version="1.0" encoding="UTF-8"?>


<netstate xmlns:xsi="http://www.w3.org/2001/XMLSchema-instance" xsi:noNamespaceSchemaLocation="http://sumo.dlr.de/xsd/netstate_file.xsd">
    <timestep time="0.00">
        <edge id="2fi">
            <lane id="2fi_0">
                <vehicle id="horiz" pos="5.10" speed="0.00"/>
            </lane>
        </edge>
    </timestep>
    <timestep time="1.00">
        <edge id="2fi">
            <lane id="2fi_0">
                <vehicle id="horiz" pos="6.53" speed="1.43"/>
            </lane>
        </edge>
    </timestep>
    <timestep time="2.00">
        <edge id="2fi">
            <lane id="2fi_0">
                <vehicle id="horiz" pos="10.57" speed="4.03"/>
            </lane>
        </edge>
    </timestep>
    <timestep time="3.00">
        <edge id="2fi">
            <lane id="2fi_0">
                <vehicle id="horiz" pos="16.77" speed="6.21"/>
            </lane>
<truncated after showing first 30 lines>
---------- Missing result in tripinfo ----------
<?xml version="1.0" encoding="UTF-8"?>


<tripinfos xmlns:xsi="http://www.w3.org/2001/XMLSchema-instance" xsi:noNamespaceSchemaLocation="http://sumo.dlr.de/xsd/tripinfo_file.xsd">
</tripinfos>

TEST FAILED on ts-sim-mac-ba : traci connection multipleConnections basic sumo-gui ( Last six runs Mar2022 )

---------- Differences in errors ----------
0a1,121
> FXApp::openDisplay: unable to open display :0.0
> Process Process-2:
> Process Process-1:
> Traceback (most recent call last):
>     raise FatalTraCIError("Could not connect in %s tries" % (numRetries + 1))
> FatalTraCIError: Could not connect in 61 tries
>     _connections[label] = connect(port, numRetries, host, proc, 1, traceFile, traceGetters)
>   File "/Users/sumo/clangMacOS/sumo/tools/traci/main.py", line 111, in connect
>     raise FatalTraCIError("Could not connect in %s tries" % (numRetries + 1))
> FatalTraCIError: Could not connect in 61 tries
> FXApp::openDisplay: unable to open display :0.0
> Process Process-4:
> Traceback (most recent call last):
>     raise FatalTraCIError("Could not connect in %s tries" % (numRetries + 1))
> FatalTraCIError: Could not connect in 61 tries
> Process Process-3:
> Traceback (most recent call last):
>     raise FatalTraCIError("Could not connect in %s tries" % (numRetries + 1))
> FatalTraCIError: Could not connect in 61 tries
> FXApp::openDisplay: unable to open display :0.0
> Process Process-5:
> Traceback (most recent call last):
>     raise FatalTraCIError("Could not connect in %s tries" % (numRetries + 1))
> FatalTraCIError: Could not connect in 61 tries
> Process Process-6:
> Traceback (most recent call last):
>     raise FatalTraCIError("Could not connect in %s tries" % (numRetries + 1))
> FatalTraCIError: Could not connect in 61 tries
> Process Process-7:
<truncated after showing first 30 lines>
---------- Differences in output ----------
4,5c4
< Process 1 ended at step 99
< Process 2 ended at step 99
---
> t:49756 [Errno 61] Connection refused
7,8c6
< Process 1 ended at step 99
< Process 2 ended at step 99
---
> t:49756 [Errno 61] Connection refused
11,15c9,12
< Process 1 ended at step 99
< Process 2 ended at step 99
< Process 3 ended at step 99
< Process 4 ended at step 99
< Process 5 ended at step 99
---
> t:49756 [Errno 61] Connection refused
> t:49756 [Errno 61] Connection refused
> t:49756 [Errno 61] Connection refused
> t:49756 [Errno 61] Connection refused
17,21c14,17
< Process 1 ended at step 99
< Process 2 ended at step 99
< Process 3 ended at step 99
< Process 4 ended at step 99
< Process 5 ended at step 99
---
> t:49756 [Errno 61] Connection refused
> t:49756 [Errno 61] Connection refused
<truncated after showing first 30 lines>

TEST FAILED on ts-sim-mac-ba : traci connection parallelConnection sumo-gui ( Last six runs Mar2022 )

---------- Differences in errors ----------
0a1,4
> FXApp::openDisplay: unable to open display :0.0
> Traceback (most recent call last):
>     raise FatalTraCIError("Could not connect.")
> traci.exceptions.FatalTraCIError: Could not connect.
---------- Differences in output ----------
3,16d2
<  Run 1
<  Run 2
< Print ended at step 100.0
< Print ended at step 100.0
< Print ended at step 100.0
< Connection already closed.
< ----------- TraCI ends first -----------
<  Run 0
<  Run 1
<  Run 2
< Print ended at step 100.0
< Print ended at step 100.0
< Print ended at step 100.0
< Connection '2' is not known.

TEST FAILED on ts-sim-mac-ba : traci connection repeatedConnection sumo-gui ( Last six runs Mar2022 )

---------- Differences in errors ----------
0a1,4
> FXApp::openDisplay: unable to open display :0.0
> Traceback (most recent call last):
>     raise FatalTraCIError("Could not connect in %s tries" % (numRetries + 1))
> traci.exceptions.FatalTraCIError: Could not connect in 61 tries
---------- Differences in output ----------
3,42d2
< Print ended at step 100.0
<  Run 1
< Print ended at step 100.0
<  Run 2
< Print ended at step 100.0
<  Run 3
< Print ended at step 100.0
<  Run 4
< Print ended at step 100.0
<  Run 5
< Print ended at step 100.0
<  Run 6
< Print ended at step 100.0
<  Run 7
< Print ended at step 100.0
<  Run 8
< Print ended at step 100.0
<  Run 9
< Print ended at step 100.0
< ----------- TraCI ends first -----------
<  Run 0
< Print ended at step 100.0
<  Run 1
< Print ended at step 100.0
<  Run 2
< Print ended at step 100.0
<  Run 3
< Print ended at step 100.0
<  Run 4
<truncated after showing first 30 lines>

TEST FAILED on ts-sim-mac-ba : traci gui b50 ( Last six runs Mar2022 )

---------- Differences in errors ----------
6a7,10
> FXApp::openDisplay: unable to open display :0.0
> Traceback (most recent call last):
>     raise FatalTraCIError("Could not connect in %s tries" % (numRetries + 1))
> traci.exceptions.FatalTraCIError: Could not connect in 61 tries
---------- Differences in output ----------
2,4d1
< -- Unordered text as found by filter '^Loading configuration ... done.' --
< Loading configuration ... done.
< 

TEST FAILED on ts-sim-mac-ba : traci gui gui ( Last six runs Mar2022 )

---------- Differences in errors ----------
0a1,185
> FXApp::openDisplay: unable to open display :0.0
>   " Retrying with different port.") % (sumoPort, e))
> FXApp::openDisplay: unable to open display :0.0
>   " Retrying with different port.") % (sumoPort, e))
> FXApp::openDisplay: unable to open display :0.0
>   " Retrying with different port.") % (sumoPort, e))
> FXApp::openDisplay: unable to open display :0.0
>   " Retrying with different port.") % (sumoPort, e))
> FXApp::openDisplay: unable to open display :0.0
>   " Retrying with different port.") % (sumoPort, e))
> FXApp::openDisplay: unable to open display :0.0
>   " Retrying with different port.") % (sumoPort, e))
> FXApp::openDisplay: unable to open display :0.0
>   " Retrying with different port.") % (sumoPort, e))
> FXApp::openDisplay: unable to open display :0.0
>   " Retrying with different port.") % (sumoPort, e))
> FXApp::openDisplay: unable to open display :0.0
>   " Retrying with different port.") % (sumoPort, e))
> FXApp::openDisplay: unable to open display :0.0
>   " Retrying with different port.") % (sumoPort, e))
> FXApp::openDisplay: unable to open display :0.0
>   " Retrying with different port.") % (sumoPort, e))
> FXApp::openDisplay: unable to open display :0.0
>   " Retrying with different port.") % (sumoPort, e))
> FXApp::openDisplay: unable to open display :0.0
>   " Retrying with different port.") % (sumoPort, e))
> FXApp::openDisplay: unable to open display :0.0
>   " Retrying with different port.") % (sumoPort, e))
> FXApp::openDisplay: unable to open display :0.0
<truncated after showing first 30 lines>
---------- Differences in output ----------
1,29d0
< step 0
< step 1
< step 2
< hasGUI True
< views ('View #0',)
< examining View #0
< set zoom (80.0)
< get zoom 80.0
< set offset (400.0, 400.0)
< get offset (400.0, 400.0)
< set schema ('real world')
< get schema real world
< visible boundary ((-805.859375, -230.0), (1605.859375, 1030.0))
< has view View #0 True
< has view 'foo' False
< track vehicle 'horiz'
< get tracked vehicle horiz
< {0: ('View #0',)}
< step 3
< {0: ('View #0',)}
< step 4
< {0: ('View #0',)}
< step 5
< {0: ('View #0',)}
< veh selected: False
< edge selected: False
< veh selected: True
< edge selected: True
< screenshot dimensions (500, 500, 4)
<truncated after showing first 30 lines>

TEST FAILED on ts-sim-mac-ba : traci gui polygon_dynamics_gui ( Last six runs Mar2022 )

---------- Differences in errors ----------
0a1,185
> FXApp::openDisplay: unable to open display :0.0
>   " Retrying with different port.") % (sumoPort, e))
> FXApp::openDisplay: unable to open display :0.0
>   " Retrying with different port.") % (sumoPort, e))
> FXApp::openDisplay: unable to open display :0.0
>   " Retrying with different port.") % (sumoPort, e))
> FXApp::openDisplay: unable to open display :0.0
>   " Retrying with different port.") % (sumoPort, e))
> FXApp::openDisplay: unable to open display :0.0
>   " Retrying with different port.") % (sumoPort, e))
> FXApp::openDisplay: unable to open display :0.0
>   " Retrying with different port.") % (sumoPort, e))
> FXApp::openDisplay: unable to open display :0.0
>   " Retrying with different port.") % (sumoPort, e))
> FXApp::openDisplay: unable to open display :0.0
>   " Retrying with different port.") % (sumoPort, e))
> FXApp::openDisplay: unable to open display :0.0
>   " Retrying with different port.") % (sumoPort, e))
> FXApp::openDisplay: unable to open display :0.0
>   " Retrying with different port.") % (sumoPort, e))
> FXApp::openDisplay: unable to open display :0.0
>   " Retrying with different port.") % (sumoPort, e))
> FXApp::openDisplay: unable to open display :0.0
>   " Retrying with different port.") % (sumoPort, e))
> FXApp::openDisplay: unable to open display :0.0
>   " Retrying with different port.") % (sumoPort, e))
> FXApp::openDisplay: unable to open display :0.0
>   " Retrying with different port.") % (sumoPort, e))
> FXApp::openDisplay: unable to open display :0.0
<truncated after showing first 30 lines>
---------- Differences in output ----------
1,256d0
< step 0
< step 1
< step 2
< adding poly0
< polygons ('poly0',)
< polygon count 1
< # examining poly0
< shape ((960.0, 510.0), (960.0, 550.0), (1000.0, 550.0), (1000.0, 510.0))
< type test
< color (100, 200, 0, 255)
< filled True
< step 3
< step 4
< step 5
< # (1) Adding underspecified dynamics...
< Caught TraCIException
< # (2) Adding malformed dynamics 1 ...
< Caught TraCIException
< # (3) Adding malformed dynamics 2 ...
< Caught TraCIException
< # (4) Adding malformed dynamics 3 ...
< Caught TraCIException
< # (5) Adding malformed dynamics 4 ...
< Caught TraCIException
< # (6) Adding malformed dynamics 5 ...
< Caught TraCIException
< # examining poly0
< shape ((960.0, 510.0), (960.0, 550.0), (1000.0, 550.0), (1000.0, 510.0))
< type test
<truncated after showing first 30 lines>

TEST FAILED on ts-sim-mac-ba : traci gui polygon_dynamics_remove ( Last six runs Mar2022 )

---------- Differences in errors ----------
0a1,185
> FXApp::openDisplay: unable to open display :0.0
>   " Retrying with different port.") % (sumoPort, e))
> FXApp::openDisplay: unable to open display :0.0
>   " Retrying with different port.") % (sumoPort, e))
> FXApp::openDisplay: unable to open display :0.0
>   " Retrying with different port.") % (sumoPort, e))
> FXApp::openDisplay: unable to open display :0.0
>   " Retrying with different port.") % (sumoPort, e))
> FXApp::openDisplay: unable to open display :0.0
>   " Retrying with different port.") % (sumoPort, e))
> FXApp::openDisplay: unable to open display :0.0
>   " Retrying with different port.") % (sumoPort, e))
> FXApp::openDisplay: unable to open display :0.0
>   " Retrying with different port.") % (sumoPort, e))
> FXApp::openDisplay: unable to open display :0.0
>   " Retrying with different port.") % (sumoPort, e))
> FXApp::openDisplay: unable to open display :0.0
>   " Retrying with different port.") % (sumoPort, e))
> FXApp::openDisplay: unable to open display :0.0
>   " Retrying with different port.") % (sumoPort, e))
> FXApp::openDisplay: unable to open display :0.0
>   " Retrying with different port.") % (sumoPort, e))
> FXApp::openDisplay: unable to open display :0.0
>   " Retrying with different port.") % (sumoPort, e))
> FXApp::openDisplay: unable to open display :0.0
>   " Retrying with different port.") % (sumoPort, e))
> FXApp::openDisplay: unable to open display :0.0
>   " Retrying with different port.") % (sumoPort, e))
> FXApp::openDisplay: unable to open display :0.0
<truncated after showing first 30 lines>

TEST FAILED on ts-sim-mac-ba : traci trafficlight railsignal_state ( Last six runs Mar2022 )

---------- Differences in errors ----------
2a3
> Warning: Invalid approach information to rail signal 'junction 'N2', link 0' after rerouting for vehicle 'rail5' first driveway edge 'T9_0' time=502.00.

TEST FAILED on ts-sim-mac-ba : unit_tests testcommon ( Last six runs Mar2022 )

---------- Differences in errors ----------
0a1,10
> Traceback (most recent call last):
>   File "/Users/sumo/clangMacOS/sumo/tests/toolrunner.py", line 39, in <module>
>     subprocess.call(tool + sys.argv[1:], env=os.environ, stdout=sys.stdout, stderr=sys.stderr)
>   File "/System/Library/Frameworks/Python.framework/Versions/2.7/lib/python2.7/subprocess.py", line 172, in call
>     return Popen(*popenargs, **kwargs).wait()
>   File "/System/Library/Frameworks/Python.framework/Versions/2.7/lib/python2.7/subprocess.py", line 394, in __init__
>     errread, errwrite)
>   File "/System/Library/Frameworks/Python.framework/Versions/2.7/lib/python2.7/subprocess.py", line 1047, in _execute_child
>     raise child_exception
> OSError: [Errno 2] No such file or directory
---------- Differences in output ----------
1,111d0
< Running main() from gtest_main.cc
< [==========] Running 45 tests from 5 test suites.
< [----------] Global test environment set-up.
< [----------] 10 tests from StringTokenizer
< [ RUN      ] StringTokenizer.test_split_with_whitechar
< [       OK ] StringTokenizer.test_split_with_whitechar ((TIME))
< [ RUN      ] StringTokenizer.test_split_with_newline
< [       OK ] StringTokenizer.test_split_with_newline ((TIME))
< [ RUN      ] StringTokenizer.test_split_with_x
< [       OK ] StringTokenizer.test_split_with_x ((TIME))
< [ RUN      ] StringTokenizer.test_split_any_char
< [       OK ] StringTokenizer.test_split_any_char ((TIME))
< [ RUN      ] StringTokenizer.test_method_reinit
< [       OK ] StringTokenizer.test_method_reinit ((TIME))
< [ RUN      ] StringTokenizer.test_method_size
< [       OK ] StringTokenizer.test_method_size ((TIME))
< [ RUN      ] StringTokenizer.test_method_front
< [       OK ] StringTokenizer.test_method_front ((TIME))
< [ RUN      ] StringTokenizer.test_method_get
< [       OK ] StringTokenizer.test_method_get ((TIME))
< [ RUN      ] StringTokenizer.test_method_get_with_empty_data
< [       OK ] StringTokenizer.test_method_get_with_empty_data ((TIME))
< [ RUN      ] StringTokenizer.test_method_getVector
< [       OK ] StringTokenizer.test_method_getVector ((TIME))
< [----------] 10 tests from StringTokenizer ((TIME) total)
< 
< [----------] 4 tests from FileHelpers
< [ RUN      ] FileHelpers.test_method_checkForRelativity
< [       OK ] FileHelpers.test_method_checkForRelativity ((TIME))
<truncated after showing first 30 lines>
---------- New result in exitcode ----------
1

TEST FAILED on ts-sim-mac-ba : unit_tests testfoxtools ( Last six runs Mar2022 )

---------- Differences in errors ----------
0a1,10
> Traceback (most recent call last):
>   File "/Users/sumo/clangMacOS/sumo/tests/toolrunner.py", line 39, in <module>
>     subprocess.call(tool + sys.argv[1:], env=os.environ, stdout=sys.stdout, stderr=sys.stderr)
>   File "/System/Library/Frameworks/Python.framework/Versions/2.7/lib/python2.7/subprocess.py", line 172, in call
>     return Popen(*popenargs, **kwargs).wait()
>   File "/System/Library/Frameworks/Python.framework/Versions/2.7/lib/python2.7/subprocess.py", line 394, in __init__
>     errread, errwrite)
>   File "/System/Library/Frameworks/Python.framework/Versions/2.7/lib/python2.7/subprocess.py", line 1047, in _execute_child
>     raise child_exception
> OSError: [Errno 2] No such file or directory
---------- Differences in output ----------
1,13d0
< Running main() from gtest_main.cc
< [==========] Running 2 tests from 1 test suite.
< [----------] Global test environment set-up.
< [----------] 2 tests from FXWorkerThread
< [ RUN      ] FXWorkerThread.test_init
< [       OK ] FXWorkerThread.test_init ((TIME))
< [ RUN      ] FXWorkerThread.test_get_all
< [       OK ] FXWorkerThread.test_get_all ((TIME))
< [----------] 2 tests from FXWorkerThread ((TIME) total)
< 
< [----------] Global test environment tear-down
< [==========] 2 tests from 1 test suite ran. ((TIME) total)
< [  PASSED  ] 2 tests.
---------- New result in exitcode ----------
1

TEST FAILED on ts-sim-mac-ba : unit_tests testgeom ( Last six runs Mar2022 )

---------- Differences in errors ----------
0a1,10
> Traceback (most recent call last):
>   File "/Users/sumo/clangMacOS/sumo/tests/toolrunner.py", line 39, in <module>
>     subprocess.call(tool + sys.argv[1:], env=os.environ, stdout=sys.stdout, stderr=sys.stderr)
>   File "/System/Library/Frameworks/Python.framework/Versions/2.7/lib/python2.7/subprocess.py", line 172, in call
>     return Popen(*popenargs, **kwargs).wait()
>   File "/System/Library/Frameworks/Python.framework/Versions/2.7/lib/python2.7/subprocess.py", line 394, in __init__
>     errread, errwrite)
>   File "/System/Library/Frameworks/Python.framework/Versions/2.7/lib/python2.7/subprocess.py", line 1047, in _execute_child
>     raise child_exception
> OSError: [Errno 2] No such file or directory
---------- Differences in output ----------
1,67d0
< Running main() from gtest_main.cc
< [==========] Running 26 tests from 3 test suites.
< [----------] Global test environment set-up.
< [----------] 10 tests from Boundary
< [ RUN      ] Boundary.test_method_add
< [       OK ] Boundary.test_method_add ((TIME))
< [ RUN      ] Boundary.test_method_add_multiple
< [       OK ] Boundary.test_method_add_multiple ((TIME))
< [ RUN      ] Boundary.test_method_getCenter
< [       OK ] Boundary.test_method_getCenter ((TIME))
< [ RUN      ] Boundary.test_method_getWidthHeight
< [       OK ] Boundary.test_method_getWidthHeight ((TIME))
< [ RUN      ] Boundary.test_method_around
< [       OK ] Boundary.test_method_around ((TIME))
< [ RUN      ] Boundary.test_method_overlapsWith
< [       OK ] Boundary.test_method_overlapsWith ((TIME))
< [ RUN      ] Boundary.test_method_crosses
< [       OK ] Boundary.test_method_crosses ((TIME))
< [ RUN      ] Boundary.test_method_partialWithin
< [       OK ] Boundary.test_method_partialWithin ((TIME))
< [ RUN      ] Boundary.test_method_flipY
< [       OK ] Boundary.test_method_flipY ((TIME))
< [ RUN      ] Boundary.test_method_moveby
< [       OK ] Boundary.test_method_moveby ((TIME))
< [----------] 10 tests from Boundary ((TIME) total)
< 
< [----------] 1 test from GeoConvHelper
< [ RUN      ] GeoConvHelper.test_method_x2cartesian
< [       OK ] GeoConvHelper.test_method_x2cartesian ((TIME))
<truncated after showing first 30 lines>
---------- New result in exitcode ----------
1

TEST FAILED on ts-sim-mac-ba : unit_tests testmicrosim ( Last six runs Mar2022 )

---------- Differences in errors ----------
0a1,10
> Traceback (most recent call last):
>   File "/Users/sumo/clangMacOS/sumo/tests/toolrunner.py", line 39, in <module>
>     subprocess.call(tool + sys.argv[1:], env=os.environ, stdout=sys.stdout, stderr=sys.stderr)
>   File "/System/Library/Frameworks/Python.framework/Versions/2.7/lib/python2.7/subprocess.py", line 172, in call
>     return Popen(*popenargs, **kwargs).wait()
>   File "/System/Library/Frameworks/Python.framework/Versions/2.7/lib/python2.7/subprocess.py", line 394, in __init__
>     errread, errwrite)
>   File "/System/Library/Frameworks/Python.framework/Versions/2.7/lib/python2.7/subprocess.py", line 1047, in _execute_child
>     raise child_exception
> OSError: [Errno 2] No such file or directory
---------- Differences in output ----------
1,29d0
< Running main() from gtest_main.cc
< [==========] Running 7 tests from 3 test suites.
< [----------] Global test environment set-up.
< [----------] 1 test from MSEventControl
< [ RUN      ] MSEventControl.test_method_execute
< [       OK ] MSEventControl.test_method_execute ((TIME))
< [----------] 1 test from MSEventControl ((TIME) total)
< 
< [----------] 4 tests from MSCFModelTest
< [ RUN      ] MSCFModelTest.test_method_brakeGap
< [       OK ] MSCFModelTest.test_method_brakeGap ((TIME))
< [ RUN      ] MSCFModelTest.test_method_static_brakeGap
< [       OK ] MSCFModelTest.test_method_static_brakeGap ((TIME))
< [ RUN      ] MSCFModelTest.test_method_static_freeSpeed
< [       OK ] MSCFModelTest.test_method_static_freeSpeed ((TIME))
< [ RUN      ] MSCFModelTest.test_method_static_freeSpeed_half
< [       OK ] MSCFModelTest.test_method_static_freeSpeed_half ((TIME))
< [----------] 4 tests from MSCFModelTest ((TIME) total)
< 
< [----------] 2 tests from MSCFModel_IDMTest
< [ RUN      ] MSCFModel_IDMTest.test_method_brakeGap
< [       OK ] MSCFModel_IDMTest.test_method_brakeGap ((TIME))
< [ RUN      ] MSCFModel_IDMTest.test_method_getSecureGap
< [       OK ] MSCFModel_IDMTest.test_method_getSecureGap ((TIME))
< [----------] 2 tests from MSCFModel_IDMTest ((TIME) total)
< 
< [----------] Global test environment tear-down
< [==========] 7 tests from 3 test suites ran. ((TIME) total)
< [  PASSED  ] 7 tests.
<truncated after showing first 30 lines>
---------- New result in exitcode ----------
1

TEST FAILED on ts-sim-mac-ba : unit_tests testnetbuild ( Last six runs Mar2022 )

---------- Differences in errors ----------
0a1,10
> Traceback (most recent call last):
>   File "/Users/sumo/clangMacOS/sumo/tests/toolrunner.py", line 39, in <module>
>     subprocess.call(tool + sys.argv[1:], env=os.environ, stdout=sys.stdout, stderr=sys.stderr)
>   File "/System/Library/Frameworks/Python.framework/Versions/2.7/lib/python2.7/subprocess.py", line 172, in call
>     return Popen(*popenargs, **kwargs).wait()
>   File "/System/Library/Frameworks/Python.framework/Versions/2.7/lib/python2.7/subprocess.py", line 394, in __init__
>     errread, errwrite)
>   File "/System/Library/Frameworks/Python.framework/Versions/2.7/lib/python2.7/subprocess.py", line 1047, in _execute_child
>     raise child_exception
> OSError: [Errno 2] No such file or directory
---------- Differences in output ----------
1,16d0
< Running main() from gtest_main.cc
< [==========] Running 2 tests from 2 test suites.
< [----------] Global test environment set-up.
< [----------] 1 test from NBHeightMapperTest
< [ RUN      ] NBHeightMapperTest.test_method_getZ
< [       OK ] NBHeightMapperTest.test_method_getZ ((TIME))
< [----------] 1 test from NBHeightMapperTest ((TIME) total)
< 
< [----------] 1 test from NBTrafficLightLogic
< [ RUN      ] NBTrafficLightLogic.test_method_getDuration
< [       OK ] NBTrafficLightLogic.test_method_getDuration ((TIME))
< [----------] 1 test from NBTrafficLightLogic ((TIME) total)
< 
< [----------] Global test environment tear-down
< [==========] 2 tests from 2 test suites ran. ((TIME) total)
< [  PASSED  ] 2 tests.
---------- New result in exitcode ----------
1

Detailed information for the tests that had known bugs:

TEST had known bugs (see #8973) on ts-sim-mac-ba : sumo ToCDevice dynamic_ToC_stop ( Last six runs Mar2022 )

dynamic ToC triggered despite stop present on vehicle's lane continuation
(This bug was triggered by text found in file 'tocs' matching 'DYNTOR')

TEST had known bugs (see #254) on ts-sim-mac-ba : sumo output one_vehicle ( Last six runs Mar2022 )

different outputs from detectors which should detect the same
(This bug was triggered by text found in file 'output' matching 'failed')
---------- Differences in output ----------
5,7c5,7
< success 0.1 ['--step-length', '.1', '--end', '100'] ['3/1to2/1_0']
< success 1 ['--step-length', '.1', '--end', '100'] ['3/1to2/1_0']
< success 10 ['--step-length', '.1', '--end', '100'] ['3/1to2/1_0']
---
> failed 0.1 ['--step-length', '.1', '--end', '100'] 3/1to2/1_0 (71.4, 71.5) [('e2', 10.0), ('e3', -1.0), ('edge', -1.0), ('lane', -1.0)]
> failed 1 ['--step-length', '.1', '--end', '100'] 3/1to2/1_0 (72.0, 73.0) [('e2', 10.0), ('e3', -1.0), ('edge', -1.0), ('lane', -1.0)]
> failed 10 ['--step-length', '.1', '--end', '100'] 3/1to2/1_0 (80.0, 90.0) [('e2', 10.0), ('e3', -1.0), ('edge', -1.0), ('lane', -1.0)]
9,12c9,12
< success 0.1 ['--step-length', '.1', '--end', '1000'] ['3/1to2/1_0']
< success 1 ['--step-length', '.1', '--end', '1000'] ['3/1to2/1_0']
< success 10 ['--step-length', '.1', '--end', '1000'] ['3/1to2/1_0']
< success 100 ['--step-length', '.1', '--end', '1000'] ['3/1to2/1_0']
---
> failed 0.1 ['--step-length', '.1', '--end', '1000'] 3/1to2/1_0 (71.4, 71.5) [('e2', 10.0), ('e3', -1.0), ('edge', -1.0), ('lane', -1.0)]
> failed 1 ['--step-length', '.1', '--end', '1000'] 3/1to2/1_0 (72.0, 73.0) [('e2', 10.0), ('e3', -1.0), ('edge', -1.0), ('lane', -1.0)]
> failed 10 ['--step-length', '.1', '--end', '1000'] 3/1to2/1_0 (80.0, 90.0) [('e2', 10.0), ('e3', -1.0), ('edge', -1.0), ('lane', -1.0)]
> failed 100 ['--step-length', '.1', '--end', '1000'] 3/1to2/1_0 (100.0, 200.0) [('e1', -1.0), ('e2', 10.0), ('e3', -1.0), ('edge', -1.0), ('lane', -1.0)]
17,19c17,19
< success 0.1 ['--step-length', '1', '--end', '100'] ['3/1to2/1_0']
< success 1 ['--step-length', '1', '--end', '100'] ['3/1to2/1_0']
< success 10 ['--step-length', '1', '--end', '100'] ['3/1to2/1_0']
---
> failed 0.1 ['--step-length', '1', '--end', '100'] 3/1to2/1_0 (73.0, 74.0) [('e2', 10.0), ('e3', -1.0), ('edge', -1.0), ('lane', -1.0)]
> failed 1 ['--step-length', '1', '--end', '100'] 3/1to2/1_0 (73.0, 74.0) [('e2', 10.0), ('e3', -1.0), ('edge', -1.0), ('lane', -1.0)]
> failed 10 ['--step-length', '1', '--end', '100'] 3/1to2/1_0 (80.0, 90.0) [('e2', 10.0), ('e3', -1.0), ('edge', -1.0), ('lane', -1.0)]
21,50c21,24
< success 0.1 ['--step-length', '1', '--end', '1000'] ['3/1to2/1_0']
< success 1 ['--step-length', '1', '--end', '1000'] ['3/1to2/1_0']
< success 10 ['--step-length', '1', '--end', '1000'] ['3/1to2/1_0']
<truncated after showing first 30 lines>

TEST had known bugs (see #254) on ts-sim-mac-ba : sumo output teleport ( Last six runs Mar2022 )

different outputs from detectors which should detect the same
(This bug was triggered by text found in file 'output' matching 'failed')
---------- Differences in output ----------
1,98c1,48
< success ['--step-length', '.1', '--end', '51'] ['2/1to1/1_0']
< success ['--step-length', '.1', '--end', '51'] ['2/1to1/1_0', '1/1to0/1_0']
< success ['--step-length', '.1', '--end', '51'] ['2/1to1/1_0']
< success ['--step-length', '.1', '--end', '51'] ['2/1to1/1_0', '1/1to0/1_0']
< success ['--step-length', '.1', '--end', '51'] ['2/1to1/1_0']
< success ['--step-length', '.1', '--end', '51'] ['2/1to1/1_0', '1/1to0/1_0']
< success ['--step-length', '.1', '--end', '51'] ['2/1to1/1_0']
< success ['--step-length', '.1', '--end', '51'] ['2/1to1/1_0', '1/1to0/1_0']
< success ['--step-length', '.1', '--end', '100'] ['2/1to1/1_0']
< success ['--step-length', '.1', '--end', '100'] ['2/1to1/1_0', '1/1to0/1_0']
< success ['--step-length', '.1', '--end', '100'] ['2/1to1/1_0']
< success ['--step-length', '.1', '--end', '100'] ['2/1to1/1_0', '1/1to0/1_0']
< success ['--step-length', '.1', '--end', '100'] ['2/1to1/1_0']
< success ['--step-length', '.1', '--end', '100'] ['2/1to1/1_0', '1/1to0/1_0']
< success ['--step-length', '.1', '--end', '100'] ['2/1to1/1_0']
< success ['--step-length', '.1', '--end', '100'] ['2/1to1/1_0', '1/1to0/1_0']
< failed ['--step-length', '.1', '--end', '1000'] 2/1to1/1_0 (108.6, 108.7) [9.9, 10.0, 9.9, 9.9]
< failed ['--step-length', '.1', '--end', '1000'] 2/1to1/1_0 (108.6, 108.7) [9.9, 10.0, 9.9, 9.9]
< failed ['--step-length', '.1', '--end', '1000'] 2/1to1/1_0 (108.0, 109.0) [9.87, 10.0, 9.87, 9.87]
< failed ['--step-length', '.1', '--end', '1000'] 2/1to1/1_0 (108.0, 109.0) [9.87, 10.0, 9.87, 9.87]
< failed ['--step-length', '.1', '--end', '1000'] 2/1to1/1_0 (100.0, 110.0) [9.85, 9.96, 9.85, 9.85]
< failed ['--step-length', '.1', '--end', '1000'] 2/1to1/1_0 (100.0, 110.0) [9.85, 9.96, 9.85, 9.85]
< failed ['--step-length', '.1', '--end', '1000'] 2/1to1/1_0 (100.0, 200.0) [-1.0, 2.26, 3.2, 2.27, 2.27]
< failed ['--step-length', '.1', '--end', '1000'] 2/1to1/1_0 (100.0, 200.0) [-1.0, 2.26, 3.2, 2.27, 2.27]
< success ['--step-length', '1', '--end', '51'] ['2/1to1/1_0']
< success ['--step-length', '1', '--end', '51'] ['2/1to1/1_0', '1/1to0/1_0']
< success ['--step-length', '1', '--end', '51'] ['2/1to1/1_0']
< success ['--step-length', '1', '--end', '51'] ['2/1to1/1_0', '1/1to0/1_0']
< success ['--step-length', '1', '--end', '51'] ['2/1to1/1_0']
<truncated after showing first 30 lines>

TEST had known bugs (see #254) on ts-sim-mac-ba : sumo output teleport_multihop ( Last six runs Mar2022 )

different outputs from detectors which should detect the same
(This bug was triggered by text found in file 'output' matching 'failed')
---------- Differences in output ----------
17,24c17,24
< success 0.1 ['--step-length', '.1', '--end', '1000'] 2/1to1/1_0 (230.0, 230.1) [('e2', 9.99), ('e3', 10.0), ('edge', 9.99), ('lane', 9.99)]
< success 0.1 ['--step-length', '.1', '--end', '1000'] 1/1to0/1_0 (148.1, 148.2) [('e2', 9.99), ('e3', 10.0), ('edge', 9.99), ('lane', 9.99)]
< success 1 ['--step-length', '.1', '--end', '1000'] 2/1to1/1_0 (230.0, 231.0) [('e2', 9.99), ('e3', 10.0), ('edge', 9.99), ('lane', 9.99)]
< success 1 ['--step-length', '.1', '--end', '1000'] 1/1to0/1_0 (148.0, 149.0) [('e2', 9.91), ('e3', 10.0), ('edge', 9.91), ('lane', 9.91)]
< success 10 ['--step-length', '.1', '--end', '1000'] 2/1to1/1_0 (230.0, 240.0) [('e2', 9.42), ('e3', 9.9), ('edge', 9.42), ('lane', 9.42)]
< success 10 ['--step-length', '.1', '--end', '1000'] 1/1to0/1_0 (140.0, 150.0) [('e2', 9.96), ('e3', 9.99), ('edge', 9.96), ('lane', 9.96)]
< success 100 ['--step-length', '.1', '--end', '1000'] 2/1to1/1_0 (200.0, 300.0) [('e1', 10.0), ('e2', 9.22), ('e3', 5.71), ('edge', 9.22), ('lane', 9.22)]
< success 100 ['--step-length', '.1', '--end', '1000'] 1/1to0/1_0 (100.0, 200.0) [('e1', 9.53), ('e2', 5.82), ('e3', 6.93), ('edge', 5.82), ('lane', 5.82)]
---
> failed 0.1 ['--step-length', '.1', '--end', '1000'] 2/1to1/1_0 (148.9, 149.0) [('e2', 9.99), ('e3', 10.0), ('edge', 10.0), ('lane', 10.0)]
> failed 0.1 ['--step-length', '.1', '--end', '1000'] 2/1to1/1_0 (148.9, 149.0) [('e2', 9.99), ('e3', 10.0), ('edge', 10.0), ('lane', 10.0)]
> failed 1 ['--step-length', '.1', '--end', '1000'] 2/1to1/1_0 (149.0, 150.0) [('e2', 9.88), ('e3', 10.0), ('edge', 10.0), ('lane', 10.0)]
> failed 1 ['--step-length', '.1', '--end', '1000'] 2/1to1/1_0 (149.0, 150.0) [('e2', 9.88), ('e3', 10.0), ('edge', 10.0), ('lane', 10.0)]
> failed 10 ['--step-length', '.1', '--end', '1000'] 2/1to1/1_0 (140.0, 150.0) [('e2', 9.99), ('e3', 10.0), ('edge', 10.0), ('lane', 10.0)]
> failed 10 ['--step-length', '.1', '--end', '1000'] 2/1to1/1_0 (140.0, 150.0) [('e2', 9.99), ('e3', 10.0), ('edge', 10.0), ('lane', 10.0)]
> failed 100 ['--step-length', '.1', '--end', '1000'] 2/1to1/1_0 (100.0, 200.0) [('e1', 10.0), ('e2', 6.98), ('e3', 9.34), ('edge', 9.86), ('lane', 9.86)]
> failed 100 ['--step-length', '.1', '--end', '1000'] 2/1to1/1_0 (100.0, 200.0) [('e1', 10.0), ('e2', 6.98), ('e3', 9.34), ('edge', 9.86), ('lane', 9.86)]
41,98c41,48
< success 0.1 ['--step-length', '1', '--end', '1000'] 2/1to1/1_0 (245.0, 246.0) [('e2', 8.92), ('e3', 10.0), ('edge', 8.92), ('lane', 8.92)]
< success 0.1 ['--step-length', '1', '--end', '1000'] 1/1to0/1_0 (150.0, 151.0) [('e2', 9.82), ('e3', 10.0), ('edge', 9.82), ('lane', 9.82)]
< success 1 ['--step-length', '1', '--end', '1000'] 2/1to1/1_0 (245.0, 246.0) [('e2', 8.92), ('e3', 10.0), ('edge', 8.92), ('lane', 8.92)]
< success 1 ['--step-length', '1', '--end', '1000'] 1/1to0/1_0 (150.0, 151.0) [('e2', 9.82), ('e3', 10.0), ('edge', 9.82), ('lane', 9.82)]
< success 10 ['--step-length', '1', '--end', '1000'] 2/1to1/1_0 (240.0, 250.0) [('e2', 9.9), ('e3', 10.0), ('edge', 9.9), ('lane', 9.9)]
< success 10 ['--step-length', '1', '--end', '1000'] 1/1to0/1_0 (150.0, 160.0) [('e2', 9.15), ('e3', 9.84), ('edge', 9.15), ('lane', 9.15)]
< success 100 ['--step-length', '1', '--end', '1000'] 2/1to1/1_0 (200.0, 300.0) [('e1', 10.0), ('e2', 9.41), ('e3', 5.84), ('edge', 9.41), ('lane', 9.41)]
< success 100 ['--step-length', '1', '--end', '1000'] 1/1to0/1_0 (100.0, 200.0) [('e1', 10.0), ('e2', 5.94), ('e3', 7.08), ('edge', 5.94), ('lane', 5.94)]
< -- Unordered text as found by filter '^Loading configuration ... done.' --
< Loading configuration ... done.
< Loading configuration ... done.
<truncated after showing first 30 lines>

TEST had known bugs (see #254) on ts-sim-mac-ba : sumo output teleport_multihop_newDefaults ( Last six runs Mar2022 )

different outputs from detectors which should detect the same
(This bug was triggered by text found in file 'output' matching 'failed')
---------- Differences in output ----------
9,24c9,24
< failed 0.1 ['--step-length', '.1', '--end', '100'] 2/1to1/1_0 (76.2, 76.3) [('e2', 10.49), ('e3', 10.35), ('edge', 10.49), ('lane', 10.49)]
< failed 0.1 ['--step-length', '.1', '--end', '100'] 2/1to1/1_0 (76.2, 76.3) [('e2', 10.49), ('e3', 10.35), ('edge', 10.49), ('lane', 10.49)]
< failed 1 ['--step-length', '.1', '--end', '100'] 2/1to1/1_0 (76.0, 77.0) [('e2', 10.39), ('e3', 10.35), ('edge', 10.39), ('lane', 10.39)]
< failed 1 ['--step-length', '.1', '--end', '100'] 2/1to1/1_0 (76.0, 77.0) [('e2', 10.39), ('e3', 10.35), ('edge', 10.39), ('lane', 10.39)]
< failed 10 ['--step-length', '.1', '--end', '100'] 2/1to1/1_0 (70.0, 80.0) [('e2', 10.42), ('e3', 10.25), ('edge', 10.42), ('lane', 10.42)]
< failed 10 ['--step-length', '.1', '--end', '100'] 2/1to1/1_0 (70.0, 80.0) [('e2', 10.42), ('e3', 10.25), ('edge', 10.42), ('lane', 10.42)]
< failed 100 ['--step-length', '.1', '--end', '100'] 2/1to1/1_0 (0.0, 100.0) [('e1', 10.27), ('e2', 10.24), ('e3', 9.59), ('edge', 10.24), ('lane', 10.24)]
< failed 100 ['--step-length', '.1', '--end', '100'] 2/1to1/1_0 (0.0, 100.0) [('e1', 10.27), ('e2', 10.24), ('e3', 9.59), ('edge', 10.24), ('lane', 10.24)]
< failed 0.1 ['--step-length', '.1', '--end', '1000'] 2/1to1/1_0 (76.2, 76.3) [('e2', 10.49), ('e3', 10.35), ('edge', 10.49), ('lane', 10.49)]
< failed 0.1 ['--step-length', '.1', '--end', '1000'] 2/1to1/1_0 (76.2, 76.3) [('e2', 10.49), ('e3', 10.35), ('edge', 10.49), ('lane', 10.49)]
< failed 1 ['--step-length', '.1', '--end', '1000'] 2/1to1/1_0 (76.0, 77.0) [('e2', 10.39), ('e3', 10.35), ('edge', 10.39), ('lane', 10.39)]
< failed 1 ['--step-length', '.1', '--end', '1000'] 2/1to1/1_0 (76.0, 77.0) [('e2', 10.39), ('e3', 10.35), ('edge', 10.39), ('lane', 10.39)]
< failed 10 ['--step-length', '.1', '--end', '1000'] 2/1to1/1_0 (70.0, 80.0) [('e2', 10.42), ('e3', 10.25), ('edge', 10.42), ('lane', 10.42)]
< failed 10 ['--step-length', '.1', '--end', '1000'] 2/1to1/1_0 (70.0, 80.0) [('e2', 10.42), ('e3', 10.25), ('edge', 10.42), ('lane', 10.42)]
< failed 100 ['--step-length', '.1', '--end', '1000'] 2/1to1/1_0 (0.0, 100.0) [('e1', 10.27), ('e2', 10.24), ('e3', 9.59), ('edge', 10.24), ('lane', 10.24)]
< failed 100 ['--step-length', '.1', '--end', '1000'] 2/1to1/1_0 (0.0, 100.0) [('e1', 10.27), ('e2', 10.24), ('e3', 9.59), ('edge', 10.24), ('lane', 10.24)]
---
> failed 0.1 ['--step-length', '.1', '--end', '100'] 2/1to1/1_0 (70.9, 71.0) [('e2', 10.52), ('e3', 10.35), ('edge', 10.52), ('lane', 10.52)]
> failed 0.1 ['--step-length', '.1', '--end', '100'] 2/1to1/1_0 (70.9, 71.0) [('e2', 10.52), ('e3', 10.35), ('edge', 10.52), ('lane', 10.52)]
> failed 1 ['--step-length', '.1', '--end', '100'] 2/1to1/1_0 (70.0, 71.0) [('e2', 10.59), ('e3', 10.35), ('edge', 10.59), ('lane', 10.59)]
> failed 1 ['--step-length', '.1', '--end', '100'] 2/1to1/1_0 (70.0, 71.0) [('e2', 10.59), ('e3', 10.35), ('edge', 10.59), ('lane', 10.59)]
> failed 10 ['--step-length', '.1', '--end', '100'] 2/1to1/1_0 (70.0, 80.0) [('e2', 10.23), ('e3', 10.15), ('edge', 10.23), ('lane', 10.23)]
> failed 10 ['--step-length', '.1', '--end', '100'] 2/1to1/1_0 (70.0, 80.0) [('e2', 10.23), ('e3', 10.15), ('edge', 10.23), ('lane', 10.23)]
> failed 100 ['--step-length', '.1', '--end', '100'] 2/1to1/1_0 (0.0, 100.0) [('e1', 10.15), ('e2', 10.1), ('e3', 10.05), ('edge', 10.1), ('lane', 10.1)]
> failed 100 ['--step-length', '.1', '--end', '100'] 2/1to1/1_0 (0.0, 100.0) [('e1', 10.15), ('e2', 10.1), ('e3', 10.05), ('edge', 10.1), ('lane', 10.1)]
> failed 0.1 ['--step-length', '.1', '--end', '1000'] 2/1to1/1_0 (70.9, 71.0) [('e2', 10.52), ('e3', 10.35), ('edge', 10.52), ('lane', 10.52)]
> failed 0.1 ['--step-length', '.1', '--end', '1000'] 2/1to1/1_0 (70.9, 71.0) [('e2', 10.52), ('e3', 10.35), ('edge', 10.52), ('lane', 10.52)]
> failed 1 ['--step-length', '.1', '--end', '1000'] 2/1to1/1_0 (70.0, 71.0) [('e2', 10.59), ('e3', 10.35), ('edge', 10.59), ('lane', 10.59)]
> failed 1 ['--step-length', '.1', '--end', '1000'] 2/1to1/1_0 (70.0, 71.0) [('e2', 10.59), ('e3', 10.35), ('edge', 10.59), ('lane', 10.59)]
<truncated after showing first 30 lines>

TEST had known bugs (see #254) on ts-sim-mac-ba : sumo output two_same_vehicles ( Last six runs Mar2022 )

different outputs from detectors which should detect the same
(This bug was triggered by text found in file 'output' matching 'failed')
---------- Differences in output ----------
5,7c5,7
< success 0.1 ['--step-length', '.1', '--end', '100'] ['3/1to2/1_0']
< success 1 ['--step-length', '.1', '--end', '100'] ['3/1to2/1_0']
< success 10 ['--step-length', '.1', '--end', '100'] ['3/1to2/1_0']
---
> failed 0.1 ['--step-length', '.1', '--end', '100'] 3/1to2/1_0 (75.4, 75.5) [('e2', 10.0), ('e3', -1.0), ('edge', -1.0), ('lane', -1.0)]
> failed 1 ['--step-length', '.1', '--end', '100'] 3/1to2/1_0 (76.0, 77.0) [('e2', 10.0), ('e3', -1.0), ('edge', -1.0), ('lane', -1.0)]
> failed 10 ['--step-length', '.1', '--end', '100'] 3/1to2/1_0 (80.0, 90.0) [('e2', 10.0), ('e3', -1.0), ('edge', -1.0), ('lane', -1.0)]
9,12c9,12
< success 0.1 ['--step-length', '.1', '--end', '1000'] ['3/1to2/1_0']
< success 1 ['--step-length', '.1', '--end', '1000'] ['3/1to2/1_0']
< success 10 ['--step-length', '.1', '--end', '1000'] ['3/1to2/1_0']
< success 100 ['--step-length', '.1', '--end', '1000'] ['3/1to2/1_0']
---
> failed 0.1 ['--step-length', '.1', '--end', '1000'] 3/1to2/1_0 (75.4, 75.5) [('e2', 10.0), ('e3', -1.0), ('edge', -1.0), ('lane', -1.0)]
> failed 1 ['--step-length', '.1', '--end', '1000'] 3/1to2/1_0 (76.0, 77.0) [('e2', 10.0), ('e3', -1.0), ('edge', -1.0), ('lane', -1.0)]
> failed 10 ['--step-length', '.1', '--end', '1000'] 3/1to2/1_0 (80.0, 90.0) [('e2', 10.0), ('e3', -1.0), ('edge', -1.0), ('lane', -1.0)]
> failed 100 ['--step-length', '.1', '--end', '1000'] 3/1to2/1_0 (100.0, 200.0) [('e1', -1.0), ('e2', 10.0), ('e3', -1.0), ('edge', -1.0), ('lane', -1.0)]
17,19c17,19
< success 0.1 ['--step-length', '1', '--end', '100'] ['3/1to2/1_0']
< success 1 ['--step-length', '1', '--end', '100'] ['3/1to2/1_0']
< success 10 ['--step-length', '1', '--end', '100'] ['3/1to2/1_0']
---
> failed 0.1 ['--step-length', '1', '--end', '100'] 3/1to2/1_0 (77.0, 78.0) [('e2', 10.0), ('e3', -1.0), ('edge', -1.0), ('lane', -1.0)]
> failed 1 ['--step-length', '1', '--end', '100'] 3/1to2/1_0 (77.0, 78.0) [('e2', 10.0), ('e3', -1.0), ('edge', -1.0), ('lane', -1.0)]
> failed 10 ['--step-length', '1', '--end', '100'] 3/1to2/1_0 (80.0, 90.0) [('e2', 10.0), ('e3', -1.0), ('edge', -1.0), ('lane', -1.0)]
21,50c21,24
< success 0.1 ['--step-length', '1', '--end', '1000'] ['3/1to2/1_0']
< success 1 ['--step-length', '1', '--end', '1000'] ['3/1to2/1_0']
< success 10 ['--step-length', '1', '--end', '1000'] ['3/1to2/1_0']
<truncated after showing first 30 lines>

TEST had known bugs (see #254) on ts-sim-mac-ba : sumo output two_vehicles_diff_length ( Last six runs Mar2022 )

different outputs from detectors which should detect the same
(This bug was triggered by text found in file 'output' matching 'failed')
---------- Differences in output ----------
5,7c5,7
< success 0.1 ['--step-length', '.1', '--end', '100'] ['3/1to2/1_0']
< success 1 ['--step-length', '.1', '--end', '100'] ['3/1to2/1_0']
< success 10 ['--step-length', '.1', '--end', '100'] ['3/1to2/1_0']
---
> failed 0.1 ['--step-length', '.1', '--end', '100'] 3/1to2/1_0 (76.4, 76.5) [('e2', 10.0), ('e3', -1.0), ('edge', -1.0), ('lane', -1.0)]
> failed 1 ['--step-length', '.1', '--end', '100'] 3/1to2/1_0 (77.0, 78.0) [('e2', 10.0), ('e3', -1.0), ('edge', -1.0), ('lane', -1.0)]
> failed 10 ['--step-length', '.1', '--end', '100'] 3/1to2/1_0 (80.0, 90.0) [('e2', 10.0), ('e3', -1.0), ('edge', -1.0), ('lane', -1.0)]
9,12c9,12
< success 0.1 ['--step-length', '.1', '--end', '1000'] ['3/1to2/1_0']
< success 1 ['--step-length', '.1', '--end', '1000'] ['3/1to2/1_0']
< success 10 ['--step-length', '.1', '--end', '1000'] ['3/1to2/1_0']
< success 100 ['--step-length', '.1', '--end', '1000'] ['3/1to2/1_0']
---
> failed 0.1 ['--step-length', '.1', '--end', '1000'] 3/1to2/1_0 (76.4, 76.5) [('e2', 10.0), ('e3', -1.0), ('edge', -1.0), ('lane', -1.0)]
> failed 1 ['--step-length', '.1', '--end', '1000'] 3/1to2/1_0 (77.0, 78.0) [('e2', 10.0), ('e3', -1.0), ('edge', -1.0), ('lane', -1.0)]
> failed 10 ['--step-length', '.1', '--end', '1000'] 3/1to2/1_0 (80.0, 90.0) [('e2', 10.0), ('e3', -1.0), ('edge', -1.0), ('lane', -1.0)]
> failed 100 ['--step-length', '.1', '--end', '1000'] 3/1to2/1_0 (100.0, 200.0) [('e1', -1.0), ('e2', 10.0), ('e3', -1.0), ('edge', -1.0), ('lane', -1.0)]
17,19c17,19
< success 0.1 ['--step-length', '1', '--end', '100'] ['3/1to2/1_0']
< success 1 ['--step-length', '1', '--end', '100'] ['3/1to2/1_0']
< success 10 ['--step-length', '1', '--end', '100'] ['3/1to2/1_0']
---
> failed 0.1 ['--step-length', '1', '--end', '100'] 3/1to2/1_0 (78.0, 79.0) [('e2', 10.0), ('e3', -1.0), ('edge', -1.0), ('lane', -1.0)]
> failed 1 ['--step-length', '1', '--end', '100'] 3/1to2/1_0 (78.0, 79.0) [('e2', 10.0), ('e3', -1.0), ('edge', -1.0), ('lane', -1.0)]
> failed 10 ['--step-length', '1', '--end', '100'] 3/1to2/1_0 (80.0, 90.0) [('e2', 10.0), ('e3', -1.0), ('edge', -1.0), ('lane', -1.0)]
21,50c21,24
< success 0.1 ['--step-length', '1', '--end', '1000'] ['3/1to2/1_0']
< success 1 ['--step-length', '1', '--end', '1000'] ['3/1to2/1_0']
< success 10 ['--step-length', '1', '--end', '1000'] ['3/1to2/1_0']
<truncated after showing first 30 lines>

TEST had known bugs (see #254) on ts-sim-mac-ba : sumo output two_vehicles_diff_speed ( Last six runs Mar2022 )

different outputs from detectors which should detect the same
(This bug was triggered by text found in file 'output' matching 'failed')
---------- Differences in output ----------
0a1,24
> failed 0.1 ['--step-length', '.1', '--end', '51'] 3/1to2/1_0 (38.4, 38.5) [('e2', 9.6), ('e3', 9.5), ('edge', 9.6), ('lane', 9.6)]
> failed 1 ['--step-length', '.1', '--end', '51'] 3/1to2/1_0 (38.0, 39.0) [('e2', 9.64), ('e3', 9.5), ('edge', 9.64), ('lane', 9.64)]
> failed 10 ['--step-length', '.1', '--end', '51'] 3/1to2/1_0 (30.0, 40.0) [('e2', 9.86), ('e3', 9.5), ('edge', 9.86), ('lane', 9.86)]
> failed 100 ['--step-length', '.1', '--end', '51'] 3/1to2/1_0 (0.0, 51.0) [('e2', 9.62), ('e3', 9.5), ('edge', 9.62), ('lane', 9.62)]
> failed 0.1 ['--step-length', '.1', '--end', '100'] 3/1to2/1_0 (38.4, 38.5) [('e2', 9.6), ('e3', 9.5), ('edge', 9.6), ('lane', 9.6)]
> failed 1 ['--step-length', '.1', '--end', '100'] 3/1to2/1_0 (38.0, 39.0) [('e2', 9.64), ('e3', 9.5), ('edge', 9.64), ('lane', 9.64)]
> failed 10 ['--step-length', '.1', '--end', '100'] 3/1to2/1_0 (30.0, 40.0) [('e2', 9.86), ('e3', 9.5), ('edge', 9.86), ('lane', 9.86)]
> failed 100 ['--step-length', '.1', '--end', '100'] 3/1to2/1_0 (0.0, 100.0) [('e1', 9.5), ('e2', 9.53), ('e3', 9.5), ('edge', 9.47), ('lane', 9.47)]
> failed 0.1 ['--step-length', '.1', '--end', '1000'] 3/1to2/1_0 (38.4, 38.5) [('e2', 9.6), ('e3', 9.5), ('edge', 9.6), ('lane', 9.6)]
> failed 1 ['--step-length', '.1', '--end', '1000'] 3/1to2/1_0 (38.0, 39.0) [('e2', 9.64), ('e3', 9.5), ('edge', 9.64), ('lane', 9.64)]
> failed 10 ['--step-length', '.1', '--end', '1000'] 3/1to2/1_0 (30.0, 40.0) [('e2', 9.86), ('e3', 9.5), ('edge', 9.86), ('lane', 9.86)]
> failed 100 ['--step-length', '.1', '--end', '1000'] 3/1to2/1_0 (0.0, 100.0) [('e1', 9.5), ('e2', 9.53), ('e3', 9.5), ('edge', 9.47), ('lane', 9.47)]
> failed 0.1 ['--step-length', '1', '--end', '51'] 3/1to2/1_0 (39.0, 40.0) [('e2', 9.6), ('e3', 9.5), ('edge', 9.6), ('lane', 9.6)]
> failed 1 ['--step-length', '1', '--end', '51'] 3/1to2/1_0 (39.0, 40.0) [('e2', 9.6), ('e3', 9.5), ('edge', 9.6), ('lane', 9.6)]
> failed 10 ['--step-length', '1', '--end', '51'] 3/1to2/1_0 (30.0, 40.0) [('e2', 9.93), ('e3', 9.5), ('edge', 9.93), ('lane', 9.93)]
> failed 100 ['--step-length', '1', '--end', '51'] 3/1to2/1_0 (0.0, 51.0) [('e2', 9.63), ('e3', 9.5), ('edge', 9.63), ('lane', 9.63)]
> failed 0.1 ['--step-length', '1', '--end', '100'] 3/1to2/1_0 (39.0, 40.0) [('e2', 9.6), ('e3', 9.5), ('edge', 9.6), ('lane', 9.6)]
> failed 1 ['--step-length', '1', '--end', '100'] 3/1to2/1_0 (39.0, 40.0) [('e2', 9.6), ('e3', 9.5), ('edge', 9.6), ('lane', 9.6)]
> failed 10 ['--step-length', '1', '--end', '100'] 3/1to2/1_0 (30.0, 40.0) [('e2', 9.93), ('e3', 9.5), ('edge', 9.93), ('lane', 9.93)]
> failed 100 ['--step-length', '1', '--end', '100'] 3/1to2/1_0 (0.0, 100.0) [('e1', 9.5), ('e2', 9.53), ('e3', 9.5), ('edge', 9.47), ('lane', 9.47)]
> failed 0.1 ['--step-length', '1', '--end', '1000'] 3/1to2/1_0 (39.0, 40.0) [('e2', 9.6), ('e3', 9.5), ('edge', 9.6), ('lane', 9.6)]
> failed 1 ['--step-length', '1', '--end', '1000'] 3/1to2/1_0 (39.0, 40.0) [('e2', 9.6), ('e3', 9.5), ('edge', 9.6), ('lane', 9.6)]
> failed 10 ['--step-length', '1', '--end', '1000'] 3/1to2/1_0 (30.0, 40.0) [('e2', 9.93), ('e3', 9.5), ('edge', 9.93), ('lane', 9.93)]
> failed 100 ['--step-length', '1', '--end', '1000'] 3/1to2/1_0 (0.0, 100.0) [('e1', 9.5), ('e2', 9.53), ('e3', 9.5), ('edge', 9.47), ('lane', 9.47)]

TEST had known bugs (see #3263) on ts-sim-mac-ba : traci vehicle moveToXY keepRoute2 ( Last six runs Mar2022 )

mapping failure
(This bug was triggered by text found in file 'output' matching 'failed')
---------- Differences in output ----------
0a1
> internal corner (inside, segment2) failed: x=198, x2=198.0,   y=1.9, y2=1.9,   lane=middle_0, lane2=middle_0, pos=102, pos2=98.0   posLat=2.0 posLat2=1.9

TEST had known bugs (see #6192) on ts-sim-mac-ba : traci vehicle openGap with_low_maxDecel_fast_CACC ( Last six runs Mar2022 )

not even failing as intended
(This bug was triggered by text found in file 'errors' matching 'Error')
---------- Differences in errors ----------
0a1,8
> Traceback (most recent call last):
>   File "/Users/sumo/clangMacOS/sumo/tests/../tests/complex/traci/vehicle/openGap/runner.py", line 155, in <module>
>     runSingle(targetTimeHeadway, targetSpaceHeadway, duration, changeRate, maxDecel, refVehID)
>   File "/Users/sumo/clangMacOS/sumo/tests/../tests/complex/traci/vehicle/openGap/runner.py", line 65, in runSingle
>     leader = results[tc.VAR_LEADER][0]
> TypeError: 'NoneType' object has no attribute '__getitem__'
> Error: tcpip::Socket::recvAndCheck @ recv: peer shutdown
> Quitting (on error).
---------- Differences in output ----------
3,102c3,102
< Time 2.0: Gap 'follower'->'leader' = 5.938 (headway=0.367)
< 'follower' speed = 16.161582708
< Time 3.0: Gap 'follower'->'leader' = 8.966 (headway=0.528)
< 'follower' speed = 16.9836198736
< Time 4.0: Gap 'follower'->'leader' = 11.281 (headway=0.641)
< 'follower' speed = 17.5863190784
< Time 5.0: Gap 'follower'->'leader' = 13.069 (headway=0.725)
< 'follower' speed = 18.0379935645
< Time 6.0: Gap 'follower'->'leader' = 14.459 (headway=0.787)
< 'follower' speed = 18.3815472225
< Time 7.0: Gap 'follower'->'leader' = 15.545 (headway=0.834)
< 'follower' speed = 18.6456171431
< Time 8.0: Gap 'follower'->'leader' = 16.397 (headway=0.870)
< 'follower' speed = 18.8501483763
< Time 9.0: Gap 'follower'->'leader' = 17.068 (headway=0.898)
< 'follower' speed = 19.0094667411
< Time 10.0: Gap 'follower'->'leader' = 17.596 (headway=0.920)
< 'follower' speed = 19.1340998278
< Time 11.0: Gap 'follower'->'leader' = 18.013 (headway=0.937)
< 'follower' speed = 19.231918606
< Time 12.0: Gap 'follower'->'leader' = 18.342 (headway=0.950)
< 'follower' speed = 19.3088858604
< Time 13.0: Gap 'follower'->'leader' = 18.603 (headway=0.960)
< 'follower' speed = 19.3695649077
< Time 14.0: Gap 'follower'->'leader' = 18.810 (headway=0.969)
< 'follower' speed = 19.4174756866
< Time 15.0: Gap 'follower'->'leader' = 18.973 (headway=0.975)
< 'follower' speed = 19.4553500651
< Time 16.0: Gap 'follower'->'leader' = 19.103 (headway=0.980)
<truncated after showing first 30 lines>

Detailed information for the tests that were terminated before completion:

TEST were terminated before completion (TIMEOUT) on ts-sim-mac-ba : traci connection busySocket sumo ( Last six runs Mar2022 )

Test exceeded wallclock time limit of 900.0 seconds
---------- Differences in errors ----------
3d2
< Could not connect in 61 tries

TEST were terminated before completion (TIMEOUT) on ts-sim-mac-ba : traci connection busySocket sumo-gui ( Last six runs Mar2022 )

Test exceeded wallclock time limit of 900.0 seconds
---------- Differences in errors ----------
1,3c1
< Could not connect in 61 tries
< Error: tcpip::Socket::accept() Unable to create listening socket: Address already in use
< Quitting (on error).
---
> FXApp::openDisplay: unable to open display :0.0