20Mar22rv1_12_0+1541-77deb7a3227 - detailed test results for NETEDITCHECKOUTPUT

To reconnect the TextTest GUI to these results, run:

texttest -a neteditcheckoutput -d /Users/sumo/clangMacOS/sumo/tests -reconnect /Users/sumo/clangMacOS/texttesttmp/clangMacOS.31Mar000857.99350 -g

To start TextTest for these tests, run:

texttest -a neteditcheckoutput -d /Users/sumo/clangMacOS/sumo/tests


default: 3181 tests: 2956 succeeded 193 known bugs 32 FAILED

Detailed information for the tests that FAILED:

TEST FAILED on ts-sim-mac-ba : bugs additionals ticket3879 ( Last six runs Mar2022 )

---------- Differences in errors ----------
0a1,6
> Error: Attribute 'edges' in definition of rerouter 'rerouter_0' is empty.
> Error: The edge to use within MSTriggeredRerouter 'rerouter_0' is not known.
> Error: Attribute 'lanes' in definition of variableSpeedSign 'variableSpeedSign_0' is empty.
> Error: Attribute 'lanes' in definition of variableSpeedSign 'variableSpeedSign_0' is empty.
> Error: The lanes to use within MSLaneSpeedTrigger 'variableSpeedSign_0' are not known.
> Quitting (on error).
---------- New result in exitcode ----------
1

2 TESTS FAILED on ts-sim-mac-ba :

---------- Differences in errors ----------
0a1,2
> Error: File 'additionals.netedit' is not accessible (No such file or directory).
> Quitting (on error).
---------- New result in exitcode ----------
1
bugs processing ticket3071 ( Last six runs Mar2022 )
volatileRecomputing abort-recomputing ( Last six runs Mar2022 )

2 TESTS FAILED on ts-sim-mac-ba :

---------- New result in errors ----------
Error: Could not access configuration 'sumo.sumocfg'.
Quitting (on error).
bugs ticket4528 ( Last six runs Mar2022 )
bugs ticket5540 ( Last six runs Mar2022 )

TEST FAILED on ts-sim-mac-ba : demandElements flow inspect via ( Last six runs Mar2022 )

---------- Differences in errors ----------
0a1,3
> Warning: No connection between edge 'gneE2' and edge 'gneE8' found.
> Error: Vehicle 'f_0.0' has no valid route from edge 'gneE2' to stop edge 'gneE8'.
> Quitting (on error).
---------- New result in exitcode ----------
1

TEST FAILED on ts-sim-mac-ba : demandElements flow_embedded inspect_selection departPos random_free ( Last six runs Mar2022 )

---------- Differences in errors ----------
143,152d142
< Error: Vehicle 'flowB.15' will not be able to depart using the given velocity (junction 'gneJ6' too close)!
< Error: Vehicle 'flowB.15' will not be able to depart using the given velocity (junction 'gneJ6' too close)!
< Error: Vehicle 'flowB.15' will not be able to depart using the given velocity (junction 'gneJ6' too close)!
< Error: Vehicle 'flowB.15' will not be able to depart using the given velocity (junction 'gneJ6' too close)!
< Error: Vehicle 'flowB.15' will not be able to depart using the given velocity (junction 'gneJ6' too close)!
< Error: Vehicle 'flowB.15' will not be able to depart using the given velocity (junction 'gneJ6' too close)!
< Error: Vehicle 'flowB.15' will not be able to depart using the given velocity (junction 'gneJ6' too close)!
< Error: Vehicle 'flowB.15' will not be able to depart using the given velocity (junction 'gneJ6' too close)!
< Error: Vehicle 'flowB.15' will not be able to depart using the given velocity (junction 'gneJ6' too close)!
< Error: Vehicle 'flowB.15' will not be able to depart using the given velocity (junction 'gneJ6' too close)!

TEST FAILED on ts-sim-mac-ba : demandElements flow_embedded load route ( Last six runs Mar2022 )

---------- Differences in errors ----------
0a1,2
> Error: Vehicle 'vehicle_2.0' has no valid route. No connection between edge 'gneE2' and edge 'gneE5'.
> Quitting (on error).
---------- New result in exitcode ----------
1

TEST FAILED on ts-sim-mac-ba : demandElements personFlow create departPos ( Last six runs Mar2022 )

---------- Differences in errors ----------
1c1,5
< Warning: Invalid departPos 5000.00 given for stopping at gneE2. Using edge end instead.
---
> Error: attribute 'vehsPerHour' is not declared for element 'personFlow'
>  In file 'routes.netedit'
>  At line/column 8/103.
> 
> Quitting (on error).
---------- New result in exitcode ----------
1

TEST FAILED on ts-sim-mac-ba : demandElements route fix save ( Last six runs Mar2022 )

---------- Differences in errors ----------
0a1,2
> Error: The route file 'routes.netedit' is not accessible.
> Quitting (on error).
---------- New result in exitcode ----------
1

TEST FAILED on ts-sim-mac-ba : demandElements routeflow inspect_selection departPos random_free ( Last six runs Mar2022 )

---------- Differences in errors ----------
6d5
< Error: Vehicle 'flowB.11' will not be able to depart using the given velocity (slow lane ahead)!

2 TESTS FAILED on ts-sim-mac-ba :

---------- Differences in errors ----------
1,12c1,12
< Warning: Teleporting vehicle 'flow.3'; waited too long (jam), lane=':gneJ1_0_0', time=320.00.
< Warning: Vehicle 'flow.3' teleports beyond arrival edge 'gneE1', time=346.00.
< Warning: Vehicle 'flow.3' skips stop on lane 'gneE1_0' time=346.00.
< Warning: Teleporting vehicle 'flow.4'; waited too long (jam), lane=':gneJ1_0_0', time=626.00.
< Warning: Vehicle 'flow.4' teleports beyond arrival edge 'gneE1', time=652.00.
< Warning: Vehicle 'flow.4' skips stop on lane 'gneE1_0' time=652.00.
< Warning: Teleporting vehicle 'flow.5'; waited too long (jam), lane=':gneJ1_0_0', time=932.00.
< Warning: Vehicle 'flow.5' teleports beyond arrival edge 'gneE1', time=958.00.
< Warning: Vehicle 'flow.5' skips stop on lane 'gneE1_0' time=958.00.
< Warning: Teleporting vehicle 'flow.6'; waited too long (jam), lane=':gneJ1_0_0', time=1238.00.
< Warning: Vehicle 'flow.6' teleports beyond arrival edge 'gneE1', time=1264.00.
< Warning: Vehicle 'flow.6' skips stop on lane 'gneE1_0' time=1264.00.
---
> Warning: Teleporting vehicle 'flow.2'; waited too long (blocked), lane='gneE1_0', time=318.00.
> Warning: Vehicle 'flow.2' teleports beyond arrival edge 'gneE1', time=318.00.
> Warning: Vehicle 'flow.2' skips stop on lane 'gneE1_0' time=318.00.
> Warning: Teleporting vehicle 'flow.3'; waited too long (blocked), lane='gneE1_0', time=623.00.
> Warning: Vehicle 'flow.3' teleports beyond arrival edge 'gneE1', time=623.00.
> Warning: Vehicle 'flow.3' skips stop on lane 'gneE1_0' time=623.00.
> Warning: Teleporting vehicle 'flow.4'; waited too long (blocked), lane='gneE1_0', time=928.00.
> Warning: Vehicle 'flow.4' teleports beyond arrival edge 'gneE1', time=928.00.
> Warning: Vehicle 'flow.4' skips stop on lane 'gneE1_0' time=928.00.
> Warning: Teleporting vehicle 'flow.5'; waited too long (blocked), lane='gneE1_0', time=1234.00.
> Warning: Vehicle 'flow.5' teleports beyond arrival edge 'gneE1', time=1234.00.
> Warning: Vehicle 'flow.5' skips stop on lane 'gneE1_0' time=1234.00.
demandElements stop chargingstation create triggered_join ( Last six runs Mar2022 )
demandElements stop chargingstation inspect triggered_join ( Last six runs Mar2022 )

2 TESTS FAILED on ts-sim-mac-ba :

---------- Differences in errors ----------
1,5c1,9
< Warning: Teleporting vehicle 'routeFlow.3'; waited too long (jam), lane='gneE0_0', time=906.00.
< Warning: Vehicle 'routeFlow.3' ends teleporting on edge 'gneE1', time=906.00.
< Warning: Teleporting vehicle 'routeFlow.4'; waited too long (jam), lane='gneE0_0', time=1211.00.
< Warning: Vehicle 'routeFlow.4' teleports beyond arrival edge 'gneE1', time=1237.00.
< Warning: Vehicle 'routeFlow.4' skips stop on lane 'gneE1_0' time=1237.00.
---
> Warning: Teleporting vehicle 'routeFlow.2'; waited too long (blocked), lane='gneE1_0', time=710.00.
> Warning: Vehicle 'routeFlow.2' teleports beyond arrival edge 'gneE1', time=710.00.
> Warning: Vehicle 'routeFlow.2' skips stop on lane 'gneE1_0' time=710.00.
> Warning: Teleporting vehicle 'routeFlow.3'; waited too long (blocked), lane='gneE1_0', time=1017.00.
> Warning: Vehicle 'routeFlow.3' teleports beyond arrival edge 'gneE1', time=1017.00.
> Warning: Vehicle 'routeFlow.3' skips stop on lane 'gneE1_0' time=1017.00.
> Warning: Teleporting vehicle 'routeFlow.4'; waited too long (blocked), lane='gneE1_0', time=1321.00.
> Warning: Vehicle 'routeFlow.4' teleports beyond arrival edge 'gneE1', time=1321.00.
> Warning: Vehicle 'routeFlow.4' skips stop on lane 'gneE1_0' time=1321.00.
demandElements stop lane create triggered_join ( Last six runs Mar2022 )
demandElements stop lane inspect triggered_join ( Last six runs Mar2022 )

TEST FAILED on ts-sim-mac-ba : demandElements stop lane volatileRecomputing ( Last six runs Mar2022 )

---------- Differences in errors ----------
0a1,16
> Error: The busStop 'busStopC' is not known  in route 'route_0'..
> Error: A stop must be placed on a busStop, a chargingStation, an overheadWireSegment, a containerStop, a parkingArea, an edge or a lane in route 'route_0'.
> Error: The busStop 'busStopD' is not known  in route 'route_0'..
> Error: A stop must be placed on a busStop, a chargingStation, an overheadWireSegment, a containerStop, a parkingArea, an edge or a lane in route 'route_0'.
> Error: The busStop 'busStopE' is not known  in route 'route_0'..
> Error: A stop must be placed on a busStop, a chargingStation, an overheadWireSegment, a containerStop, a parkingArea, an edge or a lane in route 'route_0'.
> Error: The busStop 'busStopF' is not known  in route 'route_0'..
> Error: A stop must be placed on a busStop, a chargingStation, an overheadWireSegment, a containerStop, a parkingArea, an edge or a lane in route 'route_0'.
> Error: The busStop 'busStopG' is not known  in route 'route_0'..
> Error: A stop must be placed on a busStop, a chargingStation, an overheadWireSegment, a containerStop, a parkingArea, an edge or a lane in route 'route_0'.
> Error: The busStop 'busStopH' is not known  in route 'route_0'..
> Error: A stop must be placed on a busStop, a chargingStation, an overheadWireSegment, a containerStop, a parkingArea, an edge or a lane in route 'route_0'.
> Error: The busStop 'busStopA' is not known  in route 'route_1'..
> Error: A stop must be placed on a busStop, a chargingStation, an overheadWireSegment, a containerStop, a parkingArea, an edge or a lane in route 'route_1'.
> Error: The busStop 'busStopB' is not known  in route 'route_1'..
> Error: A stop must be placed on a busStop, a chargingStation, an overheadWireSegment, a containerStop, a parkingArea, an edge or a lane in route 'route_1'.

TEST FAILED on ts-sim-mac-ba : demandElements trip inspect via ( Last six runs Mar2022 )

---------- Differences in errors ----------
0a1,3
> Warning: No connection between edge 'gneE2' and edge 'gneE8' found.
> Error: Vehicle 't_0' has no valid route from edge 'gneE2' to stop edge 'gneE8'.
> Quitting (on error).
---------- New result in exitcode ----------
1

TEST FAILED on ts-sim-mac-ba : demandElements trip inspect_selection departPos free ( Last six runs Mar2022 )

---------- Differences in errors ----------
1,3d0
< Error: Vehicle 'tripB' will not be able to depart using the given velocity (junction 'gneJ6' too close)!
< Warning: Teleporting vehicle 'tripA'; waited too long (jam), lane=':gneJ5_1_1', time=310.00.
< Warning: Vehicle 'tripA' ends teleporting on edge 'gneE4', time=310.00.

TEST FAILED on ts-sim-mac-ba : demandElements trip_junctions create departLane ( Last six runs Mar2022 )

---------- Differences in errors ----------
0a1,2
> Error: Invalid departlane definition for vehicle 't_1'.
> Quitting (on error).
---------- New result in exitcode ----------
1

TEST FAILED on ts-sim-mac-ba : demandElements trip_junctions load departLane ( Last six runs Mar2022 )

---------- Differences in errors ----------
0a1,2
> Error: Invalid departlane definition for vehicle 'trip_3'.
> Quitting (on error).
---------- New result in exitcode ----------
1

TEST FAILED on ts-sim-mac-ba : demandElements trip_junctions load departSpeed ( Last six runs Mar2022 )

---------- Differences in errors ----------
0a1,2
> Error: Departure speed for vehicle 'trip_3' is too high for the vehicle type 'DEFAULT_VEHTYPE'.
> Quitting (on error).
---------- New result in exitcode ----------
1

TEST FAILED on ts-sim-mac-ba : demandElements trip_junctions load from ( Last six runs Mar2022 )

---------- Differences in errors ----------
0a1,4
> Warning: No connection between edge 'gneJ7-source' and edge 'gneJ7-sink' found.
> Warning: No route for vehicle 'trip_3' found.
> Error: Vehicle 'trip_3' has no valid route.
> Quitting (on error).
---------- New result in exitcode ----------
1

TEST FAILED on ts-sim-mac-ba : demandElements trip_junctions load to ( Last six runs Mar2022 )

---------- Differences in errors ----------
0a1,4
> Warning: No connection between edge 'gneJ4-source' and edge 'gneJ4-sink' found.
> Warning: No route for vehicle 'trip_3' found.
> Error: Vehicle 'trip_3' has no valid route.
> Quitting (on error).
---------- New result in exitcode ----------
1

TEST FAILED on ts-sim-mac-ba : demandElements trip_junctions volatileRecomputing ( Last six runs Mar2022 )

---------- Differences in errors ----------
0a1,4
> Warning: No connection between edge 'gneJ6-source' and edge 'gneJ9-sink' found.
> Warning: No route for vehicle 't_3' found.
> Error: Vehicle 't_3' has no valid route.
> Quitting (on error).
---------- New result in exitcode ----------
1

TEST FAILED on ts-sim-mac-ba : demandElements vehicle_embedded inspect_selection depart float ( Last six runs Mar2022 )

---------- Differences in errors ----------
2,3c2,3
< Warning: Teleporting vehicle 'vehicle_embeddedA'; waited too long (jam), lane=':gneJ5_1_1', time=310.00.
< Warning: Vehicle 'vehicle_embeddedA' ends teleporting on edge 'gneE4', time=310.00.
---
> Warning: Teleporting vehicle 'vehicle_embeddedA'; waited too long (jam), lane=':gneJ5_1_1', time=321.00.
> Warning: Vehicle 'vehicle_embeddedA' ends teleporting on edge 'gneE4', time=321.00.

TEST FAILED on ts-sim-mac-ba : demandElements vehicle_embedded load route ( Last six runs Mar2022 )

---------- Differences in errors ----------
0a1,2
> Error: Vehicle 'vehicle_2' has no route.
> Quitting (on error).
---------- New result in exitcode ----------
1

TEST FAILED on ts-sim-mac-ba : demandElements vehicletype load latalignment ( Last six runs Mar2022 )

---------- Differences in errors ----------
0a1,5
> Error: value '-3.00' not in enumeration
>  In file 'routes.netedit'
>  At line/column 9/46.
> 
> Quitting (on error).
---------- New result in exitcode ----------
1

TEST FAILED on ts-sim-mac-ba : demandElements vehicletype load speedfactor ( Last six runs Mar2022 )

---------- Differences in errors ----------
0a1,2
> Error: Invalid speed distribution when parsing vType 'vType3' (distribution mean 12.00 is larger than upper boundary 2.00)
> Quitting (on error).
---------- New result in exitcode ----------
1

2 TESTS FAILED on ts-sim-mac-ba :

---------- Differences in errors ----------
312a313,314
> Warning: Teleporting vehicle 'flow.2'; waited too long (blocked), lane='gneE1_0', time=320.00.
> Warning: Vehicle 'flow.2' teleports beyond arrival edge 'gneE1', time=320.00.
314,431c316,431
< Warning: Vehicle 'flow.0' performs emergency stop at the end of lane 'gneE1_0' for unknown reasons (decel=0.00, offset=1.92), time=322.00.
< Warning: Teleporting vehicle 'flow.4'; waited too long (jam), lane='gneE0_0', time=323.00.
< Warning: Vehicle 'flow.0' performs emergency stop at the end of lane 'gneE1_0' for unknown reasons (decel=0.00, offset=2.26), time=323.00.
< Warning: Vehicle 'flow.0' performs emergency stop at the end of lane 'gneE1_0' for unknown reasons (decel=0.00, offset=1.66), time=324.00.
< Warning: Vehicle 'flow.0' performs emergency stop at the end of lane 'gneE1_0' for unknown reasons (decel=0.00, offset=2.13), time=325.00.
< Warning: Vehicle 'flow.0' performs emergency stop at the end of lane 'gneE1_0' for unknown reasons (decel=0.00, offset=1.34), time=326.00.
< Warning: Vehicle 'flow.0' performs emergency stop at the end of lane 'gneE1_0' for unknown reasons (decel=0.00, offset=2.56), time=327.00.
< Warning: Vehicle 'flow.0' performs emergency stop at the end of lane 'gneE1_0' for unknown reasons (decel=0.00, offset=1.66), time=328.00.
< Warning: Vehicle 'flow.0' performs emergency stop at the end of lane 'gneE1_0' for unknown reasons (decel=0.00, offset=1.55), time=329.00.
< Warning: Vehicle 'flow.0' performs emergency stop at the end of lane 'gneE1_0' for unknown reasons (decel=0.00, offset=2.08), time=330.00.
< Warning: Vehicle 'flow.0' performs emergency stop at the end of lane 'gneE1_0' for unknown reasons (decel=0.00, offset=2.15), time=331.00.
< Warning: Vehicle 'flow.0' performs emergency stop at the end of lane 'gneE1_0' for unknown reasons (decel=0.00, offset=2.57), time=332.00.
< Warning: Vehicle 'flow.0' performs emergency stop at the end of lane 'gneE1_0' for unknown reasons (decel=0.00, offset=1.71), time=333.00.
< Warning: Vehicle 'flow.0' performs emergency stop at the end of lane 'gneE1_0' for unknown reasons (decel=0.00, offset=2.56), time=334.00.
< Warning: Vehicle 'flow.0' performs emergency stop at the end of lane 'gneE1_0' for unknown reasons (decel=0.00, offset=1.79), time=335.00.
< Warning: Vehicle 'flow.0' performs emergency stop at the end of lane 'gneE1_0' for unknown reasons (decel=0.00, offset=1.34), time=336.00.
< Warning: Vehicle 'flow.0' performs emergency stop at the end of lane 'gneE1_0' for unknown reasons (decel=0.00, offset=2.09), time=337.00.
< Warning: Vehicle 'flow.0' performs emergency stop at the end of lane 'gneE1_0' for unknown reasons (decel=0.00, offset=1.38), time=338.00.
< Warning: Vehicle 'flow.0' performs emergency stop at the end of lane 'gneE1_0' for unknown reasons (decel=0.00, offset=1.74), time=339.00.
< Warning: Vehicle 'flow.0' performs emergency stop at the end of lane 'gneE1_0' for unknown reasons (decel=0.00, offset=1.37), time=340.00.
< Warning: Vehicle 'flow.0' performs emergency stop at the end of lane 'gneE1_0' for unknown reasons (decel=0.00, offset=2.53), time=341.00.
< Warning: Vehicle 'flow.0' performs emergency stop at the end of lane 'gneE1_0' for unknown reasons (decel=0.00, offset=1.92), time=342.00.
< Warning: Vehicle 'flow.0' performs emergency stop at the end of lane 'gneE1_0' for unknown reasons (decel=0.00, offset=2.41), time=343.00.
< Warning: Vehicle 'flow.0' performs emergency stop at the end of lane 'gneE1_0' for unknown reasons (decel=0.00, offset=1.51), time=344.00.
< Warning: Vehicle 'flow.0' performs emergency stop at the end of lane 'gneE1_0' for unknown reasons (decel=0.00, offset=2.44), time=345.00.
< Warning: Vehicle 'flow.0' performs emergency stop at the end of lane 'gneE1_0' for unknown reasons (decel=0.00, offset=1.73), time=346.00.
<truncated after showing first 30 lines>
demandElements waypoint chargingstation create triggered_join ( Last six runs Mar2022 )
demandElements waypoint chargingstation inspect triggered_join ( Last six runs Mar2022 )

2 TESTS FAILED on ts-sim-mac-ba :

---------- Differences in errors ----------
901a902,903
> Warning: Teleporting vehicle 'routeFlow.3'; waited too long (blocked), lane='gneE1_0', time=910.00.
> Warning: Vehicle 'routeFlow.3' teleports beyond arrival edge 'gneE1', time=910.00.
903,993c905,995
< Warning: Vehicle 'routeFlow.0' performs emergency stop at the end of lane 'gneE1_0' for unknown reasons (decel=0.00, offset=2.50), time=912.00.
< Warning: Vehicle 'routeFlow.0' performs emergency stop at the end of lane 'gneE1_0' for unknown reasons (decel=0.00, offset=1.64), time=913.00.
< Warning: Vehicle 'routeFlow.0' performs emergency stop at the end of lane 'gneE1_0' for unknown reasons (decel=0.00, offset=1.98), time=914.00.
< Warning: Vehicle 'routeFlow.0' performs emergency stop at the end of lane 'gneE1_0' for unknown reasons (decel=0.00, offset=2.59), time=915.00.
< Warning: Vehicle 'routeFlow.0' performs emergency stop at the end of lane 'gneE1_0' for unknown reasons (decel=0.00, offset=1.94), time=916.00.
< Warning: Vehicle 'routeFlow.0' performs emergency stop at the end of lane 'gneE1_0' for unknown reasons (decel=0.00, offset=1.62), time=917.00.
< Warning: Vehicle 'routeFlow.0' performs emergency stop at the end of lane 'gneE1_0' for unknown reasons (decel=0.00, offset=1.96), time=918.00.
< Warning: Vehicle 'routeFlow.0' performs emergency stop at the end of lane 'gneE1_0' for unknown reasons (decel=0.00, offset=2.16), time=919.00.
< Warning: Vehicle 'routeFlow.0' performs emergency stop at the end of lane 'gneE1_0' for unknown reasons (decel=0.00, offset=2.45), time=920.00.
< Warning: Vehicle 'routeFlow.0' performs emergency stop at the end of lane 'gneE1_0' for unknown reasons (decel=0.00, offset=2.30), time=921.00.
< Warning: Vehicle 'routeFlow.0' performs emergency stop at the end of lane 'gneE1_0' for unknown reasons (decel=0.00, offset=2.33), time=922.00.
< Warning: Vehicle 'routeFlow.0' performs emergency stop at the end of lane 'gneE1_0' for unknown reasons (decel=0.00, offset=1.87), time=923.00.
< Warning: Vehicle 'routeFlow.0' performs emergency stop at the end of lane 'gneE1_0' for unknown reasons (decel=0.00, offset=2.50), time=924.00.
< Warning: Vehicle 'routeFlow.0' performs emergency stop at the end of lane 'gneE1_0' for unknown reasons (decel=0.00, offset=1.59), time=925.00.
< Warning: Vehicle 'routeFlow.0' performs emergency stop at the end of lane 'gneE1_0' for unknown reasons (decel=0.00, offset=2.31), time=926.00.
< Warning: Vehicle 'routeFlow.0' performs emergency stop at the end of lane 'gneE1_0' for unknown reasons (decel=0.00, offset=2.41), time=927.00.
< Warning: Vehicle 'routeFlow.0' performs emergency stop at the end of lane 'gneE1_0' for unknown reasons (decel=0.00, offset=2.11), time=928.00.
< Warning: Vehicle 'routeFlow.0' performs emergency stop at the end of lane 'gneE1_0' for unknown reasons (decel=0.00, offset=1.67), time=929.00.
< Warning: Vehicle 'routeFlow.0' performs emergency stop at the end of lane 'gneE1_0' for unknown reasons (decel=0.00, offset=2.55), time=930.00.
< Warning: Vehicle 'routeFlow.0' performs emergency stop at the end of lane 'gneE1_0' for unknown reasons (decel=0.00, offset=2.48), time=931.00.
< Warning: Vehicle 'routeFlow.0' performs emergency stop at the end of lane 'gneE1_0' for unknown reasons (decel=0.00, offset=1.37), time=932.00.
< Warning: Vehicle 'routeFlow.0' performs emergency stop at the end of lane 'gneE1_0' for unknown reasons (decel=0.00, offset=1.44), time=933.00.
< Warning: Vehicle 'routeFlow.0' performs emergency stop at the end of lane 'gneE1_0' for unknown reasons (decel=0.00, offset=1.59), time=934.00.
< Warning: Vehicle 'routeFlow.0' performs emergency stop at the end of lane 'gneE1_0' for unknown reasons (decel=0.00, offset=2.56), time=935.00.
< Warning: Vehicle 'routeFlow.0' performs emergency stop at the end of lane 'gneE1_0' for unknown reasons (decel=0.00, offset=1.66), time=936.00.
< Warning: Vehicle 'routeFlow.0' performs emergency stop at the end of lane 'gneE1_0' for unknown reasons (decel=0.00, offset=1.80), time=937.00.
<truncated after showing first 30 lines>
demandElements waypoint lane create triggered_join ( Last six runs Mar2022 )
demandElements waypoint lane inspect triggered_join ( Last six runs Mar2022 )

Detailed information for the tests that had known bugs:

193 TESTS had known bugs (Test needed #3045) on ts-sim-mac-ba :

#3045
(This bug was triggered by text found in file 'errors' matching 'File 'net.netedit' is not accessible')
---------- New result in errors ----------
Error: File 'net.netedit' is not accessible (No such file or directory).
Quitting (on error).
additionalElements e2detector create id ( Last six runs Mar2022 )
additionalElements parkingarea create id ( Last six runs Mar2022 )
additionalElements routeprobe create id ( Last six runs Mar2022 )
demandElements flow create id ( Last six runs Mar2022 )
demandElements flow fix ( Last six runs Mar2022 )
demandElements flow inspect_selection begin ( Last six runs Mar2022 )
demandElements flow inspect_selection end ( Last six runs Mar2022 )
demandElements flow inspect_selection number ( Last six runs Mar2022 )
demandElements flow inspect_selection period ( Last six runs Mar2022 )
demandElements flow inspect_selection probability ( Last six runs Mar2022 )
demandElements flow inspect_selection type ( Last six runs Mar2022 )
demandElements flow inspect_selection vehsPerHour ( Last six runs Mar2022 )
demandElements flow_embedded create id ( Last six runs Mar2022 )
demandElements flow_embedded fix ( Last six runs Mar2022 )
demandElements flow_embedded inspect_selection begin ( Last six runs Mar2022 )
demandElements flow_embedded inspect_selection end ( Last six runs Mar2022 )
demandElements flow_embedded inspect_selection number ( Last six runs Mar2022 )
demandElements flow_embedded inspect_selection period ( Last six runs Mar2022 )
demandElements flow_embedded inspect_selection probability ( Last six runs Mar2022 )
demandElements flow_embedded inspect_selection type ( Last six runs Mar2022 )
demandElements flow_embedded inspect_selection vehsPerHour ( Last six runs Mar2022 )
demandElements person create id ( Last six runs Mar2022 )
demandElements person fix ( Last six runs Mar2022 )
demandElements person inspect ( Last six runs Mar2022 )
demandElements person inspect_selection ( Last six runs Mar2022 )
demandElements person load ( Last six runs Mar2022 )
demandElements person volatileRecomputing ( Last six runs Mar2022 )
demandElements personFlow create begin ( Last six runs Mar2022 )
demandElements personFlow create end ( Last six runs Mar2022 )
demandElements personFlow create id ( Last six runs Mar2022 )
demandElements personFlow create number ( Last six runs Mar2022 )
demandElements personFlow create period ( Last six runs Mar2022 )
demandElements personFlow create probability ( Last six runs Mar2022 )
demandElements personFlow create vehsPerHour ( Last six runs Mar2022 )
demandElements personFlow fix ( Last six runs Mar2022 )
demandElements personFlow inspect ( Last six runs Mar2022 )
demandElements personFlow inspect_selection ( Last six runs Mar2022 )
demandElements personFlow load ( Last six runs Mar2022 )
demandElements personFlow volatileRecomputing ( Last six runs Mar2022 )
demandElements route create_consecutive id ( Last six runs Mar2022 )
demandElements route create_nonconsecutive id ( Last six runs Mar2022 )
demandElements routeflow create id ( Last six runs Mar2022 )
demandElements routeflow fix ( Last six runs Mar2022 )
demandElements routeflow inspect_selection begin ( Last six runs Mar2022 )
demandElements routeflow inspect_selection end ( Last six runs Mar2022 )
demandElements routeflow inspect_selection number ( Last six runs Mar2022 )
demandElements routeflow inspect_selection period ( Last six runs Mar2022 )
demandElements routeflow inspect_selection probability ( Last six runs Mar2022 )
demandElements routeflow inspect_selection type ( Last six runs Mar2022 )
demandElements routeflow inspect_selection vehsPerHour ( Last six runs Mar2022 )
demandElements trip create id ( Last six runs Mar2022 )
demandElements trip fix ( Last six runs Mar2022 )
demandElements trip inspect_selection type ( Last six runs Mar2022 )
demandElements trip_junctions create id ( Last six runs Mar2022 )
demandElements trip_junctions fix ( Last six runs Mar2022 )
demandElements trip_junctions inspect_selection type ( Last six runs Mar2022 )
demandElements vehicle create id ( Last six runs Mar2022 )
demandElements vehicle fix ( Last six runs Mar2022 )
demandElements vehicle inspect_selection type ( Last six runs Mar2022 )
demandElements vehicle_embedded create id ( Last six runs Mar2022 )
demandElements vehicle_embedded fix ( Last six runs Mar2022 )
demandElements vehicle_embedded inspect_selection type ( Last six runs Mar2022 )
demandElements vehicletype copy ( Last six runs Mar2022 )
demandElements vehicletype create basic accel ( Last six runs Mar2022 )
demandElements vehicletype create basic color ( Last six runs Mar2022 )
demandElements vehicletype create basic decel ( Last six runs Mar2022 )
demandElements vehicletype create basic default ( Last six runs Mar2022 )
demandElements vehicletype create basic id ( Last six runs Mar2022 )
demandElements vehicletype create basic length ( Last six runs Mar2022 )
demandElements vehicletype create basic maxspeed ( Last six runs Mar2022 )
demandElements vehicletype create basic mingap ( Last six runs Mar2022 )
demandElements vehicletype create basic sigma ( Last six runs Mar2022 )
demandElements vehicletype create basic tau ( Last six runs Mar2022 )
demandElements vehicletype create basic vclass ( Last six runs Mar2022 )
demandElements vehicletype create dialog actionStepLength ( Last six runs Mar2022 )
demandElements vehicletype create dialog boardingduration ( Last six runs Mar2022 )
demandElements vehicletype create dialog carfollowingmodel ( Last six runs Mar2022 )
demandElements vehicletype create dialog carfollowingmodel_params accel ( Last six runs Mar2022 )
demandElements vehicletype create dialog carfollowingmodel_params apparentDecel ( Last six runs Mar2022 )
demandElements vehicletype create dialog carfollowingmodel_params ca_gain_gap_cacc ( Last six runs Mar2022 )
demandElements vehicletype create dialog carfollowingmodel_params ca_gain_gap_dot_cacc ( Last six runs Mar2022 )
demandElements vehicletype create dialog carfollowingmodel_params ca_gain_space ( Last six runs Mar2022 )
demandElements vehicletype create dialog carfollowingmodel_params ca_gain_speed ( Last six runs Mar2022 )
demandElements vehicletype create dialog carfollowingmodel_params cf_cc_c1 ( Last six runs Mar2022 )
demandElements vehicletype create dialog carfollowingmodel_params cf_cc_ccaccel ( Last six runs Mar2022 )
demandElements vehicletype create dialog carfollowingmodel_params cf_cc_ccdecel ( Last six runs Mar2022 )
demandElements vehicletype create dialog carfollowingmodel_params cf_cc_constspacing ( Last six runs Mar2022 )
demandElements vehicletype create dialog carfollowingmodel_params cf_cc_flatbed_d ( Last six runs Mar2022 )
demandElements vehicletype create dialog carfollowingmodel_params cf_cc_flatbed_h ( Last six runs Mar2022 )
demandElements vehicletype create dialog carfollowingmodel_params cf_cc_flatbed_ka ( Last six runs Mar2022 )
demandElements vehicletype create dialog carfollowingmodel_params cf_cc_flatbed_kp ( Last six runs Mar2022 )
demandElements vehicletype create dialog carfollowingmodel_params cf_cc_flatbed_kv ( Last six runs Mar2022 )
demandElements vehicletype create dialog carfollowingmodel_params cf_cc_kp ( Last six runs Mar2022 )
demandElements vehicletype create dialog carfollowingmodel_params cf_cc_lambda ( Last six runs Mar2022 )
demandElements vehicletype create dialog carfollowingmodel_params cf_cc_lanes_count ( Last six runs Mar2022 )
demandElements vehicletype create dialog carfollowingmodel_params cf_cc_omegan ( Last six runs Mar2022 )
demandElements vehicletype create dialog carfollowingmodel_params cf_cc_ploeg_h ( Last six runs Mar2022 )
demandElements vehicletype create dialog carfollowingmodel_params cf_cc_ploeg_kd ( Last six runs Mar2022 )
demandElements vehicletype create dialog carfollowingmodel_params cf_cc_ploeg_kp ( Last six runs Mar2022 )
demandElements vehicletype create dialog carfollowingmodel_params cf_cc_tau ( Last six runs Mar2022 )
demandElements vehicletype create dialog carfollowingmodel_params cf_cc_xi ( Last six runs Mar2022 )
demandElements vehicletype create dialog carfollowingmodel_params cf_idm_delta ( Last six runs Mar2022 )
demandElements vehicletype create dialog carfollowingmodel_params cf_idm_stepping ( Last six runs Mar2022 )
demandElements vehicletype create dialog carfollowingmodel_params cf_idmm_adapt_factor ( Last six runs Mar2022 )
demandElements vehicletype create dialog carfollowingmodel_params cf_idmm_adapt_time ( Last six runs Mar2022 )
demandElements vehicletype create dialog carfollowingmodel_params cf_kerner_phi ( Last six runs Mar2022 )
demandElements vehicletype create dialog carfollowingmodel_params cf_pwagner2009_approb ( Last six runs Mar2022 )
demandElements vehicletype create dialog carfollowingmodel_params cf_pwagner2009_taulast ( Last six runs Mar2022 )
demandElements vehicletype create dialog carfollowingmodel_params cf_w99_cc1 ( Last six runs Mar2022 )
demandElements vehicletype create dialog carfollowingmodel_params cf_w99_cc2 ( Last six runs Mar2022 )
demandElements vehicletype create dialog carfollowingmodel_params cf_w99_cc3 ( Last six runs Mar2022 )
demandElements vehicletype create dialog carfollowingmodel_params cf_w99_cc4 ( Last six runs Mar2022 )
demandElements vehicletype create dialog carfollowingmodel_params cf_w99_cc5 ( Last six runs Mar2022 )
demandElements vehicletype create dialog carfollowingmodel_params cf_w99_cc6 ( Last six runs Mar2022 )
demandElements vehicletype create dialog carfollowingmodel_params cf_w99_cc7 ( Last six runs Mar2022 )
demandElements vehicletype create dialog carfollowingmodel_params cf_w99_cc8 ( Last six runs Mar2022 )
demandElements vehicletype create dialog carfollowingmodel_params cf_w99_cc9 ( Last six runs Mar2022 )
demandElements vehicletype create dialog carfollowingmodel_params cf_wiedemann_estimation ( Last six runs Mar2022 )
demandElements vehicletype create dialog carfollowingmodel_params cf_wiedemann_security ( Last six runs Mar2022 )
demandElements vehicletype create dialog carfollowingmodel_params collision_mingap_factor ( Last six runs Mar2022 )
demandElements vehicletype create dialog carfollowingmodel_params decel ( Last six runs Mar2022 )
demandElements vehicletype create dialog carfollowingmodel_params emergencyDecel ( Last six runs Mar2022 )
demandElements vehicletype create dialog carfollowingmodel_params gc_gain_gap_cacc ( Last six runs Mar2022 )
demandElements vehicletype create dialog carfollowingmodel_params gc_gain_gap_dot_cacc ( Last six runs Mar2022 )
demandElements vehicletype create dialog carfollowingmodel_params gc_gain_space ( Last six runs Mar2022 )
demandElements vehicletype create dialog carfollowingmodel_params gc_gain_speed ( Last six runs Mar2022 )
demandElements vehicletype create dialog carfollowingmodel_params gcc_gain_gap_cacc ( Last six runs Mar2022 )
demandElements vehicletype create dialog carfollowingmodel_params gcc_gain_gap_dot_cacc ( Last six runs Mar2022 )
demandElements vehicletype create dialog carfollowingmodel_params gcc_gain_space ( Last six runs Mar2022 )
demandElements vehicletype create dialog carfollowingmodel_params gcc_gain_speed ( Last six runs Mar2022 )
demandElements vehicletype create dialog carfollowingmodel_params headway_time_cacc_to_acc ( Last six runs Mar2022 )
demandElements vehicletype create dialog carfollowingmodel_params k ( Last six runs Mar2022 )
demandElements vehicletype create dialog carfollowingmodel_params sc_gain ( Last six runs Mar2022 )
demandElements vehicletype create dialog carfollowingmodel_params sc_gain_cacc ( Last six runs Mar2022 )
demandElements vehicletype create dialog carfollowingmodel_params sigma ( Last six runs Mar2022 )
demandElements vehicletype create dialog carfollowingmodel_params tau ( Last six runs Mar2022 )
demandElements vehicletype create dialog carfollowingmodel_params tmp1 ( Last six runs Mar2022 )
demandElements vehicletype create dialog carfollowingmodel_params tmp2 ( Last six runs Mar2022 )
demandElements vehicletype create dialog carfollowingmodel_params tmp3 ( Last six runs Mar2022 )
demandElements vehicletype create dialog carfollowingmodel_params tmp4 ( Last six runs Mar2022 )
demandElements vehicletype create dialog carfollowingmodel_params tmp5 ( Last six runs Mar2022 )
demandElements vehicletype create dialog carfollowingmodel_params train_type ( Last six runs Mar2022 )
demandElements vehicletype create dialog color ( Last six runs Mar2022 )
demandElements vehicletype create dialog containercapacity ( Last six runs Mar2022 )
demandElements vehicletype create dialog default ( Last six runs Mar2022 )
demandElements vehicletype create dialog emissionclass ( Last six runs Mar2022 )
demandElements vehicletype create dialog guishape ( Last six runs Mar2022 )
demandElements vehicletype create dialog id ( Last six runs Mar2022 )
demandElements vehicletype create dialog imgfile ( Last six runs Mar2022 )
demandElements vehicletype create dialog impatience ( Last six runs Mar2022 )
demandElements vehicletype create dialog junctionmodel_params jm_crossing_gap ( Last six runs Mar2022 )
demandElements vehicletype create dialog junctionmodel_params jm_drive_after_red_time ( Last six runs Mar2022 )
demandElements vehicletype create dialog junctionmodel_params jm_drive_after_yellow_time ( Last six runs Mar2022 )
demandElements vehicletype create dialog junctionmodel_params jm_drive_red_speed ( Last six runs Mar2022 )
demandElements vehicletype create dialog junctionmodel_params jm_ignore_foe_prob ( Last six runs Mar2022 )
demandElements vehicletype create dialog junctionmodel_params jm_ignore_foe_speed ( Last six runs Mar2022 )
demandElements vehicletype create dialog junctionmodel_params jm_ignore_keep_clear_time ( Last six runs Mar2022 )
demandElements vehicletype create dialog junctionmodel_params jm_sigma_minor ( Last six runs Mar2022 )
demandElements vehicletype create dialog junctionmodel_params jm_timegap_minor ( Last six runs Mar2022 )
demandElements vehicletype create dialog lanechangemodel ( Last six runs Mar2022 )
demandElements vehicletype create dialog lanechangemodel_params lc_accel_lat ( Last six runs Mar2022 )
demandElements vehicletype create dialog lanechangemodel_params lc_assertive ( Last six runs Mar2022 )
demandElements vehicletype create dialog lanechangemodel_params lc_cooperative ( Last six runs Mar2022 )
demandElements vehicletype create dialog lanechangemodel_params lc_impatience ( Last six runs Mar2022 )
demandElements vehicletype create dialog lanechangemodel_params lc_keep_right ( Last six runs Mar2022 )
demandElements vehicletype create dialog lanechangemodel_params lc_lookahead_left ( Last six runs Mar2022 )
demandElements vehicletype create dialog lanechangemodel_params lc_max_speed_lat_factor ( Last six runs Mar2022 )
demandElements vehicletype create dialog lanechangemodel_params lc_max_speed_lat_standing ( Last six runs Mar2022 )
demandElements vehicletype create dialog lanechangemodel_params lc_opposite ( Last six runs Mar2022 )
demandElements vehicletype create dialog lanechangemodel_params lc_overtake_right ( Last six runs Mar2022 )
demandElements vehicletype create dialog lanechangemodel_params lc_pushy ( Last six runs Mar2022 )
demandElements vehicletype create dialog lanechangemodel_params lc_pushy_gap ( Last six runs Mar2022 )
demandElements vehicletype create dialog lanechangemodel_params lc_speed_gain ( Last six runs Mar2022 )
demandElements vehicletype create dialog lanechangemodel_params lc_speed_gain_right ( Last six runs Mar2022 )
demandElements vehicletype create dialog lanechangemodel_params lc_strategic ( Last six runs Mar2022 )
demandElements vehicletype create dialog lanechangemodel_params lc_sublane ( Last six runs Mar2022 )
demandElements vehicletype create dialog lanechangemodel_params lc_time_to_impatience ( Last six runs Mar2022 )
demandElements vehicletype create dialog lanechangemodel_params lc_turn_alignment_distance ( Last six runs Mar2022 )
demandElements vehicletype create dialog latalignment ( Last six runs Mar2022 )
demandElements vehicletype create dialog length ( Last six runs Mar2022 )
demandElements vehicletype create dialog loadingduration ( Last six runs Mar2022 )
demandElements vehicletype create dialog maxspeed ( Last six runs Mar2022 )
demandElements vehicletype create dialog maxspeedlat ( Last six runs Mar2022 )
demandElements vehicletype create dialog mingap ( Last six runs Mar2022 )
demandElements vehicletype create dialog mingaplat ( Last six runs Mar2022 )
demandElements vehicletype create dialog osgfile ( Last six runs Mar2022 )
demandElements vehicletype create dialog personcapacity ( Last six runs Mar2022 )
demandElements vehicletype create dialog speeddev ( Last six runs Mar2022 )
demandElements vehicletype create dialog speedfactor ( Last six runs Mar2022 )
demandElements vehicletype create dialog vclass ( Last six runs Mar2022 )
demandElements vehicletype create dialog width ( Last six runs Mar2022 )
netElements edges templates ( Last six runs Mar2022 )
selection basic contextual_menu ( Last six runs Mar2022 )