23Oct19rv1_3_1+0673-8c371fdc03 - detailed test results for TOOLS

To reconnect the TextTest GUI to these results, run:

texttest -a tools -d /Users/sumo/clangMacOS/sumo/tests -reconnect /Users/sumo/clangMacOS/texttesttmp/clangMacOS.31Oct001502.73729 -g

To start TextTest for these tests, run:

texttest -a tools -d /Users/sumo/clangMacOS/sumo/tests


default: 465 tests: 414 succeeded 47 FAILED 4 known bugs

Detailed information for the tests that FAILED:

TEST FAILED on SUMO-mac : assign calibration 2ndTestNetwork_sumoFormat ( Last six runs Oct2019 )

---------- Differences in errors ----------
0a1
> Execution of ['java', '-cp', '/Users/sumo/clangMacOS/sumo/tools/../bin/libsumojni.jar:/Users/sumo/clangMacOS/sumo/tools/../bin/libsumojni_src.jar', '-Xmx1G', 'floetteroed.cadyts.interfaces.sumo.SumoController', 'INIT', '-varscale', '1.0', '-freezeit', '85', '-measfile', 'input_weights1.xml', '-binsize', '3600', '-PREPITS', '5', '-bruteforce', 'False', '-demandscale', '2.0', '-mincountstddev', '25.0', '-overridett', 'False', '-clonepostfix', '-CLONE', '-cntfirstlink', 'False', '-cntlastlink', '
False'] failed. Look into cadySumo-log.txt for details.
---------- Differences in output ----------
1,100d0
< calibration step: 0
< >> Running simulation
< <<
< ------------------
< 
< calibration step: 1
< >> Running simulation
< <<
< ------------------
< 
< calibration step: 2
< >> Running simulation
< <<
< ------------------
< 
< calibration step: 3
< >> Running simulation
< <<
< ------------------
< 
< calibration step: 4
< >> Running simulation
< <<
< ------------------
< 
< calibration step: 5
< >> Running simulation
< <<
< ------------------
<truncated after showing first 30 lines>

TEST FAILED on SUMO-mac : assign calibration demand_adjustment ( Last six runs Oct2019 )

---------- Differences in errors ----------
0a1
> Execution of ['java', '-cp', '/Users/sumo/clangMacOS/sumo/tools/../bin/libsumojni.jar:/Users/sumo/clangMacOS/sumo/tools/../bin/libsumojni_src.jar', '-Xmx1G', 'floetteroed.cadyts.interfaces.sumo.SumoController', 'INIT', '-varscale', '1.0', '-freezeit', '85', '-measfile', 'input_measurements.xml', '-binsize', '3600', '-PREPITS', '5', '-bruteforce', 'False', '-demandscale', '2.0', '-mincountstddev', '25.0', '-overridett', 'True', '-clonepostfix', '-CLONE', '-fmaprefix', 'matrix', '-cntfirstlink',
 'False', '-cntlastlink', 'False'] failed. Look into cadySumo-log.txt for details.
---------- Differences in output ----------
1,100d0
< calibration step: 0
< >> Running simulation
< <<
< ------------------
< 
< calibration step: 1
< >> Running simulation
< <<
< ------------------
< 
< calibration step: 2
< >> Running simulation
< <<
< ------------------
< 
< calibration step: 3
< >> Running simulation
< <<
< ------------------
< 
< calibration step: 4
< >> Running simulation
< <<
< ------------------
< 
< calibration step: 5
< >> Running simulation
< <<
< ------------------
<truncated after showing first 30 lines>

TEST FAILED on SUMO-mac : assign calibration fixed_demand ( Last six runs Oct2019 )

---------- Differences in errors ----------
0a1
> Execution of ['java', '-cp', '/Users/sumo/clangMacOS/sumo/tools/../bin/libsumojni.jar:/Users/sumo/clangMacOS/sumo/tools/../bin/libsumojni_src.jar', '-Xmx1G', 'floetteroed.cadyts.interfaces.sumo.SumoController', 'INIT', '-varscale', '1.0', '-freezeit', '85', '-measfile', 'input_measurements.xml', '-binsize', '3600', '-PREPITS', '5', '-bruteforce', 'False', '-demandscale', '2.0', '-mincountstddev', '25.0', '-overridett', 'True', '-clonepostfix', '-CLONE', '-cntfirstlink', 'False', '-cntlastlink'
, 'False'] failed. Look into cadySumo-log.txt for details.
---------- Differences in output ----------
1,100d0
< calibration step: 0
< >> Running simulation
< <<
< ------------------
< 
< calibration step: 1
< >> Running simulation
< <<
< ------------------
< 
< calibration step: 2
< >> Running simulation
< <<
< ------------------
< 
< calibration step: 3
< >> Running simulation
< <<
< ------------------
< 
< calibration step: 4
< >> Running simulation
< <<
< ------------------
< 
< calibration step: 5
< >> Running simulation
< <<
< ------------------
<truncated after showing first 30 lines>

TEST FAILED on SUMO-mac : assign calibration multi_route_files ( Last six runs Oct2019 )

---------- Differences in errors ----------
0a1
> Execution of ['java', '-cp', '/Users/sumo/clangMacOS/sumo/tools/../bin/libsumojni.jar:/Users/sumo/clangMacOS/sumo/tools/../bin/libsumojni_src.jar', '-Xmx1G', 'floetteroed.cadyts.interfaces.sumo.SumoController', 'INIT', '-varscale', '1.0', '-freezeit', '85', '-measfile', 'input_measurements.xml', '-binsize', '3600', '-PREPITS', '5', '-bruteforce', 'False', '-demandscale', '2.0', '-mincountstddev', '25.0', '-overridett', 'False', '-clonepostfix', '-CLONE', '-fmaprefix', 'fmaOD', '-cntfirstlink',
 'False', '-cntlastlink', 'False'] failed. Look into cadySumo-log.txt for details.
---------- Differences in output ----------
1,100d0
< calibration step: 0
< >> Running simulation
< <<
< ------------------
< 
< calibration step: 1
< >> Running simulation
< <<
< ------------------
< 
< calibration step: 2
< >> Running simulation
< <<
< ------------------
< 
< calibration step: 3
< >> Running simulation
< <<
< ------------------
< 
< calibration step: 4
< >> Running simulation
< <<
< ------------------
< 
< calibration step: 5
< >> Running simulation
< <<
< ------------------
<truncated after showing first 30 lines>

TEST FAILED on SUMO-mac : assign calibration p2p_demand_adjustment ( Last six runs Oct2019 )

---------- Differences in errors ----------
0a1
> Execution of ['java', '-cp', '/Users/sumo/clangMacOS/sumo/tools/../bin/libsumojni.jar:/Users/sumo/clangMacOS/sumo/tools/../bin/libsumojni_src.jar', '-Xmx1G', 'floetteroed.cadyts.interfaces.sumo.SumoController', 'INIT', '-varscale', '1.0', '-freezeit', '85', '-measfile', 'input_measurementsp2p.xml', '-binsize', '900', '-PREPITS', '5', '-bruteforce', 'False', '-demandscale', '2.0', '-mincountstddev', '25.0', '-overridett', 'False', '-clonepostfix', '-CLONE', '-fmaprefix', 'matrix', '-cntfirstlin
k', 'False', '-cntlastlink', 'False'] failed. Look into cadySumo-log.txt for details.
---------- Differences in output ----------
1,100d0
< calibration step: 0
< >> Running simulation
< <<
< ------------------
< 
< calibration step: 1
< >> Running simulation
< <<
< ------------------
< 
< calibration step: 2
< >> Running simulation
< <<
< ------------------
< 
< calibration step: 3
< >> Running simulation
< <<
< ------------------
< 
< calibration step: 4
< >> Running simulation
< <<
< ------------------
< 
< calibration step: 5
< >> Running simulation
< <<
< ------------------
<truncated after showing first 30 lines>

TEST FAILED on SUMO-mac : assign calibration p2p_simple ( Last six runs Oct2019 )

---------- Differences in errors ----------
0a1
> Execution of ['java', '-cp', '/Users/sumo/clangMacOS/sumo/tools/../bin/libsumojni.jar:/Users/sumo/clangMacOS/sumo/tools/../bin/libsumojni_src.jar', '-Xmx1G', 'floetteroed.cadyts.interfaces.sumo.SumoController', 'INIT', '-varscale', '1.0', '-freezeit', '85', '-measfile', 'input_measurementsp2p.xml', '-binsize', '900', '-PREPITS', '5', '-bruteforce', 'False', '-demandscale', '2.0', '-mincountstddev', '25.0', '-overridett', 'False', '-clonepostfix', '-CLONE', '-cntfirstlink', 'False', '-cntlastli
nk', 'False'] failed. Look into cadySumo-log.txt for details.
---------- Differences in output ----------
1,100d0
< calibration step: 0
< >> Running simulation
< <<
< ------------------
< 
< calibration step: 1
< >> Running simulation
< <<
< ------------------
< 
< calibration step: 2
< >> Running simulation
< <<
< ------------------
< 
< calibration step: 3
< >> Running simulation
< <<
< ------------------
< 
< calibration step: 4
< >> Running simulation
< <<
< ------------------
< 
< calibration step: 5
< >> Running simulation
< <<
< ------------------
<truncated after showing first 30 lines>

TEST FAILED on SUMO-mac : assign dua-iterate binary ( Last six runs Oct2019 )

---------- Differences in errors ----------
0a1
> Execution of ['/Users/sumo/clangMacOS/sumo/bin/sumo', '-c', 'iteration_000.sumocfg'] failed. Look into dua.log for details.
---------- Differences in output ----------
6,40d5
< <<
< ------------------
< 
< Loading configuration... done.
< > Executing step 1
< >> Running router on input_trips_000.rou.alt.sbx
< <<
< >> Running simulation
< <<
< ------------------
< 
< Loading configuration... done.
< > Executing step 2
< >> Running router on input_trips_001.rou.alt.sbx
< <<
< >> Running simulation
< <<
< ------------------
< 
< Loading configuration... done.
< > Executing step 3
< >> Running router on input_trips_002.rou.alt.sbx
< <<
< >> Running simulation
< <<
< ------------------
< 
< Loading configuration... done.
< > Executing step 4
<truncated after showing first 30 lines>

7 TESTS FAILED on SUMO-mac :

---------- Differences in output ----------
0a1
> Python flake not found. Python style checking is disabled.
build checkStyle complex ( Last six runs Oct2019 )
build checkStyle header ( Last six runs Oct2019 )
build checkStyle netedit ( Last six runs Oct2019 )
build checkStyle netedit_additionals ( Last six runs Oct2019 )
build checkStyle netedit_demand ( Last six runs Oct2019 )
build checkStyle tools ( Last six runs Oct2019 )
build checkStyle tooltests ( Last six runs Oct2019 )

12 TESTS FAILED on SUMO-mac :

---------- Differences in errors ----------
0a1
> Warning: Module 'rtree' not available. Using brute-force fallback
district generateBidiDistricts asym ( Last six runs Oct2019 )
district generateBidiDistricts plain ( Last six runs Oct2019 )
district generateBidiDistricts radius1000 ( Last six runs Oct2019 )
district generateBidiDistricts sym ( Last six runs Oct2019 )
net netmatch plain ( Last six runs Oct2019 )
route tracemapper basic ( Last six runs Oct2019 )
route tracemapper fillGaps basic ( Last six runs Oct2019 )
route tracemapper internal delta ( Last six runs Oct2019 )
route tracemapper internal fillGaps ( Last six runs Oct2019 )
route tracemapper internal plain ( Last six runs Oct2019 )
route tracemapper offset ( Last six runs Oct2019 )
sumolib net ( Last six runs Oct2019 )

TEST FAILED on SUMO-mac : import OSM webWizard ( Last six runs Oct2019 )

---------- Differences in errors ----------
319,320c319
< Warning: Person 'ped0' is jammed on edge ':4591015622_c0', time=557.00.
< Warning: Person 'ped129' aborted waiting for N6:0 at busStop '-3869306770'.
---
> Warning: Person 'ped158' aborted waiting for N2:0 at busStop '272408975'.
321a321,323
> Warning: Person 'ped19' aborted waiting for M5:0 at busStop '1633759766'.
> Warning: Person 'ped44' aborted waiting for 147:1 at busStop '-3869306770'.
> Warning: Person 'ped129' aborted waiting for N6:0 at busStop '-3869306770'.
---------- Differences in osmimport ----------
113c113
<         <lane id=":1157325158_w0_0" index="0" allow="pedestrian" speed="1.00" length="2.16" width="2.00" shape="2225.34,2120.87 2226.58,2119.31 2225.45,2118.20 2223.85,2117.01 2223.17,2117.92 2224.78,2119.11 2225.08,2120.49 2224.99,2120.00 2224.99,2119.50 2225.01,2119.11 2224.96,2118.94"/>
---
>         <lane id=":1157325158_w0_0" index="0" allow="pedestrian" speed="1.00" length="2.64" width="2.00" shape="2225.34,2120.87 2226.58,2119.31 2225.45,2118.20 2223.85,2117.01 2222.45,2118.90 2224.05,2120.09 2225.07,2120.61 2224.84,2120.33 2224.64,2120.08 2224.45,2119.92 2224.26,2119.91"/>
810c810
<         <lane id=":1393236495_w0_0" index="0" allow="pedestrian" speed="1.00" length="3.59" width="2.00" shape="1446.60,1885.32 1448.57,1884.94 1450.06,1885.05 1450.23,1883.06 1445.18,1882.61 1445.00,1884.60 1446.49,1884.97 1446.31,1884.77 1446.07,1884.67 1445.77,1884.63 1445.41,1884.62"/>
---
>         <lane id=":1393236495_w0_0" index="0" allow="pedestrian" speed="1.00" length="3.62" width="2.00" shape="1446.62,1885.42 1448.59,1885.04 1450.06,1885.05 1450.23,1883.06 1445.18,1882.61 1445.00,1884.60 1446.51,1885.05 1446.33,1884.83 1446.09,1884.70 1445.78,1884.65 1445.42,1884.63"/>
1068c1068
<         <lane id=":1457124722_w0_0" index="0" allow="pedestrian" speed="1.00" length="3.44" width="2.00" shape="1557.88,2001.87 1558.13,1999.89 1556.82,1998.20 1554.84,1997.96 1554.26,1999.40 1554.01,2001.39"/>
---
>         <lane id=":1457124722_w0_0" index="0" allow="pedestrian" speed="1.00" length="3.49" width="2.00" shape="1557.88,2001.87 1558.13,1999.89 1556.82,1998.20 1554.84,1997.96 1554.16,1999.39 1553.92,2001.37"/>
1945c1945
<         <lane id=":1667735093_w0_0" index="0" allow="pedestrian" speed="1.00" length="0.96" width="2.00" shape="1041.72,2155.23 1041.10,2153.33 1039.74,2153.81 1040.45,2155.68 1039.70,2153.82 1040.39,2155.69"/>
---
>         <lane id=":1667735093_w0_0" index="0" allow="pedestrian" speed="1.00" length="0.93" width="2.00" shape="1041.68,2155.25 1041.06,2153.35 1040.37,2153.57 1041.08,2155.44 1039.70,2153.82 1040.39,2155.69"/>
2285,2286c2285,2286
<         <lane id=":1769589022_0_0" index="0" disallow="pedestrian tram rail_urban rail rail_electric rail_fast ship" speed="13.89" length="6.42" shape="1070.11,2321.35 1070.42,2323.25 1071.42,2324.42 1072.42,2325.60 1072.77,2327.50"/>
<         <lane id=":1769589022_0_1" index="1" disallow="pedestrian tram rail_urban rail rail_electric rail_fast ship" speed="13.89" length="6.42" shape="1070.11,2321.35 1069.58,2327.23"/>
---
>         <lane id=":1769589022_0_0" index="0" disallow="pedestrian tram rail_urban rail rail_electric rail_fast ship" speed="13.89" length="6.47" shape="1070.12,2321.30 1070.42,2323.21 1071.42,2324.40 1072.42,2325.59 1072.77,2327.50"/>
>         <lane id=":1769589022_0_1" index="1" disallow="pedestrian tram rail_urban rail rail_electric rail_fast ship" speed="13.89" length="6.47" shape="1070.12,2321.30 1069.58,2327.23"/>
2292c2292
<         <lane id=":1769589022_c0_0" index="0" allow="pedestrian" speed="1.00" length="6.40" width="4.00" shape="1065.13,2322.90 1071.50,2323.50"/>
---
>         <lane id=":1769589022_c0_0" index="0" allow="pedestrian" speed="1.00" length="6.40" width="4.00" shape="1065.13,2322.90 1071.50,2323.46"/>
2295c2295
<         <lane id=":1769589022_w0_0" index="0" allow="pedestrian" speed="1.00" length="5.11" width="4.00" shape="1074.36,2327.63 1077.35,2327.89 1074.69,2321.78 1071.71,2321.47 1071.80,2322.89 1072.30,2323.84 1073.01,2324.57 1073.72,2325.31 1074.24,2326.26"/>
---
>         <lane id=":1769589022_w0_0" index="0" allow="pedestrian" speed="1.00" length="5.08" width="4.00" shape="1074.36,2327.63 1077.35,2327.89 1074.69,2321.82 1071.70,2321.52 1071.80,2322.85 1072.31,2323.81 1073.01,2324.55 1073.72,2325.29 1074.24,2326.25"/>
<truncated after showing first 30 lines>
---------- Differences in osmstops ----------
130c130
<         <access lane="175499826_0" pos="0.10" length="11.92" friendlyPos="1"/>
---
>         <access lane="175499826_0" pos="0.20" length="11.92" friendlyPos="1"/>
212c212
<         <access lane="272780751#0_0" pos="0.26" length="15.95" friendlyPos="1"/>
---
>         <access lane="272780751#0_0" pos="0.36" length="15.91" friendlyPos="1"/>
284c284
<         <access lane="377110621#1_0" pos="0.00" length="13.23" friendlyPos="1"/>
---
>         <access lane="377110621#1_0" pos="0.00" length="13.28" friendlyPos="1"/>
298c298
<         <access lane="272757323#1_0" pos="0.20" length="8.44" friendlyPos="1"/>
---
>         <access lane="272757323#1_0" pos="0.20" length="8.39" friendlyPos="1"/>
482c482
<         <access lane="171826987#1_0" pos="0.00" length="17.33" friendlyPos="1"/>
---
>         <access lane="171826987#1_0" pos="0.20" length="17.83" friendlyPos="1"/>
490c490
<         <access lane="254339581#1_0" pos="0.20" length="28.62" friendlyPos="1"/>
---
>         <access lane="254339581#1_0" pos="0.20" length="28.57" friendlyPos="1"/>
---------- Differences in osmtrips ----------
442c442
<     <person id="ped146" depart="644.24" type="ped_pedestrian">
---
>     <person id="ped146" depart="644.26" type="ped_pedestrian">
454c454
<     <person id="ped150" depart="661.89" type="ped_pedestrian">
---
>     <person id="ped150" depart="661.91" type="ped_pedestrian">
466c466
<     <person id="ped154" depart="679.54" type="ped_pedestrian">
---
>     <person id="ped154" depart="679.56" type="ped_pedestrian">
475c475
<     <person id="ped157" depart="692.78" type="ped_pedestrian">
---
>     <person id="ped157" depart="692.80" type="ped_pedestrian">
487c487
<     <person id="ped161" depart="710.43" type="ped_pedestrian">
---
>     <person id="ped161" depart="710.45" type="ped_pedestrian">
499c499
<     <person id="ped165" depart="728.08" type="ped_pedestrian">
---
>     <person id="ped165" depart="728.10" type="ped_pedestrian">
511c511
<     <person id="ped169" depart="745.73" type="ped_pedestrian">
---
>     <person id="ped169" depart="745.75" type="ped_pedestrian">
520c520
<     <person id="ped172" depart="758.97" type="ped_pedestrian">
<truncated after showing first 30 lines>
---------- Differences in output ----------
71c71
< Guessed 942 pedestrian crossings.
---
> Guessed 945 pedestrian crossings.
121,163d120
< Success.
< Written configuration to <PATH>
< Loading configuration... done.
< Loading net-file from <DIR>/osm.net.xml'... done ((TIME)).
< Loading additional-files from <DIR>/osm.poly.xml'... done ((TIME)).
< Loading additional-files from <DIR>/osm_stops.add.xml'... done ((TIME)).
< Loading done.
< Simulation started with time: 0.00
< Simulation ended at time: 3008.00
< Reason: All vehicles have left the simulation.
< Performance: 
< Vehicles: 
<  Inserted: 434
<  Running: 0
<  Waiting: 0
< Teleports: 1 (Collisions: 1)
< Persons: 
<  Inserted: 200
<  Running: 0
<  Jammed: 1
< Statistics (avg):
<  RouteLength: 1861.46
<  Duration: 339.12
<  WaitingTime: 49.78
<  TimeLoss: 110.29
<truncated after showing first 30 lines>
---------- Differences in ptroutes ----------
38,39d37
<     <route id="pt_bus_TXL:1" edges="139877309 415288661 405101794 415280723#0 415280723#1 415280722 195401010 195401013#0 195401013#1 195401013#2 195401013#3 24914992#0 24914992#1 171826985#0 171826985#1 171826985#2 171826985#3 171826985#4 24913519#1 24913519#2 541763975 202156995#0 202156995#1 4067932#0 4067932#1 339201219 61584187#1 61584187#2 61584187#3 61584187#4 54048863 15971197 4611699 169195795#0 169195795#1 169195795#2 169195795#5 169195795#6 169195795#7 169195795#8 169195795#10 34049
8988 188386313#0 188386313#1 188386313#2 24913304#1" >
<     </route>
48,49d45
<     <route id="pt_tram_M6:1" edges="23960874#0 23960874#1 23960874#2 144014234#0 144014234#1 144014234#2 167523653#0 167523653#1 167523653#2 22962554#0 22962554#1 22962554#2 150394036#0 150394036#1 93628049#0 93628049#1 93628049#2 93628049#3 93628049#4 301733774#1" >
<     </route>
51a48,49
>     <route id="pt_tram_M6:1" edges="23960874#0 23960874#1 23960874#2 144014234#0 144014234#1 144014234#2 167523653#0 167523653#1 167523653#2 22962554#0 22962554#1 22962554#2 150394036#0 150394036#1 93628049#0 93628049#1 93628049#2 93628049#3 93628049#4 301733774#1" >
>     </route>
60c58
<     <route id="pt_bus_265:0" edges="328426193#0 328426193#1 4773463#0 4773463#1 4773463#2" >
---
>     <route id="pt_subway_U2:1" edges="384294423 177195505#0 177195505#1 272795474 272795470#0 272795470#1" >
70,72c68
<     <route id="pt_bus_200:0" edges="24914141#0 24914141#1 24914141#2 24914141#3 24914141#4 24914141#6 318282850#0 318282850#1 112128419#1 112128419#2 139877309 415288661 405101794 415280723#0 415280723#1 415280722 195401010 195401013#0 195401013#1 195401013#2 195401013#3 24914992#0 24914992#1 171826985#0 171826985#1 171826985#2 171826985#3 171826985#4 24913519#1 24913519#2 541763975 202156995#0 202156995#1 4067932#0 4067932#1 339201219 61584187#1 61584187#2 61584187#3 61584187#4 54048863 15971
197 4611699 169195795#0 169195795#1 169195795#2 169195795#5 169195795#6 169195795#7 169195795#8 169195795#10 340498988 188386313#0 188386313#1 188386313#2 155186522 24913267#0 24913267#1 24913267#2 24913267#3 326116286#0 326116286#1 326116286#2 4402014#0 4402014#1 4402014#2 4402014#3 326116285#2" >
<     </route>
<     <route id="pt_subway_U8:0" edges="379102293#0 379102293#1 436121618 438860779 199425798 381201612 381187763" >
---
>     <route id="pt_light_rail_S3:0" edges="32590425 32590428 32590429 32590432 32590433#0 32590433#1 32590433#2 32590436 25946659 72984388#0 72984388#1 32590497 32590498 32590499 32590501 32590648 32590649 32590639 32590640 32590652 32590653 32590895 32590896 32590903 32590904 29384710 25946685#0 25946685#1 25946685#2 25946677 25946678 25946662 25946663 29384521#0 29384521#1 29384522#0 29384522#1" >
74c70
<     <route id="pt_train_RB14:0" edges="442921387#0 442921387#1 25946656#0 25946656#1 25946657 25946673#0 25946673#1 25946674#0 25946674#1 25946675 25946676 25946679 25946680 32590897 32590898#0 32590898#1 32590889 32590890#0 32590890#1 23809675 23809674 32590635 32590636#0 32590636#1 32590641 32590642 32590485 32590486 32590487 32590488 72984378 32572618#0 32572618#1 32590441 32572619 32572620 32572623 32572624#0 32572624#1" >
---
>     <route id="pt_bus_N8:0" edges="371927739 36892597#0 36892597#1 36892597#2 36892597#3 84960597#0 84960597#1 84960597#3 83517332#0 83517332#1 83517332#2 83517332#3 84960595 316746323#0 316746323#1 316746323#2 370359204#0 370359204#2 478396988 275177453 387892378 77348147 156364570#0 156364570#1 156364570#2 156364570#3 156364556#1 202157002#0 202157002#1 202157002#2 202157002#3 -534588621#1 -534588621#0 606078071#0 606078071#1 606078071#2 606078071#3 61583423#0 61583423#1 -156364553#1 -156364
553#0 -606078065 4612963 156364566#1 60333309#0 60333309#1 24992424#0 24992424#1 24992424#2 24992424#3 24992424#4 24992424#5 4612961#0 4612961#1 4612961#2 344594966" >
76c72
<     <route id="pt_tram_M1:0" edges="207364191#0 207364191#1 144014242#0 144014242#1 167272512#0 167272512#2 167272512#3 167272512#4 167272512#5 167272512#6 167272512#7 195411594#3 195411594#2 195411594#1 195411594#0 165409971#1 165409971#0 388702049#0 388702049#1 388702049#2 167272531#0 167272531#1 167272531#2 167272531#3 167272531#4 167272531#5 167272531#6 167272531#7 167272531#8 167272531#9 167272531#10 154321049#2 101699672 143891040#0 143891040#1 143891040#2 101699676#0 101699676#1 1016996
76#2 101699676#3 101699676#4 30721656#1 30721656#2 30721656#3 30721656#4 421641065#0 421641065#1 28341062 421641064 30721657#0 30721657#1 93630923 46140383 143931935 153537606#0 153537606#1" >
---
>     <route id="pt_bus_N8:1" edges="156364559#0 156364559#1 156364559#2 156364559#3 156364559#4 156364559#5 156364559#6 -24992424#5 -24992424#4 -24992424#3 -24992424#2 -24992424#1 -24992424#0 4612964#0 4612964#1 4612964#2 24992428 606078065 156364553#0 156364553#1 606078066#0 606078066#1 72157172 61583424#0 61583424#1 61583424#2 534588621#0 534588621#1 4773465#1 4773465#2 4773465#3 490365295#0 490365295#1 490365295#2 -156364570#3 -156364570#2 -156364570#1 -156364570#0 -77348147 -387892378 -2751
77453 -478396988 -370359204#2 -370359204#0 -316746323#2 -316746323#1 -316746323#0 46140376#1 -84960597#3 -84960597#1 -84960597#0 -36892597#3 -36892597#2 -36892597#1 -36892597#0 -371927739" >
78c74
<     <route id="pt_bus_N40:1" edges="371927739 36892597#0 36892597#1 36892597#2 36892597#3 84960597#0 84960597#1 84960597#3 83517332#0 83517332#1 83517332#2 83517332#3 84960595 316746323#0 316746323#1 316746323#2 370359204#0 370359204#2 478396988 275177453 387892378 77348147 156364570#0 156364570#1 156364570#2 156364570#3 156364556#1 202157002#0 202157002#1 202157002#2 202157002#3 -534588621#1 -534588621#0 606078071#0 606078071#1 606078071#2 606078071#3 61583423#0 61583423#1 -156364553#1 -15636
4553#0 -606078065 4612963 156364566#1 60333309#0 60333309#1 24992424#0 24992424#1 24992424#2 24992424#3 24992424#4 24992424#5 4612961#0 4612961#1 4612961#2 344594966" >
---
<truncated after showing first 30 lines>

TEST FAILED on SUMO-mac : route tracemapper fillGaps geo ( Last six runs Oct2019 )

---------- Differences in errors ----------
0a1,10
> Traceback (most recent call last):
>   File "/Users/sumo/clangMacOS/sumo/tests/../tools/route/tracemapper.py", line 141, in <module>
>     for tid, trace in traces:
>   File "/Users/sumo/clangMacOS/sumo/tests/../tools/route/tracemapper.py", line 59, in readLines
>     trace = [net.convertLonLat2XY(*pos) for pos in trace]
>   File "/Users/sumo/clangMacOS/sumo/tests/../tools/route/../sumolib/net/__init__.py", line 458, in convertLonLat2XY
>     x, y = self.getGeoProj()(lon, lat)
>   File "/Users/sumo/clangMacOS/sumo/tests/../tools/route/../sumolib/net/__init__.py", line 440, in getGeoProj
>     import pyproj
> ImportError: No module named pyproj
---------- Differences in output ----------
3d2
< mapping trace with 2 points
---------- Differences in routes ----------
2,3d1
<     <route id="vehicle1" edges="beg middle end"/>
< </routes>

TEST FAILED on SUMO-mac : route tracemapper geo ( Last six runs Oct2019 )

---------- Differences in errors ----------
0a1,10
> Traceback (most recent call last):
>   File "/Users/sumo/clangMacOS/sumo/tests/../tools/route/tracemapper.py", line 141, in <module>
>     for tid, trace in traces:
>   File "/Users/sumo/clangMacOS/sumo/tests/../tools/route/tracemapper.py", line 59, in readLines
>     trace = [net.convertLonLat2XY(*pos) for pos in trace]
>   File "/Users/sumo/clangMacOS/sumo/tests/../tools/route/../sumolib/net/__init__.py", line 458, in convertLonLat2XY
>     x, y = self.getGeoProj()(lon, lat)
>   File "/Users/sumo/clangMacOS/sumo/tests/../tools/route/../sumolib/net/__init__.py", line 440, in getGeoProj
>     import pyproj
> ImportError: No module named pyproj
---------- Differences in output ----------
3d2
< mapping trace with 2 points
---------- Differences in routes ----------
2,3d1
<     <route id="vehicle1" edges="beg end"/>
< </routes>

6 TESTS FAILED on SUMO-mac :

---------- Differences in image ----------
5c5
< <svg height="345pt" version="1.1" viewBox="0 0 460 345" width="460pt" xmlns="http://www.w3.org/2000/svg" xmlns:xlink="http://www.w3.org/1999/xlink">
---
> <svg height="345.6pt" version="1.1" viewBox="0 0 460.8 345.6" width="460.8pt" xmlns="http://www.w3.org/2000/svg" xmlns:xlink="http://www.w3.org/1999/xlink">
visualisation plot_csv_bars plain ( Last six runs Oct2019 )
visualisation plot_csv_pie plain ( Last six runs Oct2019 )
visualisation plot_net_dump logColors ( Last six runs Oct2019 )
visualisation plot_net_dump plain ( Last six runs Oct2019 )
visualisation plot_net_speeds plain ( Last six runs Oct2019 )
visualisation plot_summary plain ( Last six runs Oct2019 )

TEST FAILED on SUMO-mac : visualisation plot_net_dump multiple_intervals ( Last six runs Oct2019 )

---------- Differences in image-600 ----------
5c5
< <svg height="345pt" version="1.1" viewBox="0 0 460 345" width="460pt" xmlns="http://www.w3.org/2000/svg" xmlns:xlink="http://www.w3.org/1999/xlink">
---
> <svg height="345.6pt" version="1.1" viewBox="0 0 460.8 345.6" width="460.8pt" xmlns="http://www.w3.org/2000/svg" xmlns:xlink="http://www.w3.org/1999/xlink">
---------- Differences in image-800 ----------
5c5
< <svg height="345pt" version="1.1" viewBox="0 0 460 345" width="460pt" xmlns="http://www.w3.org/2000/svg" xmlns:xlink="http://www.w3.org/1999/xlink">
---
> <svg height="345.6pt" version="1.1" viewBox="0 0 460.8 345.6" width="460.8pt" xmlns="http://www.w3.org/2000/svg" xmlns:xlink="http://www.w3.org/1999/xlink">

TEST FAILED on SUMO-mac : xml schemaCheck tests additional ( Last six runs Oct2019 )

---------- Differences in errors ----------
1,627c1
< Error on parsing 'sumo/extended/calibrator/errors/invalid_flow/input_additional.add.xml'!
< Traceback (most recent call last):
< XMLSyntaxError: Opening and ending tag mismatch: additional line 1 and calibrator, line 5, column 18
< -- Unordered text as found by filter 'ERROR:SCHEMA' --
< netedit/additionalElements/access/load/friendlypos/input_additionals.add.xml:8:0:ERROR:SCHEMASV:SCHEMAV_CVC_DATATYPE_VALID_1_2_1: Element 'access', attribute 'friendlyPos': 'dummyFriendlyPos' is not a valid value of the atomic type 'boolType'.
< netedit/additionalElements/access/load/friendlypos/input_additionals.add.xml:8:0:ERROR:SCHEMASV:SCHEMAV_CVC_ENUMERATION_VALID: Element 'access', attribute 'friendlyPos': [facet 'enumeration'] The value 'dummyFriendlyPos' is not an element of the set {'true', 'false', 'True', 'False', 'yes', 'no', 'on', 'off', '1', '0', 'x', '-'}.
< netedit/additionalElements/access/load/invalid_parent/input_additionals.add.xml:3:0:ERROR:SCHEMASV:SCHEMAV_CVC_COMPLEX_TYPE_4: Element 'busStop': The attribute 'id' is required but missing.
< netedit/additionalElements/access/load/lane/input_additionals.add.xml:5:0:ERROR:SCHEMASV:SCHEMAV_CVC_COMPLEX_TYPE_4: Element 'access': The attribute 'lane' is required but missing.
< netedit/additionalElements/access/load/length/input_additionals.add.xml:11:0:ERROR:SCHEMASV:SCHEMAV_CVC_DATATYPE_VALID_1_2_1: Element 'access', attribute 'length': '-30' is not a valid value of the atomic type 'nonNegativeFloatType'.
< netedit/additionalElements/access/load/length/input_additionals.add.xml:11:0:ERROR:SCHEMASV:SCHEMAV_CVC_MININCLUSIVE_VALID: Element 'access', attribute 'length': [facet 'minInclusive'] The value '-30' is less than the minimum value allowed ('0').
< netedit/additionalElements/access/load/length/input_additionals.add.xml:8:0:ERROR:SCHEMASV:SCHEMAV_CVC_DATATYPE_VALID_1_2_1: Element 'access', attribute 'length': 'dummyLenght' is not a valid value of the atomic type 'nonNegativeFloatType'.
< netedit/additionalElements/access/load/no_parent/input_additionals.add.xml:3:0:ERROR:SCHEMASV:SCHEMAV_ELEMENT_CONTENT: Element 'access': This element is not expected.
< netedit/additionalElements/access/load/parameters/input_additionals.add.xml:18:0:ERROR:SCHEMASV:SCHEMAV_CVC_COMPLEX_TYPE_4: Element 'param': The attribute 'value' is required but missing.
< netedit/additionalElements/access/load/parameters/input_additionals.add.xml:27:0:ERROR:SCHEMASV:SCHEMAV_CVC_COMPLEX_TYPE_4: Element 'param': The attribute 'key' is required but missing.
< netedit/additionalElements/access/load/parameters/input_additionals.add.xml:27:0:ERROR:SCHEMASV:SCHEMAV_CVC_COMPLEX_TYPE_4: Element 'param': The attribute 'value' is required but missing.
< netedit/additionalElements/access/load/parameters/input_additionals.add.xml:9:0:ERROR:SCHEMASV:SCHEMAV_CVC_COMPLEX_TYPE_4: Element 'param': The attribute 'key' is required but missing.
< netedit/additionalElements/access/load/pos/input_additionals.add.xml:5:0:ERROR:SCHEMASV:SCHEMAV_CVC_DATATYPE_VALID_1_2_1: Element 'access', attribute 'pos': 'dummyPosition' is not a valid value of the atomic type 'xs:float'.
< netedit/additionalElements/access/load/pos/input_additionals.add.xml:8:0:ERROR:SCHEMASV:SCHEMAV_CVC_DATATYPE_VALID_1_2_1: Element 'access', attribute 'pos': '' is not a valid value of the atomic type 'xs:float'.
< netedit/additionalElements/basic/relative_positions/input_additionals.add.xml:13:0:ERROR:SCHEMASV:SCHEMAV_CVC_COMPLEX_TYPE_3_2_1: Element 'instantInductionLoop', attribute 'freq': The attribute 'freq' is not allowed.
< netedit/additionalElements/basic/relative_positions/input_additionals.add.xml:14:0:ERROR:SCHEMASV:SCHEMAV_CVC_COMPLEX_TYPE_3_2_1: Element 'rerouter', attribute 'off': The attribute 'off' is not allowed.
< netedit/additionalElements/basic/relative_positions/input_additionals.add.xml:16:0:ERROR:SCHEMASV:SCHEMAV_CVC_COMPLEX_TYPE_3_2_1: Element 'vaporizer', attribute 'edge': The attribute 'edge' is not allowed.
< netedit/additionalElements/basic/relative_positions/input_additionals.add.xml:16:0:ERROR:SCHEMASV:SCHEMAV_CVC_COMPLEX_TYPE_4: Element 'vaporizer': The attribute 'id' is required but missing.
< netedit/additionalElements/busstop/load/endpos/input_additionals.add.xml:7:0:ERROR:SCHEMASV:SCHEMAV_CVC_DATATYPE_VALID_1_2_1: Element 'busStop', attribute 'endPos': 'dummyEndPos' is not a valid value of the atomic type 'xs:float'.
< netedit/additionalElements/busstop/load/id/input_additionals.add.xml:10:0:ERROR:SCHEMASV:SCHEMAV_CVC_DATATYPE_VALID_1_2_1: Element 'busStop', attribute 'id': 'ID with spaces' is not a valid value of the atomic type 'idType'.
< netedit/additionalElements/busstop/load/id/input_additionals.add.xml:10:0:ERROR:SCHEMASV:SCHEMAV_CVC_PATTERN_VALID: Element 'busStop', attribute 'id': [facet 'pattern'] The value 'ID with spaces' is not accepted by the pattern '[^ \t\n\r|\\;,']+'.
< netedit/additionalElements/busstop/load/id/input_additionals.add.xml:7:0:ERROR:SCHEMASV:SCHEMAV_CVC_COMPLEX_TYPE_4: Element 'busStop': The attribute 'id' is required but missing.
< netedit/additionalElements/busstop/load/lane/input_additionals.add.xml:4:0:ERROR:SCHEMASV:SCHEMAV_CVC_COMPLEX_TYPE_4: Element 'busStop': The attribute 'lane' is required but missing.
< netedit/additionalElements/busstop/load/parameters/input_additionals.add.xml:11:0:ERROR:SCHEMASV:SCHEMAV_CVC_COMPLEX_TYPE_4: Element 'param': The attribute 'key' is required but missing.
< netedit/additionalElements/busstop/load/parameters/input_additionals.add.xml:23:0:ERROR:SCHEMASV:SCHEMAV_CVC_COMPLEX_TYPE_4: Element 'param': The attribute 'value' is required but missing.
<truncated after showing first 30 lines>
---------- Differences in output ----------
1d0
< <number> files checked

TEST FAILED on SUMO-mac : xml schemaCheck tests cfgs ( Last six runs Oct2019 )

---------- Differences in errors ----------
1,7c1
< Error on parsing 'sumo/meta/umlaut/sumo.sumocfg'!
< Traceback (most recent call last):
< XMLSyntaxError: Input is not proper UTF-8, indicate encoding !
< Bytes: 0xF6 0x74 0x2E 0x6E, line 3, column 26
< -- Unordered text as found by filter 'ERROR:SCHEMA' --
< sumo/meta/deprecated_option/sumo.sumocfg:11:0:ERROR:SCHEMASV:SCHEMAV_ELEMENT_CONTENT: Element 'abs-rand': This element is not expected.
< 
---
> neither SAX2Count nor lxml available, exiting
---------- Differences in output ----------
1d0
< <number> files checked

4 TESTS FAILED on SUMO-mac :

---------- Differences in errors ----------
0a1
> neither SAX2Count nor lxml available, exiting
---------- Differences in output ----------
1d0
< <number> files checked
xml schemaCheck tests jtrrouter ( Last six runs Oct2019 )
xml schemaCheck tests ticket3917 ( Last six runs Oct2019 )
xml schemaCheck tests tls ( Last six runs Oct2019 )
xml schemaCheck tools ( Last six runs Oct2019 )

TEST FAILED on SUMO-mac : xml schemaCheck tests netconvert ( Last six runs Oct2019 )

---------- Differences in errors ----------
1,59c1
< -- Unordered text as found by filter 'ERROR:SCHEMA' --
< netconvert/import/XML/errors/broken_edge/edge#fromnode__missing1/input_edges.edg.xml:3:0:ERROR:SCHEMASV:SCHEMAV_CVC_COMPLEX_TYPE_4: Element 'edge': The attribute 'from' is required but missing.
< netconvert/import/XML/errors/broken_edge/edge#fromnode__missing4/input_edges.edg.xml:7:0:ERROR:SCHEMASV:SCHEMAV_CVC_COMPLEX_TYPE_4: Element 'edge': The attribute 'from' is required but missing.
< netconvert/import/XML/errors/broken_edge/edge#id__empty1/input_edges.edg.xml:3:0:ERROR:SCHEMASV:SCHEMAV_CVC_DATATYPE_VALID_1_2_1: Element 'edge', attribute 'id': '' is not a valid value of the atomic type 'idType'.
< netconvert/import/XML/errors/broken_edge/edge#id__empty1/input_edges.edg.xml:3:0:ERROR:SCHEMASV:SCHEMAV_CVC_IDC: Element 'edge', attribute 'id': Warning: No precomputed value available, the value was either invalid or something strange happend.
< netconvert/import/XML/errors/broken_edge/edge#id__empty1/input_edges.edg.xml:3:0:ERROR:SCHEMASV:SCHEMAV_CVC_IDC: Element 'edge': Not all fields of key identity-constraint 'edgeKey' evaluate to a node.
< netconvert/import/XML/errors/broken_edge/edge#id__empty1/input_edges.edg.xml:3:0:ERROR:SCHEMASV:SCHEMAV_CVC_PATTERN_VALID: Element 'edge', attribute 'id': [facet 'pattern'] The value '' is not accepted by the pattern '[^ \t\n\r|\\;,']+'.
< netconvert/import/XML/errors/broken_edge/edge#id__empty4/input_edges.edg.xml:7:0:ERROR:SCHEMASV:SCHEMAV_CVC_DATATYPE_VALID_1_2_1: Element 'edge', attribute 'id': '' is not a valid value of the atomic type 'idType'.
< netconvert/import/XML/errors/broken_edge/edge#id__empty4/input_edges.edg.xml:7:0:ERROR:SCHEMASV:SCHEMAV_CVC_IDC: Element 'edge', attribute 'id': Warning: No precomputed value available, the value was either invalid or something strange happend.
< netconvert/import/XML/errors/broken_edge/edge#id__empty4/input_edges.edg.xml:7:0:ERROR:SCHEMASV:SCHEMAV_CVC_IDC: Element 'edge': Not all fields of key identity-constraint 'edgeKey' evaluate to a node.
< netconvert/import/XML/errors/broken_edge/edge#id__empty4/input_edges.edg.xml:7:0:ERROR:SCHEMASV:SCHEMAV_CVC_PATTERN_VALID: Element 'edge', attribute 'id': [facet 'pattern'] The value '' is not accepted by the pattern '[^ \t\n\r|\\;,']+'.
< netconvert/import/XML/errors/broken_edge/edge#id__invalid4/input_edges.edg.xml:7:0:ERROR:SCHEMASV:SCHEMAV_CVC_DATATYPE_VALID_1_2_1: Element 'edge', attribute 'id': '4 5' is not a valid value of the atomic type 'idType'.
< netconvert/import/XML/errors/broken_edge/edge#id__invalid4/input_edges.edg.xml:7:0:ERROR:SCHEMASV:SCHEMAV_CVC_IDC: Element 'edge', attribute 'id': Warning: No precomputed value available, the value was either invalid or something strange happend.
< netconvert/import/XML/errors/broken_edge/edge#id__invalid4/input_edges.edg.xml:7:0:ERROR:SCHEMASV:SCHEMAV_CVC_IDC: Element 'edge': Not all fields of key identity-constraint 'edgeKey' evaluate to a node.
< netconvert/import/XML/errors/broken_edge/edge#id__invalid4/input_edges.edg.xml:7:0:ERROR:SCHEMASV:SCHEMAV_CVC_PATTERN_VALID: Element 'edge', attribute 'id': [facet 'pattern'] The value '4 5' is not accepted by the pattern '[^ \t\n\r|\\;,']+'.
< netconvert/import/XML/errors/broken_edge/edge#id__missing1/input_edges.edg.xml:3:0:ERROR:SCHEMASV:SCHEMAV_CVC_COMPLEX_TYPE_4: Element 'edge': The attribute 'id' is required but missing.
< netconvert/import/XML/errors/broken_edge/edge#id__missing1/input_edges.edg.xml:3:0:ERROR:SCHEMASV:SCHEMAV_CVC_IDC: Element 'edge': Not all fields of key identity-constraint 'edgeKey' evaluate to a node.
< netconvert/import/XML/errors/broken_edge/edge#id__missing4/input_edges.edg.xml:7:0:ERROR:SCHEMASV:SCHEMAV_CVC_COMPLEX_TYPE_4: Element 'edge': The attribute 'id' is required but missing.
< netconvert/import/XML/errors/broken_edge/edge#id__missing4/input_edges.edg.xml:7:0:ERROR:SCHEMASV:SCHEMAV_CVC_IDC: Element 'edge': Not all fields of key identity-constraint 'edgeKey' evaluate to a node.
< netconvert/import/XML/errors/broken_edge/edge#length__empty1/input_edges.edg.xml:3:0:ERROR:SCHEMASV:SCHEMAV_CVC_DATATYPE_VALID_1_2_1: Element 'edge', attribute 'length': '' is not a valid value of the atomic type 'positiveFloatType'.
< netconvert/import/XML/errors/broken_edge/edge#length__empty4/input_edges.edg.xml:7:0:ERROR:SCHEMASV:SCHEMAV_CVC_DATATYPE_VALID_1_2_1: Element 'edge', attribute 'length': '' is not a valid value of the atomic type 'positiveFloatType'.
< netconvert/import/XML/errors/broken_edge/edge#length__false1/input_edges.edg.xml:3:0:ERROR:SCHEMASV:SCHEMAV_CVC_DATATYPE_VALID_1_2_1: Element 'edge', attribute 'length': 'a' is not a valid value of the atomic type 'positiveFloatType'.
< netconvert/import/XML/errors/broken_edge/edge#length__false4/input_edges.edg.xml:7:0:ERROR:SCHEMASV:SCHEMAV_CVC_DATATYPE_VALID_1_2_1: Element 'edge', attribute 'length': 'a' is not a valid value of the atomic type 'positiveFloatType'.
< netconvert/import/XML/errors/broken_edge/edge#nolanes__empty1/input_edges.edg.xml:3:0:ERROR:SCHEMASV:SCHEMAV_CVC_DATATYPE_VALID_1_2_1: Element 'edge', attribute 'numLanes': '' is not a valid value of the atomic type 'xs:positiveInteger'.
< netconvert/import/XML/errors/broken_edge/edge#nolanes__empty4/input_edges.edg.xml:7:0:ERROR:SCHEMASV:SCHEMAV_CVC_DATATYPE_VALID_1_2_1: Element 'edge', attribute 'numLanes': '' is not a valid value of the atomic type 'xs:positiveInteger'.
< netconvert/import/XML/errors/broken_edge/edge#nolanes__false1/input_edges.edg.xml:3:0:ERROR:SCHEMASV:SCHEMAV_CVC_DATATYPE_VALID_1_2_1: Element 'edge', attribute 'numLanes': 'a' is not a valid value of the atomic type 'xs:positiveInteger'.
< netconvert/import/XML/errors/broken_edge/edge#nolanes__false4/input_edges.edg.xml:7:0:ERROR:SCHEMASV:SCHEMAV_CVC_DATATYPE_VALID_1_2_1: Element 'edge', attribute 'numLanes': 'a' is not a valid value of the atomic type 'xs:positiveInteger'.
< netconvert/import/XML/errors/broken_edge/edge#priority__false1/input_edges.edg.xml:3:0:ERROR:SCHEMASV:SCHEMAV_CVC_DATATYPE_VALID_1_2_1: Element 'edge', attribute 'priority': 'a' is not a valid value of the atomic type 'xs:int'.
< netconvert/import/XML/errors/broken_edge/edge#priority__false4/input_edges.edg.xml:7:0:ERROR:SCHEMASV:SCHEMAV_CVC_DATATYPE_VALID_1_2_1: Element 'edge', attribute 'priority': 'a' is not a valid value of the atomic type 'xs:int'.
<truncated after showing first 30 lines>
---------- Differences in output ----------
1d0
< <number> files checked

TEST FAILED on SUMO-mac : xml schemaCheck tests nets ( Last six runs Oct2019 )

---------- Differences in errors ----------
1,8c1
< -- Unordered text as found by filter 'ERROR:SCHEMA' --
< netconvert/function/railway/bidi_endOffset_invalid/net.netconvert:55:0:ERROR:SCHEMASV:SCHEMAV_CVC_COMPLEX_TYPE_4: Element 'lane': The attribute 'shape' is required but missing.
< netconvert/import/SUMO/stopOffsets/incomplete_specification/input_net.net.xml:169:0:ERROR:SCHEMASV:SCHEMAV_CVC_COMPLEX_TYPE_4: Element 'stopOffset': The attribute 'value' is required but missing.
< netconvert/import/SUMO/stopOffsets/warnings/input_net.net.xml:139:0:ERROR:SCHEMASV:SCHEMAV_CVC_DATATYPE_VALID_1_2_1: Element 'stopOffset', attribute 'value': '-1' is not a valid value of the atomic type 'nonNegativeFloatType'.
< netconvert/import/SUMO/stopOffsets/warnings/input_net.net.xml:139:0:ERROR:SCHEMASV:SCHEMAV_CVC_MININCLUSIVE_VALID: Element 'stopOffset', attribute 'value': [facet 'minInclusive'] The value '-1' is less than the minimum value allowed ('0').
< netconvert/import/SUMO/stopOffsets/warnings/input_net.net.xml:154:0:ERROR:SCHEMASV:SCHEMAV_CVC_DATATYPE_VALID_1_2_1: Element 'stopOffset', attribute 'value': '-1' is not a valid value of the atomic type 'nonNegativeFloatType'.
< netconvert/import/SUMO/stopOffsets/warnings/input_net.net.xml:154:0:ERROR:SCHEMASV:SCHEMAV_CVC_MININCLUSIVE_VALID: Element 'stopOffset', attribute 'value': [facet 'minInclusive'] The value '-1' is less than the minimum value allowed ('0').
< 
---
> neither SAX2Count nor lxml available, exiting
---------- Differences in output ----------
1d0
< <number> files checked

TEST FAILED on SUMO-mac : xml schemaCheck tests routes ( Last six runs Oct2019 )

---------- Differences in errors ----------
1,548c1
< Error on parsing 'netedit/demandElements/stop/stopLane/load/actType/input_routes.rou.xml'!
< Traceback (most recent call last):
< IOError: Error reading file 'http://sumo.dlr.de/xsd/blub_file.xsd': failed to load external entity "http://sumo.dlr.de/xsd/blub_file.xsd"
< -- Unordered text as found by filter 'ERROR:SCHEMA' --
< duarouter/routes/style1_input/errors/vehicle_empty_arrivallane/input_routes.rou.xml:5:0:ERROR:SCHEMASV:SCHEMAV_CVC_DATATYPE_VALID_1_2_3: Element 'vehicle', attribute 'arrivalLane': '' is not a valid value of the union type 'arrivalLaneType'.
< duarouter/routes/style1_input/errors/vehicle_empty_arrivalpos/input_routes.rou.xml:5:0:ERROR:SCHEMASV:SCHEMAV_CVC_DATATYPE_VALID_1_2_3: Element 'vehicle', attribute 'arrivalPos': '' is not a valid value of the union type 'arrivalPosType'.
< duarouter/routes/style1_input/errors/vehicle_empty_arrivalspeed/input_routes.rou.xml:5:0:ERROR:SCHEMASV:SCHEMAV_CVC_DATATYPE_VALID_1_2_3: Element 'vehicle', attribute 'arrivalSpeed': '' is not a valid value of the union type 'arrivalSpeedType'.
< duarouter/routes/style1_input/errors/vehicle_empty_departlane/input_routes.rou.xml:5:0:ERROR:SCHEMASV:SCHEMAV_CVC_DATATYPE_VALID_1_2_3: Element 'vehicle', attribute 'departLane': '' is not a valid value of the union type 'departLaneType'.
< duarouter/routes/style1_input/errors/vehicle_empty_departpos/input_routes.rou.xml:5:0:ERROR:SCHEMASV:SCHEMAV_CVC_DATATYPE_VALID_1_2_3: Element 'vehicle', attribute 'departPos': '' is not a valid value of the union type 'departPosType'.
< duarouter/routes/style1_input/errors/vehicle_empty_departspeed/input_routes.rou.xml:5:0:ERROR:SCHEMASV:SCHEMAV_CVC_DATATYPE_VALID_1_2_3: Element 'vehicle', attribute 'departSpeed': '' is not a valid value of the union type 'departSpeedType'.
< duarouter/routes/style1_input/errors/vehicle_false_arrivallane/input_routes.rou.xml:5:0:ERROR:SCHEMASV:SCHEMAV_CVC_DATATYPE_VALID_1_2_3: Element 'vehicle', attribute 'arrivalLane': 'xxx' is not a valid value of the union type 'arrivalLaneType'.
< duarouter/routes/style1_input/errors/vehicle_false_arrivalpos/input_routes.rou.xml:5:0:ERROR:SCHEMASV:SCHEMAV_CVC_DATATYPE_VALID_1_2_3: Element 'vehicle', attribute 'arrivalPos': 'xxx' is not a valid value of the union type 'arrivalPosType'.
< duarouter/routes/style1_input/errors/vehicle_false_arrivalspeed/input_routes.rou.xml:5:0:ERROR:SCHEMASV:SCHEMAV_CVC_DATATYPE_VALID_1_2_3: Element 'vehicle', attribute 'arrivalSpeed': 'xxx' is not a valid value of the union type 'arrivalSpeedType'.
< duarouter/routes/style1_input/errors/vehicle_false_departlane/input_routes.rou.xml:5:0:ERROR:SCHEMASV:SCHEMAV_CVC_DATATYPE_VALID_1_2_3: Element 'vehicle', attribute 'departLane': 'xxx' is not a valid value of the union type 'departLaneType'.
< duarouter/routes/style1_input/errors/vehicle_false_departpos/input_routes.rou.xml:5:0:ERROR:SCHEMASV:SCHEMAV_CVC_DATATYPE_VALID_1_2_3: Element 'vehicle', attribute 'departPos': 'xxx' is not a valid value of the union type 'departPosType'.
< duarouter/routes/style1_input/errors/vehicle_false_departspeed/input_routes.rou.xml:5:0:ERROR:SCHEMASV:SCHEMAV_CVC_DATATYPE_VALID_1_2_3: Element 'vehicle', attribute 'departSpeed': 'xxx' is not a valid value of the union type 'departSpeedType'.
< duarouter/routes/style2_input/errors/vehicle_empty_arrivallane/input_routes.rou.xml:4:0:ERROR:SCHEMASV:SCHEMAV_CVC_DATATYPE_VALID_1_2_3: Element 'vehicle', attribute 'arrivalLane': '' is not a valid value of the union type 'arrivalLaneType'.
< duarouter/routes/style2_input/errors/vehicle_empty_arrivalpos/input_routes.rou.xml:4:0:ERROR:SCHEMASV:SCHEMAV_CVC_DATATYPE_VALID_1_2_3: Element 'vehicle', attribute 'arrivalPos': '' is not a valid value of the union type 'arrivalPosType'.
< duarouter/routes/style2_input/errors/vehicle_empty_arrivalspeed/input_routes.rou.xml:4:0:ERROR:SCHEMASV:SCHEMAV_CVC_DATATYPE_VALID_1_2_3: Element 'vehicle', attribute 'arrivalSpeed': '' is not a valid value of the union type 'arrivalSpeedType'.
< duarouter/routes/style2_input/errors/vehicle_empty_departlane/input_routes.rou.xml:4:0:ERROR:SCHEMASV:SCHEMAV_CVC_DATATYPE_VALID_1_2_3: Element 'vehicle', attribute 'departLane': '' is not a valid value of the union type 'departLaneType'.
< duarouter/routes/style2_input/errors/vehicle_empty_departpos/input_routes.rou.xml:4:0:ERROR:SCHEMASV:SCHEMAV_CVC_DATATYPE_VALID_1_2_3: Element 'vehicle', attribute 'departPos': '' is not a valid value of the union type 'departPosType'.
< duarouter/routes/style2_input/errors/vehicle_empty_departspeed/input_routes.rou.xml:4:0:ERROR:SCHEMASV:SCHEMAV_CVC_DATATYPE_VALID_1_2_3: Element 'vehicle', attribute 'departSpeed': '' is not a valid value of the union type 'departSpeedType'.
< duarouter/routes/style2_input/errors/vehicle_false_arrivallane/input_routes.rou.xml:4:0:ERROR:SCHEMASV:SCHEMAV_CVC_DATATYPE_VALID_1_2_3: Element 'vehicle', attribute 'arrivalLane': 'xxx' is not a valid value of the union type 'arrivalLaneType'.
< duarouter/routes/style2_input/errors/vehicle_false_arrivalpos/input_routes.rou.xml:4:0:ERROR:SCHEMASV:SCHEMAV_CVC_DATATYPE_VALID_1_2_3: Element 'vehicle', attribute 'arrivalPos': 'xxx' is not a valid value of the union type 'arrivalPosType'.
< duarouter/routes/style2_input/errors/vehicle_false_arrivalspeed/input_routes.rou.xml:4:0:ERROR:SCHEMASV:SCHEMAV_CVC_DATATYPE_VALID_1_2_3: Element 'vehicle', attribute 'arrivalSpeed': 'xxx' is not a valid value of the union type 'arrivalSpeedType'.
< duarouter/routes/style2_input/errors/vehicle_false_departlane/input_routes.rou.xml:4:0:ERROR:SCHEMASV:SCHEMAV_CVC_DATATYPE_VALID_1_2_3: Element 'vehicle', attribute 'departLane': 'xxx' is not a valid value of the union type 'departLaneType'.
< duarouter/routes/style2_input/errors/vehicle_false_departpos/input_routes.rou.xml:4:0:ERROR:SCHEMASV:SCHEMAV_CVC_DATATYPE_VALID_1_2_3: Element 'vehicle', attribute 'departPos': 'xxx' is not a valid value of the union type 'departPosType'.
< duarouter/routes/style2_input/errors/vehicle_false_departspeed/input_routes.rou.xml:4:0:ERROR:SCHEMASV:SCHEMAV_CVC_DATATYPE_VALID_1_2_3: Element 'vehicle', attribute 'departSpeed': 'xxx' is not a valid value of the union type 'departSpeedType'.
< netedit/demandElements/flow/load/arrivalLane/input_routes.rou.xml:56:0:ERROR:SCHEMASV:SCHEMAV_CVC_DATATYPE_VALID_1_2_3: Element 'flow', attribute 'arrivalLane': 'dummyDepart' is not a valid value of the union type 'arrivalLaneType'.
<truncated after showing first 30 lines>
---------- Differences in output ----------
1d0
< <number> files checked

TEST FAILED on SUMO-mac : xml schemaCheck tests sim_outputs ( Last six runs Oct2019 )

---------- Differences in errors ----------
1,52c1
< -- Unordered text as found by filter 'ERROR:SCHEMA' --
< sumo/cf_model/IDM/insert_with_speedLimit_speedFactor0.8/tripinfos.sumo:35:0:ERROR:SCHEMASV:SCHEMAV_CVC_DATATYPE_VALID_1_2_1: Element 'tripinfo', attribute 'timeLoss': '-0.06' is not a valid value of the atomic type 'nonNegativeFloatType'.
< sumo/cf_model/IDM/insert_with_speedLimit_speedFactor0.8/tripinfos.sumo:35:0:ERROR:SCHEMASV:SCHEMAV_CVC_MININCLUSIVE_VALID: Element 'tripinfo', attribute 'timeLoss': [facet 'minInclusive'] The value '-0.06' is less than the minimum value allowed ('0').
< sumo/extended/state/load_shifted/tripinfos.sumo.meso:47:0:ERROR:SCHEMASV:SCHEMAV_CVC_DATATYPE_VALID_1_2_1: Element 'tripinfo', attribute 'depart': '-10.00' is not a valid value of the atomic type 'nonNegativeFloatType'.
< sumo/extended/state/load_shifted/tripinfos.sumo.meso:47:0:ERROR:SCHEMASV:SCHEMAV_CVC_MININCLUSIVE_VALID: Element 'tripinfo', attribute 'depart': [facet 'minInclusive'] The value '-10.00' is less than the minimum value allowed ('0').
< sumo/extended/state/load_shifted/tripinfos.sumo:38:0:ERROR:SCHEMASV:SCHEMAV_CVC_DATATYPE_VALID_1_2_1: Element 'tripinfo', attribute 'depart': '-10.00' is not a valid value of the atomic type 'nonNegativeFloatType'.
< sumo/extended/state/load_shifted/tripinfos.sumo:38:0:ERROR:SCHEMASV:SCHEMAV_CVC_MININCLUSIVE_VALID: Element 'tripinfo', attribute 'depart': [facet 'minInclusive'] The value '-10.00' is less than the minimum value allowed ('0').
< sumo/sublane_model/buridan_1lane/tripinfos.sumo:33:0:ERROR:SCHEMASV:SCHEMAV_CVC_COMPLEX_TYPE_3_2_1: Element 'tripinfo', attribute 'waitSteps': The attribute 'waitSteps' is not allowed.
< sumo/sublane_model/buridan_1lane/tripinfos.sumo:33:0:ERROR:SCHEMASV:SCHEMAV_CVC_COMPLEX_TYPE_4: Element 'tripinfo': The attribute 'stopTime' is required but missing.
< sumo/sublane_model/buridan_1lane/tripinfos.sumo:33:0:ERROR:SCHEMASV:SCHEMAV_CVC_COMPLEX_TYPE_4: Element 'tripinfo': The attribute 'waitingCount' is required but missing.
< sumo/sublane_model/buridan_1lane/tripinfos.sumo:33:0:ERROR:SCHEMASV:SCHEMAV_CVC_COMPLEX_TYPE_4: Element 'tripinfo': The attribute 'waitingTime' is required but missing.
< sumo/sublane_model/buridan_1lane/tripinfos.sumo:34:0:ERROR:SCHEMASV:SCHEMAV_CVC_COMPLEX_TYPE_3_2_1: Element 'tripinfo', attribute 'waitSteps': The attribute 'waitSteps' is not allowed.
< sumo/sublane_model/buridan_1lane/tripinfos.sumo:34:0:ERROR:SCHEMASV:SCHEMAV_CVC_COMPLEX_TYPE_4: Element 'tripinfo': The attribute 'stopTime' is required but missing.
< sumo/sublane_model/buridan_1lane/tripinfos.sumo:34:0:ERROR:SCHEMASV:SCHEMAV_CVC_COMPLEX_TYPE_4: Element 'tripinfo': The attribute 'waitingCount' is required but missing.
< sumo/sublane_model/buridan_1lane/tripinfos.sumo:34:0:ERROR:SCHEMASV:SCHEMAV_CVC_COMPLEX_TYPE_4: Element 'tripinfo': The attribute 'waitingTime' is required but missing.
< sumo/sublane_model/buridan_1lane/tripinfos.sumo:35:0:ERROR:SCHEMASV:SCHEMAV_CVC_COMPLEX_TYPE_3_2_1: Element 'tripinfo', attribute 'waitSteps': The attribute 'waitSteps' is not allowed.
< sumo/sublane_model/buridan_1lane/tripinfos.sumo:35:0:ERROR:SCHEMASV:SCHEMAV_CVC_COMPLEX_TYPE_4: Element 'tripinfo': The attribute 'stopTime' is required but missing.
< sumo/sublane_model/buridan_1lane/tripinfos.sumo:35:0:ERROR:SCHEMASV:SCHEMAV_CVC_COMPLEX_TYPE_4: Element 'tripinfo': The attribute 'waitingCount' is required but missing.
< sumo/sublane_model/buridan_1lane/tripinfos.sumo:35:0:ERROR:SCHEMASV:SCHEMAV_CVC_COMPLEX_TYPE_4: Element 'tripinfo': The attribute 'waitingTime' is required but missing.
< sumo/sublane_model/buridan_1lane/tripinfos.sumo:36:0:ERROR:SCHEMASV:SCHEMAV_CVC_COMPLEX_TYPE_3_2_1: Element 'tripinfo', attribute 'waitSteps': The attribute 'waitSteps' is not allowed.
< sumo/sublane_model/buridan_1lane/tripinfos.sumo:36:0:ERROR:SCHEMASV:SCHEMAV_CVC_COMPLEX_TYPE_4: Element 'tripinfo': The attribute 'stopTime' is required but missing.
< sumo/sublane_model/buridan_1lane/tripinfos.sumo:36:0:ERROR:SCHEMASV:SCHEMAV_CVC_COMPLEX_TYPE_4: Element 'tripinfo': The attribute 'waitingCount' is required but missing.
< sumo/sublane_model/buridan_1lane/tripinfos.sumo:36:0:ERROR:SCHEMASV:SCHEMAV_CVC_COMPLEX_TYPE_4: Element 'tripinfo': The attribute 'waitingTime' is required but missing.
< sumo/sublane_model/buridan_1lane/tripinfos.sumo:37:0:ERROR:SCHEMASV:SCHEMAV_CVC_COMPLEX_TYPE_3_2_1: Element 'tripinfo', attribute 'waitSteps': The attribute 'waitSteps' is not allowed.
< sumo/sublane_model/buridan_1lane/tripinfos.sumo:37:0:ERROR:SCHEMASV:SCHEMAV_CVC_COMPLEX_TYPE_4: Element 'tripinfo': The attribute 'stopTime' is required but missing.
< sumo/sublane_model/buridan_1lane/tripinfos.sumo:37:0:ERROR:SCHEMASV:SCHEMAV_CVC_COMPLEX_TYPE_4: Element 'tripinfo': The attribute 'waitingCount' is required but missing.
< sumo/sublane_model/buridan_1lane/tripinfos.sumo:37:0:ERROR:SCHEMASV:SCHEMAV_CVC_COMPLEX_TYPE_4: Element 'tripinfo': The attribute 'waitingTime' is required but missing.
< sumo/sublane_model/buridan_1lane/tripinfos.sumo:38:0:ERROR:SCHEMASV:SCHEMAV_CVC_COMPLEX_TYPE_3_2_1: Element 'tripinfo', attribute 'waitSteps': The attribute 'waitSteps' is not allowed.
< sumo/sublane_model/buridan_1lane/tripinfos.sumo:38:0:ERROR:SCHEMASV:SCHEMAV_CVC_COMPLEX_TYPE_4: Element 'tripinfo': The attribute 'stopTime' is required but missing.
<truncated after showing first 30 lines>
---------- Differences in output ----------
1d0
< <number> files checked

TEST FAILED on SUMO-mac : xml xml2csv amitran_trajectories_schema ( Last six runs Oct2019 )

---------- Differences in errors ----------
0a1
> lxml not available, skipping validation

Detailed information for the tests that had known bugs:

TEST had known bugs (see #5409) on SUMO-mac : detector flowrouter motorway_ramps lane_based ( Last six runs Oct2019 )

option lane-based does not work
(This bug was triggered by text found in file 'routes' matching 'on3 3 off3')
---------- Differences in flows ----------
2c2,3
<     <flow id="1_off3.qPKW" departSpeed="max" departPos="last" departLane="best" route="1_off3.qPKW" number="450" begin="0" end="3600"/>
---
>     <flow id="1_0_9_0.qPKW" departSpeed="max" departPos="last" departLane="best" route="1_0_9_0.qPKW" number="450" begin="0" end="3600"/>
>     <flow id="on3_0_off3_0.qPKW" departSpeed="max" departPos="last" departLane="best" route="on3_0_off3_0.qPKW" number="450" begin="0" end="3600"/>
---------- Differences in routes ----------
2c2,3
<     <route id="1_off3.qPKW" edges="1 2 3 off3"/>
---
>     <route id="1_0_9_0.qPKW" edges="1 2 3 4 5 6 7 8 9"/>
>     <route id="on3_0_off3_0.qPKW" edges="on3 3 off3"/>

TEST had known bugs (see #2620) on SUMO-mac : projects evacuation plain ( Last six runs Oct2019 )

unstable inputs
(This bug was triggered by text found in the full difference report matching 'Warning')
---------- Differences in errors ----------
1,6925c1
< Warning: Discarding unusable type 'waterway.canal' (first occurence for edge '4041237#0').
< Warning: Discarding unknown compound 'cycleway.track' in type 'cycleway.track|highway.primary' (first occurence for edge '4045243#0').
< Warning: Discarding unknown compound 'cycleway.lane' in type 'cycleway.lane|highway.residential' (first occurence for edge '4068019#0').
< Warning: Discarding unknown compound 'cycleway.lane' in type 'cycleway.lane|highway.primary' (first occurence for edge '4068043#0').
< Warning: Discarding unknown compound 'cycleway.track' in type 'cycleway.track|highway.secondary' (first occurence for edge '4068192').
< Warning: Discarding unknown compound 'cycleway.track' in type 'cycleway.track|highway.tertiary' (first occurence for edge '4377008#0').
< Warning: Discarding unknown compound 'cycleway.lane' in type 'cycleway.lane|highway.tertiary' (first occurence for edge '4377122#0').
< Warning: Discarding unknown compound 'cycleway.share_busway' in type 'cycleway.share_busway|highway.secondary' (first occurence for edge '4377785#0').
< Warning: Discarding unknown compound 'cycleway.lane' in type 'cycleway.lane|highway.secondary' (first occurence for edge '4383334').
< Warning: Discarding unusable type 'highway.construction' (first occurence for edge '4391568').
< Warning: Discarding unknown compound 'cycleway.track' in type 'cycleway.track|highway.residential' (first occurence for edge '4395586#0').
< Warning: Discarding unknown compound 'cycleway.share_busway' in type 'cycleway.share_busway|highway.primary' (first occurence for edge '4395950#0').
< Warning: Discarding unknown compound 'cycleway.opposite' in type 'cycleway.opposite|highway.residential' (first occurence for edge '4396234').
< Warning: Discarding unknown compound 'cycleway.track' in type 'cycleway.track|highway.living_street' (first occurence for edge '4410583').
< Warning: Discarding unknown compound 'cycleway.lane' in type 'cycleway.lane|highway.secondary_link' (first occurence for edge '4484071').
< Warning: Discarding unknown compound 'cycleway.track' in type 'cycleway.track|highway.cycleway' (first occurence for edge '4492364#0').
< Warning: Discarding unusable type 'railway.disused' (first occurence for edge '4525886').
< Warning: Discarding unusable type 'highway.proposed' (first occurence for edge '4611776#0').
< Warning: Discarding unknown compound 'cycleway.none' in type 'cycleway.none|highway.tertiary' (first occurence for edge '4612758#0').
< Warning: Discarding unknown compound 'cycleway.track' in type 'cycleway.track|cycleway.track|highway.primary' (first occurence for edge '4615457#0').
< Warning: Discarding unknown compound 'cycleway.track' in type 'cycleway.track|cycleway.track|highway.primary' (first occurence for edge '4615457#0').
< Warning: Discarding unknown compound 'cycleway.shared' in type 'cycleway.shared|highway.secondary' (first occurence for edge '4615594#0').
< Warning: Discarding unknown compound 'cycleway.opposite' in type 'cycleway.opposite|highway.living_street' (first occurence for edge '4639037#0').
< Warning: Discarding unknown compound 'cycleway.opposite_track' in type 'cycleway.opposite_track|cycleway.track|cycleway.track|highway.residential' (first occurence for edge '4686018#0').
< Warning: Discarding unknown compound 'cycleway.track' in type 'cycleway.opposite_track|cycleway.track|cycleway.track|highway.residential' (first occurence for edge '4686018#0').
< Warning: Discarding unknown compound 'cycleway.track' in type 'cycleway.opposite_track|cycleway.track|cycleway.track|highway.residential' (first occurence for edge '4686018#0').
< Warning: Discarding unusable type 'waterway.riverbank' (first occurence for edge '4686373#0').
< Warning: Discarding unknown compound 'cycleway.shared_lane' in type 'cycleway.shared_lane|highway.primary' (first occurence for edge '4790833#0').
< Warning: Discarding unusable type 'railway.abandoned' (first occurence for edge '4790904').
<truncated after showing first 30 lines>
---------- Differences in output ----------
1,97d0
< Parsing types from <DIR>/osmNetconvert.typ.xml'... done.
< Parsing nodes from osm-file 'osm_bbox.osm.xml'... 
< Found duplicate nodes. Substituting 3215103784 with 288002013
< Found duplicate nodes. Substituting 3987794203 with 3987794202
< Found duplicate nodes. Substituting 3997661445 with 3517810193
< Found duplicate nodes. Substituting 4016273048 with 26992494
< Found duplicate nodes. Substituting 4016273049 with 2306772973
< done.
< Parsing edges from osm-file 'osm_bbox.osm.xml'... done.
< Removing duplicate edges... 
< Found duplicate edges. Removing 310058575
< Found duplicate edges. Removing 310058576
< Found duplicate edges. Removing 310058577
< Found duplicate edges. Removing 335703516
< Found duplicate edges. Removing 335703519
< Found duplicate edges. Removing 335703532
< Found duplicate edges. Removing 377118659
< Found duplicate edges. Removing 377494320
< Found duplicate edges. Removing 391385403
< done.
< Adding new type 'highway.service|railway.tram' (first occurence for edge '167272531#0').
< Parsing relations from osm-file 'osm_bbox.osm.xml'... 
< done.
<  Removed 1494 traffic lights before loading plain-XML
<  Import done:
<    37203 nodes loaded.
<    34 types loaded.
<    36921 edges loaded.
< Proj projection parameters used: '+proj=utm +zone=33 +ellps=WGS84 +datum=WGS84 +units=m +no_defs'.
<truncated after showing first 30 lines>

TEST had known bugs (bug 1190 (NONEXISTENT)) on SUMO-mac : xml csv2xml cross3ltl_full_schema ( Last six runs Oct2019 )

Failed to open URL 'https://sumo.dlr.de/trac.wsgi/ticket/1190?format=tab': HTTP Error 404: Not Found.

Please make sure that bug 1190 exists
and that the configuration entry 'bug_system_location' points to the correct trac instance.
The current value is 'https://sumo.dlr.de/trac.wsgi/'.
(This bug was triggered by FAILING to find text in file 'xml' matching 'vehicles')
---------- Differences in xml ----------
1,32d0
< <?xml version="1.0" encoding="UTF-8"?>
< 
< <!-- generated on Tue Dec  3 16:33:35 2013 by SUMO sumo Version dev-SVN-r15233
< This data file and the accompanying materials
< are made available under the terms of the Eclipse Public License v2.0
< which accompanies this distribution, and is available at
< http://www.eclipse.org/legal/epl-v20.html
< SPDX-License-Identifier: EPL-2.0
< <configuration xmlns:xsi="http://www.w3.org/2001/XMLSchema-instance" xsi:noNamespaceSchemaLocation="http://sumo.dlr.de/xsd/sumoConfiguration.xsd">
< 
<     <input>
<         <net-file value="net.net.xml"/>
<         <route-files value="input_routes.rou.xml"/>
<     </input>
< 
<     <output>
<         <full-output value="full.xml"/>
<     </output>
< 
<     <time>
<         <begin value="0"/>
<         <end value="120"/>
<     </time>
< 
<     <report>
<         <no-duration-log value="true"/>
<         <no-step-log value="true"/>
<     </report>
< 
<truncated after showing first 30 lines>

TEST had known bugs (see #5588) on SUMO-mac : xml csv2xml meandata_edges_utf8 ( Last six runs Oct2019 )

python2 csv reader cannot handle utf8
(This bug was triggered by text found in file 'errors' matching 'UnicodeEncodeError')
---------- Differences in errors ----------
0a1,8
> Traceback (most recent call last):
>   File "/Users/sumo/clangMacOS/sumo/tests/../tools/xml/csv2xml.py", line 192, in <module>
>     main()
>   File "/Users/sumo/clangMacOS/sumo/tests/../tools/xml/csv2xml.py", line 188, in main
>     writeHierarchicalXml(xsd.XsdStructure(options.xsd), options)
>   File "/Users/sumo/clangMacOS/sumo/tests/../tools/xml/csv2xml.py", line 150, in writeHierarchicalXml
>     for raw in csv.reader(inputf, delimiter=options.delimiter):
> UnicodeEncodeError: 'ascii' codec can't encode character u'\xe4' in position 25: ordinal not in range(128)
---------- Differences in xml ----------
1,16c1
< <meandata>
<     <interval begin="0.00" end="60.00" id="dump_60">
<         <edge arrived="0" departed="0" entered="0" id="รค" laneChangedFrom="0" laneChangedTo="0" left="0" sampledSeconds="0.00"/>
<         <edge arrived="0" departed="0" entered="0" id="1o" laneChangedFrom="0" laneChangedTo="0" left="0" sampledSeconds="0.00"/>
<         <edge arrived="0" departed="0" entered="0" id="1si" laneChangedFrom="0" laneChangedTo="0" left="0" sampledSeconds="0.00"/>
<         <edge arrived="0" departed="0" entered="0" id="2fi" laneChangedFrom="0" laneChangedTo="0" left="0" sampledSeconds="0.00"/>
<         <edge arrived="0" departed="0" entered="0" id="2o" laneChangedFrom="0" laneChangedTo="0" left="0" sampledSeconds="0.00"/>
<         <edge arrived="0" departed="0" entered="0" id="2si" laneChangedFrom="0" laneChangedTo="0" left="0" sampledSeconds="0.00"/>
<         <edge arrived="0" departed="0" entered="0" id="3fi" laneChangedFrom="0" laneChangedTo="0" left="0" sampledSeconds="0.00"/>
<         <edge arrived="0" departed="0" entered="0" id="3o" laneChangedFrom="0" laneChangedTo="0" left="0" sampledSeconds="0.00"/>
<         <edge arrived="0" departed="0" entered="0" id="3si" laneChangedFrom="0" laneChangedTo="0" left="0" sampledSeconds="0.00"/>
<         <edge arrived="0" departed="0" entered="0" id="4fi" laneChangedFrom="0" laneChangedTo="0" left="0" sampledSeconds="0.00"/>
<         <edge arrived="0" departed="0" entered="0" id="4o" laneChangedFrom="0" laneChangedTo="0" left="0" sampledSeconds="0.00"/>
<         <edge arrived="0" departed="0" entered="0" id="4si" laneChangedFrom="0" laneChangedTo="0" left="0" sampledSeconds="0.00"/>
<     </interval>
< </meandata>
---
> <meandata
\ No newline at end of file