22Oct19rv1_3_1+0659-dc494f3eeb - detailed test results for TRACI

To reconnect the TextTest GUI to these results, run:

texttest -a traci -d /home/delphi/cmakeGcc/sumo/tests -reconnect /home/delphi/cmakeGcc/texttesttmp/cmake_gcc4_64.31Oct090341.2686 -g

To start TextTest for these tests, run:

texttest -a traci -d /home/delphi/cmakeGcc/sumo/tests


default: 591 tests: 590 succeeded 1 FAILED

Detailed information for the tests that FAILED:

TEST FAILED on ts-sim-build-ba : set_variable Vehicle MoveToVTD set_angle ( Last six runs Oct2019 )

---------- Differences in errors ----------
2,3d1
< Warning: Vehicle 'veh0' performs emergency braking with decel=-9.00 wished=4.50 severity=1.00, time=3.00.
< Warning: Vehicle 'veh0' performs emergency braking with decel=-9.00 wished=4.50 severity=1.00, time=4.00.