25Sep22rv1_14_1+1238-9b9cc23eb8f - detailed test results for COMPLEX

To reconnect the TextTest GUI to these results, run:

texttest -a complex -d /home/delphi/coverageGcc/sumo/tests -reconnect /home/delphi/coverageGcc/texttesttmp/coverage_gcc4_64.30Sep090834.784666 -g

To start TextTest for these tests, run:

texttest -a complex -d /home/delphi/coverageGcc/sumo/tests


default: 666 tests: 654 succeeded 10 known bugs 2 FAILED

Detailed information for the tests that FAILED:

TEST FAILED on ts-sim-build-ba : sumo protobuf ( Last six runs Sep2022 )

---------- Differences in errors ----------
0a1,58
> Traceback (most recent call last):
>   File "/home/delphi/coverageGcc/sumo/tools/xml/protobuf2xml.py", line 130, in <module>
>     main()
>   File "/home/delphi/coverageGcc/sumo/tools/xml/protobuf2xml.py", line 124, in main
>     module = xml2protobuf.generateProto(attrFinder.tagAttrs, attrFinder.depthTags,
>   File "/home/delphi/coverageGcc/sumo/tools/xml/xml2protobuf.py", line 187, in generateProto
>     return importlib.import_module("%s_pb2" % base)
>   File "/usr/lib/python3.8/importlib/__init__.py", line 127, in import_module
>     return _bootstrap._gcd_import(name[level:], package, level)
>   File "<frozen importlib._bootstrap>", line 1014, in _gcd_import
>   File "<frozen importlib._bootstrap>", line 991, in _find_and_load
>   File "<frozen importlib._bootstrap>", line 975, in _find_and_load_unlocked
>   File "<frozen importlib._bootstrap>", line 671, in _load_unlocked
>   File "<frozen importlib._bootstrap_external>", line 848, in exec_module
>   File "<frozen importlib._bootstrap>", line 219, in _call_with_frames_removed
>   File "/home/delphi/coverageGcc/texttesttmp/coverage_gcc4_64.25Sep090758.1384663/complex/sumo/protobuf/trajectories_pb2.py", line 32, in <module>
>     _descriptor.EnumValueDescriptor(
>   File "/home/delphi/.local/lib/python3.8/site-packages/google/protobuf/descriptor.py", line 755, in __new__
>     _message.Message._CheckCalledFromGeneratedFile()
> TypeError: Descriptors cannot not be created directly.
> If this call came from a _pb2.py file, your generated code is out of date and must be regenerated with protoc >= 3.19.0.
> If you cannot immediately regenerate your protos, some other possible workarounds are:
>  1. Downgrade the protobuf package to 3.20.x or lower.
>  2. Set PROTOCOL_BUFFERS_PYTHON_IMPLEMENTATION=python (but this will use pure-Python parsing and will be much slower).
> 
> More information: https://developers.google.com/protocol-buffers/docs/news/2022-05-06#python-updates
> Traceback (most recent call last):
>   File "/home/delphi/coverageGcc/sumo/tools/xml/xml2protobuf.py", line 210, in <module>
>     main()
<truncated after showing first 30 lines>
---------- Differences in output ----------
1,5d0
< --- 
< +++ 
< -
< -<trajectories xmlns:xsi="http://www.w3.org/2001/XMLSchema-instance" xsi:noNamespaceSchemaLocation="http://sumo.dlr.de/xsd/amitran/trajectories.xsd" timeStepSize="1000">
< +<trajectories timeStepSize="1000">

TEST FAILED on ts-sim-build-ba : tutorial city_mobil taxi_cyber ( Last six runs Sep2022 )

---------- Differences in errors ----------
1,2c1
< Warning: Person 'v-7.5p0' is jammed on edge 'cyber6to7', time=644.00.
< Warning: Person 'v7.6p2' is jammed on edge 'cyber6to7', time=648.00.
---
> Warning: Person 'v-7.6p0' is jammed on edge 'cyber6to7', time=681.00.

Detailed information for the tests that had known bugs:

TEST had known bugs (see #8973) on ts-sim-build-ba : sumo ToCDevice dynamic_ToC_stop ( Last six runs Sep2022 )

dynamic ToC triggered despite stop present on vehicle's lane continuation
(This bug was triggered by text found in file 'tocs' matching 'DYNTOR')

TEST had known bugs (see #254) on ts-sim-build-ba : sumo output one_vehicle ( Last six runs Sep2022 )

different outputs from detectors which should detect the same
(This bug was triggered by text found in file 'output' matching 'failed')
---------- Differences in output ----------
5,7c5,7
< success 0.1 ['--step-length', '.1', '--end', '100'] ['3/1to2/1_0']
< success 1 ['--step-length', '.1', '--end', '100'] ['3/1to2/1_0']
< success 10 ['--step-length', '.1', '--end', '100'] ['3/1to2/1_0']
---
> failed 0.1 ['--step-length', '.1', '--end', '100'] 3/1to2/1_0 (71.4, 71.5) <zip object at 0x7f2bdc81d4c0>
> failed 1 ['--step-length', '.1', '--end', '100'] 3/1to2/1_0 (72.0, 73.0) <zip object at 0x7f2bdc864b40>
> failed 10 ['--step-length', '.1', '--end', '100'] 3/1to2/1_0 (80.0, 90.0) <zip object at 0x7f2bdc864640>
9,12c9,12
< success 0.1 ['--step-length', '.1', '--end', '1000'] ['3/1to2/1_0']
< success 1 ['--step-length', '.1', '--end', '1000'] ['3/1to2/1_0']
< success 10 ['--step-length', '.1', '--end', '1000'] ['3/1to2/1_0']
< success 100 ['--step-length', '.1', '--end', '1000'] ['3/1to2/1_0']
---
> failed 0.1 ['--step-length', '.1', '--end', '1000'] 3/1to2/1_0 (71.4, 71.5) <zip object at 0x7f2bdc4e43c0>
> failed 1 ['--step-length', '.1', '--end', '1000'] 3/1to2/1_0 (72.0, 73.0) <zip object at 0x7f2bdc7f7780>
> failed 10 ['--step-length', '.1', '--end', '1000'] 3/1to2/1_0 (80.0, 90.0) <zip object at 0x7f2bdc7f7c00>
> failed 100 ['--step-length', '.1', '--end', '1000'] 3/1to2/1_0 (100.0, 200.0) <zip object at 0x7f2bdc7f79c0>
17,19c17,19
< success 0.1 ['--step-length', '1', '--end', '100'] ['3/1to2/1_0']
< success 1 ['--step-length', '1', '--end', '100'] ['3/1to2/1_0']
< success 10 ['--step-length', '1', '--end', '100'] ['3/1to2/1_0']
---
> failed 0.1 ['--step-length', '1', '--end', '100'] 3/1to2/1_0 (73.0, 74.0) <zip object at 0x7f2bdc8579c0>
> failed 1 ['--step-length', '1', '--end', '100'] 3/1to2/1_0 (73.0, 74.0) <zip object at 0x7f2bdc7b0380>
> failed 10 ['--step-length', '1', '--end', '100'] 3/1to2/1_0 (80.0, 90.0) <zip object at 0x7f2bdc813cc0>
21,50c21,24
< success 0.1 ['--step-length', '1', '--end', '1000'] ['3/1to2/1_0']
< success 1 ['--step-length', '1', '--end', '1000'] ['3/1to2/1_0']
< success 10 ['--step-length', '1', '--end', '1000'] ['3/1to2/1_0']
<truncated after showing first 30 lines>

TEST had known bugs (see #254) on ts-sim-build-ba : sumo output teleport ( Last six runs Sep2022 )

different outputs from detectors which should detect the same
(This bug was triggered by text found in file 'output' matching 'failed')
---------- Differences in output ----------
1,98c1,48
< success ['--step-length', '.1', '--end', '51'] ['2/1to1/1_0']
< success ['--step-length', '.1', '--end', '51'] ['2/1to1/1_0', '1/1to0/1_0']
< success ['--step-length', '.1', '--end', '51'] ['2/1to1/1_0']
< success ['--step-length', '.1', '--end', '51'] ['2/1to1/1_0', '1/1to0/1_0']
< success ['--step-length', '.1', '--end', '51'] ['2/1to1/1_0']
< success ['--step-length', '.1', '--end', '51'] ['2/1to1/1_0', '1/1to0/1_0']
< success ['--step-length', '.1', '--end', '51'] ['2/1to1/1_0']
< success ['--step-length', '.1', '--end', '51'] ['2/1to1/1_0', '1/1to0/1_0']
< success ['--step-length', '.1', '--end', '100'] ['2/1to1/1_0']
< success ['--step-length', '.1', '--end', '100'] ['2/1to1/1_0', '1/1to0/1_0']
< success ['--step-length', '.1', '--end', '100'] ['2/1to1/1_0']
< success ['--step-length', '.1', '--end', '100'] ['2/1to1/1_0', '1/1to0/1_0']
< success ['--step-length', '.1', '--end', '100'] ['2/1to1/1_0']
< success ['--step-length', '.1', '--end', '100'] ['2/1to1/1_0', '1/1to0/1_0']
< success ['--step-length', '.1', '--end', '100'] ['2/1to1/1_0']
< success ['--step-length', '.1', '--end', '100'] ['2/1to1/1_0', '1/1to0/1_0']
< failed ['--step-length', '.1', '--end', '1000'] 2/1to1/1_0 (108.6, 108.7) [9.9, 10.0, 9.9, 9.9]
< failed ['--step-length', '.1', '--end', '1000'] 2/1to1/1_0 (108.6, 108.7) [9.9, 10.0, 9.9, 9.9]
< failed ['--step-length', '.1', '--end', '1000'] 2/1to1/1_0 (108.0, 109.0) [9.87, 10.0, 9.87, 9.87]
< failed ['--step-length', '.1', '--end', '1000'] 2/1to1/1_0 (108.0, 109.0) [9.87, 10.0, 9.87, 9.87]
< failed ['--step-length', '.1', '--end', '1000'] 2/1to1/1_0 (100.0, 110.0) [9.85, 9.96, 9.85, 9.85]
< failed ['--step-length', '.1', '--end', '1000'] 2/1to1/1_0 (100.0, 110.0) [9.85, 9.96, 9.85, 9.85]
< failed ['--step-length', '.1', '--end', '1000'] 2/1to1/1_0 (100.0, 200.0) [-1.0, 2.26, 3.2, 2.27, 2.27]
< failed ['--step-length', '.1', '--end', '1000'] 2/1to1/1_0 (100.0, 200.0) [-1.0, 2.26, 3.2, 2.27, 2.27]
< success ['--step-length', '1', '--end', '51'] ['2/1to1/1_0']
< success ['--step-length', '1', '--end', '51'] ['2/1to1/1_0', '1/1to0/1_0']
< success ['--step-length', '1', '--end', '51'] ['2/1to1/1_0']
< success ['--step-length', '1', '--end', '51'] ['2/1to1/1_0', '1/1to0/1_0']
< success ['--step-length', '1', '--end', '51'] ['2/1to1/1_0']
<truncated after showing first 30 lines>

TEST had known bugs (see #254) on ts-sim-build-ba : sumo output teleport_multihop ( Last six runs Sep2022 )

different outputs from detectors which should detect the same
(This bug was triggered by text found in file 'output' matching 'failed')
---------- Differences in output ----------
17,24c17,24
< success 0.1 ['--step-length', '.1', '--end', '1000'] 2/1to1/1_0 (230.0, 230.1) [('e2', 9.99), ('e3', 10.0), ('edge', 9.99), ('lane', 9.99)]
< success 0.1 ['--step-length', '.1', '--end', '1000'] 1/1to0/1_0 (148.1, 148.2) [('e2', 9.99), ('e3', 10.0), ('edge', 9.99), ('lane', 9.99)]
< success 1 ['--step-length', '.1', '--end', '1000'] 2/1to1/1_0 (230.0, 231.0) [('e2', 9.99), ('e3', 10.0), ('edge', 9.99), ('lane', 9.99)]
< success 1 ['--step-length', '.1', '--end', '1000'] 1/1to0/1_0 (148.0, 149.0) [('e2', 9.91), ('e3', 10.0), ('edge', 9.91), ('lane', 9.91)]
< success 10 ['--step-length', '.1', '--end', '1000'] 2/1to1/1_0 (230.0, 240.0) [('e2', 9.42), ('e3', 9.9), ('edge', 9.42), ('lane', 9.42)]
< success 10 ['--step-length', '.1', '--end', '1000'] 1/1to0/1_0 (140.0, 150.0) [('e2', 9.96), ('e3', 9.99), ('edge', 9.96), ('lane', 9.96)]
< success 100 ['--step-length', '.1', '--end', '1000'] 2/1to1/1_0 (200.0, 300.0) [('e1', 10.0), ('e2', 9.22), ('e3', 5.71), ('edge', 9.22), ('lane', 9.22)]
< success 100 ['--step-length', '.1', '--end', '1000'] 1/1to0/1_0 (100.0, 200.0) [('e1', 9.53), ('e2', 5.82), ('e3', 6.93), ('edge', 5.82), ('lane', 5.82)]
---
> failed 0.1 ['--step-length', '.1', '--end', '1000'] 2/1to1/1_0 (148.9, 149.0) <zip object at 0x7f09b29af300>
> failed 0.1 ['--step-length', '.1', '--end', '1000'] 2/1to1/1_0 (148.9, 149.0) <zip object at 0x7f09b26980c0>
> failed 1 ['--step-length', '.1', '--end', '1000'] 2/1to1/1_0 (149.0, 150.0) <zip object at 0x7f09b29a4040>
> failed 1 ['--step-length', '.1', '--end', '1000'] 2/1to1/1_0 (149.0, 150.0) <zip object at 0x7f09b2ea77c0>
> failed 10 ['--step-length', '.1', '--end', '1000'] 2/1to1/1_0 (140.0, 150.0) <zip object at 0x7f09b2e60cc0>
> failed 10 ['--step-length', '.1', '--end', '1000'] 2/1to1/1_0 (140.0, 150.0) <zip object at 0x7f09b2e60a40>
> failed 100 ['--step-length', '.1', '--end', '1000'] 2/1to1/1_0 (100.0, 200.0) <zip object at 0x7f09b2e60d80>
> failed 100 ['--step-length', '.1', '--end', '1000'] 2/1to1/1_0 (100.0, 200.0) <zip object at 0x7f09b2e60080>
41,98c41,48
< success 0.1 ['--step-length', '1', '--end', '1000'] 2/1to1/1_0 (245.0, 246.0) [('e2', 8.92), ('e3', 10.0), ('edge', 8.92), ('lane', 8.92)]
< success 0.1 ['--step-length', '1', '--end', '1000'] 1/1to0/1_0 (150.0, 151.0) [('e2', 9.82), ('e3', 10.0), ('edge', 9.82), ('lane', 9.82)]
< success 1 ['--step-length', '1', '--end', '1000'] 2/1to1/1_0 (245.0, 246.0) [('e2', 8.92), ('e3', 10.0), ('edge', 8.92), ('lane', 8.92)]
< success 1 ['--step-length', '1', '--end', '1000'] 1/1to0/1_0 (150.0, 151.0) [('e2', 9.82), ('e3', 10.0), ('edge', 9.82), ('lane', 9.82)]
< success 10 ['--step-length', '1', '--end', '1000'] 2/1to1/1_0 (240.0, 250.0) [('e2', 9.9), ('e3', 10.0), ('edge', 9.9), ('lane', 9.9)]
< success 10 ['--step-length', '1', '--end', '1000'] 1/1to0/1_0 (150.0, 160.0) [('e2', 9.15), ('e3', 9.84), ('edge', 9.15), ('lane', 9.15)]
< success 100 ['--step-length', '1', '--end', '1000'] 2/1to1/1_0 (200.0, 300.0) [('e1', 10.0), ('e2', 9.41), ('e3', 5.84), ('edge', 9.41), ('lane', 9.41)]
< success 100 ['--step-length', '1', '--end', '1000'] 1/1to0/1_0 (100.0, 200.0) [('e1', 10.0), ('e2', 5.94), ('e3', 7.08), ('edge', 5.94), ('lane', 5.94)]
< -- Unordered text as found by filter '^Loading configuration ... done.' --
< Loading configuration ... done.
< Loading configuration ... done.
<truncated after showing first 30 lines>

TEST had known bugs (see #254) on ts-sim-build-ba : sumo output teleport_multihop_newDefaults ( Last six runs Sep2022 )

different outputs from detectors which should detect the same
(This bug was triggered by text found in file 'output' matching 'failed')
---------- Differences in output ----------
9,24c9,24
< failed 0.1 ['--step-length', '.1', '--end', '100'] 2/1to1/1_0 (76.2, 76.3) [('e2', 10.49), ('e3', 10.35), ('edge', 10.49), ('lane', 10.49)]
< failed 0.1 ['--step-length', '.1', '--end', '100'] 2/1to1/1_0 (76.2, 76.3) [('e2', 10.49), ('e3', 10.35), ('edge', 10.49), ('lane', 10.49)]
< failed 1 ['--step-length', '.1', '--end', '100'] 2/1to1/1_0 (76.0, 77.0) [('e2', 10.39), ('e3', 10.35), ('edge', 10.39), ('lane', 10.39)]
< failed 1 ['--step-length', '.1', '--end', '100'] 2/1to1/1_0 (76.0, 77.0) [('e2', 10.39), ('e3', 10.35), ('edge', 10.39), ('lane', 10.39)]
< failed 10 ['--step-length', '.1', '--end', '100'] 2/1to1/1_0 (70.0, 80.0) [('e2', 10.42), ('e3', 10.25), ('edge', 10.42), ('lane', 10.42)]
< failed 10 ['--step-length', '.1', '--end', '100'] 2/1to1/1_0 (70.0, 80.0) [('e2', 10.42), ('e3', 10.25), ('edge', 10.42), ('lane', 10.42)]
< failed 100 ['--step-length', '.1', '--end', '100'] 2/1to1/1_0 (0.0, 100.0) [('e1', 10.27), ('e2', 10.24), ('e3', 9.59), ('edge', 10.24), ('lane', 10.24)]
< failed 100 ['--step-length', '.1', '--end', '100'] 2/1to1/1_0 (0.0, 100.0) [('e1', 10.27), ('e2', 10.24), ('e3', 9.59), ('edge', 10.24), ('lane', 10.24)]
< failed 0.1 ['--step-length', '.1', '--end', '1000'] 2/1to1/1_0 (76.2, 76.3) [('e2', 10.49), ('e3', 10.35), ('edge', 10.49), ('lane', 10.49)]
< failed 0.1 ['--step-length', '.1', '--end', '1000'] 2/1to1/1_0 (76.2, 76.3) [('e2', 10.49), ('e3', 10.35), ('edge', 10.49), ('lane', 10.49)]
< failed 1 ['--step-length', '.1', '--end', '1000'] 2/1to1/1_0 (76.0, 77.0) [('e2', 10.39), ('e3', 10.35), ('edge', 10.39), ('lane', 10.39)]
< failed 1 ['--step-length', '.1', '--end', '1000'] 2/1to1/1_0 (76.0, 77.0) [('e2', 10.39), ('e3', 10.35), ('edge', 10.39), ('lane', 10.39)]
< failed 10 ['--step-length', '.1', '--end', '1000'] 2/1to1/1_0 (70.0, 80.0) [('e2', 10.42), ('e3', 10.25), ('edge', 10.42), ('lane', 10.42)]
< failed 10 ['--step-length', '.1', '--end', '1000'] 2/1to1/1_0 (70.0, 80.0) [('e2', 10.42), ('e3', 10.25), ('edge', 10.42), ('lane', 10.42)]
< failed 100 ['--step-length', '.1', '--end', '1000'] 2/1to1/1_0 (0.0, 100.0) [('e1', 10.27), ('e2', 10.24), ('e3', 9.59), ('edge', 10.24), ('lane', 10.24)]
< failed 100 ['--step-length', '.1', '--end', '1000'] 2/1to1/1_0 (0.0, 100.0) [('e1', 10.27), ('e2', 10.24), ('e3', 9.59), ('edge', 10.24), ('lane', 10.24)]
---
> failed 0.1 ['--step-length', '.1', '--end', '100'] 2/1to1/1_0 (70.9, 71.0) <zip object at 0x7f471cdb9440>
> failed 0.1 ['--step-length', '.1', '--end', '100'] 2/1to1/1_0 (70.9, 71.0) <zip object at 0x7f471cd8b3c0>
> failed 1 ['--step-length', '.1', '--end', '100'] 2/1to1/1_0 (70.0, 71.0) <zip object at 0x7f471cda6040>
> failed 1 ['--step-length', '.1', '--end', '100'] 2/1to1/1_0 (70.0, 71.0) <zip object at 0x7f471cda6ec0>
> failed 10 ['--step-length', '.1', '--end', '100'] 2/1to1/1_0 (70.0, 80.0) <zip object at 0x7f471cda68c0>
> failed 10 ['--step-length', '.1', '--end', '100'] 2/1to1/1_0 (70.0, 80.0) <zip object at 0x7f471cda6bc0>
> failed 100 ['--step-length', '.1', '--end', '100'] 2/1to1/1_0 (0.0, 100.0) <zip object at 0x7f471cda6f00>
> failed 100 ['--step-length', '.1', '--end', '100'] 2/1to1/1_0 (0.0, 100.0) <zip object at 0x7f471cda8380>
> failed 0.1 ['--step-length', '.1', '--end', '1000'] 2/1to1/1_0 (70.9, 71.0) <zip object at 0x7f471c8ad080>
> failed 0.1 ['--step-length', '.1', '--end', '1000'] 2/1to1/1_0 (70.9, 71.0) <zip object at 0x7f471c595180>
> failed 1 ['--step-length', '.1', '--end', '1000'] 2/1to1/1_0 (70.0, 71.0) <zip object at 0x7f471ca7e040>
> failed 1 ['--step-length', '.1', '--end', '1000'] 2/1to1/1_0 (70.0, 71.0) <zip object at 0x7f471cdab580>
<truncated after showing first 30 lines>

TEST had known bugs (see #254) on ts-sim-build-ba : sumo output two_same_vehicles ( Last six runs Sep2022 )

different outputs from detectors which should detect the same
(This bug was triggered by text found in file 'output' matching 'failed')
---------- Differences in output ----------
5,7c5,7
< success 0.1 ['--step-length', '.1', '--end', '100'] ['3/1to2/1_0']
< success 1 ['--step-length', '.1', '--end', '100'] ['3/1to2/1_0']
< success 10 ['--step-length', '.1', '--end', '100'] ['3/1to2/1_0']
---
> failed 0.1 ['--step-length', '.1', '--end', '100'] 3/1to2/1_0 (75.4, 75.5) <zip object at 0x7f6537853340>
> failed 1 ['--step-length', '.1', '--end', '100'] 3/1to2/1_0 (76.0, 77.0) <zip object at 0x7f653788cd40>
> failed 10 ['--step-length', '.1', '--end', '100'] 3/1to2/1_0 (80.0, 90.0) <zip object at 0x7f6537889780>
9,12c9,12
< success 0.1 ['--step-length', '.1', '--end', '1000'] ['3/1to2/1_0']
< success 1 ['--step-length', '.1', '--end', '1000'] ['3/1to2/1_0']
< success 10 ['--step-length', '.1', '--end', '1000'] ['3/1to2/1_0']
< success 100 ['--step-length', '.1', '--end', '1000'] ['3/1to2/1_0']
---
> failed 0.1 ['--step-length', '.1', '--end', '1000'] 3/1to2/1_0 (75.4, 75.5) <zip object at 0x7f653751a3c0>
> failed 1 ['--step-length', '.1', '--end', '1000'] 3/1to2/1_0 (76.0, 77.0) <zip object at 0x7f653785c900>
> failed 10 ['--step-length', '.1', '--end', '1000'] 3/1to2/1_0 (80.0, 90.0) <zip object at 0x7f653785c680>
> failed 100 ['--step-length', '.1', '--end', '1000'] 3/1to2/1_0 (100.0, 200.0) <zip object at 0x7f65377ebf00>
17,19c17,19
< success 0.1 ['--step-length', '1', '--end', '100'] ['3/1to2/1_0']
< success 1 ['--step-length', '1', '--end', '100'] ['3/1to2/1_0']
< success 10 ['--step-length', '1', '--end', '100'] ['3/1to2/1_0']
---
> failed 0.1 ['--step-length', '1', '--end', '100'] 3/1to2/1_0 (77.0, 78.0) <zip object at 0x7f6537851e80>
> failed 1 ['--step-length', '1', '--end', '100'] 3/1to2/1_0 (77.0, 78.0) <zip object at 0x7f653784e240>
> failed 10 ['--step-length', '1', '--end', '100'] 3/1to2/1_0 (80.0, 90.0) <zip object at 0x7f653784ea40>
21,50c21,24
< success 0.1 ['--step-length', '1', '--end', '1000'] ['3/1to2/1_0']
< success 1 ['--step-length', '1', '--end', '1000'] ['3/1to2/1_0']
< success 10 ['--step-length', '1', '--end', '1000'] ['3/1to2/1_0']
<truncated after showing first 30 lines>

TEST had known bugs (see #254) on ts-sim-build-ba : sumo output two_vehicles_diff_length ( Last six runs Sep2022 )

different outputs from detectors which should detect the same
(This bug was triggered by text found in file 'output' matching 'failed')
---------- Differences in output ----------
5,7c5,7
< success 0.1 ['--step-length', '.1', '--end', '100'] ['3/1to2/1_0']
< success 1 ['--step-length', '.1', '--end', '100'] ['3/1to2/1_0']
< success 10 ['--step-length', '.1', '--end', '100'] ['3/1to2/1_0']
---
> failed 0.1 ['--step-length', '.1', '--end', '100'] 3/1to2/1_0 (76.4, 76.5) <zip object at 0x7fc8873491c0>
> failed 1 ['--step-length', '.1', '--end', '100'] 3/1to2/1_0 (77.0, 78.0) <zip object at 0x7fc8873cfd00>
> failed 10 ['--step-length', '.1', '--end', '100'] 3/1to2/1_0 (80.0, 90.0) <zip object at 0x7fc887384040>
9,12c9,12
< success 0.1 ['--step-length', '.1', '--end', '1000'] ['3/1to2/1_0']
< success 1 ['--step-length', '.1', '--end', '1000'] ['3/1to2/1_0']
< success 10 ['--step-length', '.1', '--end', '1000'] ['3/1to2/1_0']
< success 100 ['--step-length', '.1', '--end', '1000'] ['3/1to2/1_0']
---
> failed 0.1 ['--step-length', '.1', '--end', '1000'] 3/1to2/1_0 (76.4, 76.5) <zip object at 0x7fc887018440>
> failed 1 ['--step-length', '.1', '--end', '1000'] 3/1to2/1_0 (77.0, 78.0) <zip object at 0x7fc8872df100>
> failed 10 ['--step-length', '.1', '--end', '1000'] 3/1to2/1_0 (80.0, 90.0) <zip object at 0x7fc8872df800>
> failed 100 ['--step-length', '.1', '--end', '1000'] 3/1to2/1_0 (100.0, 200.0) <zip object at 0x7fc88734cd80>
17,19c17,19
< success 0.1 ['--step-length', '1', '--end', '100'] ['3/1to2/1_0']
< success 1 ['--step-length', '1', '--end', '100'] ['3/1to2/1_0']
< success 10 ['--step-length', '1', '--end', '100'] ['3/1to2/1_0']
---
> failed 0.1 ['--step-length', '1', '--end', '100'] 3/1to2/1_0 (78.0, 79.0) <zip object at 0x7fc887391500>
> failed 1 ['--step-length', '1', '--end', '100'] 3/1to2/1_0 (78.0, 79.0) <zip object at 0x7fc88738cf80>
> failed 10 ['--step-length', '1', '--end', '100'] 3/1to2/1_0 (80.0, 90.0) <zip object at 0x7fc88738cdc0>
21,50c21,24
< success 0.1 ['--step-length', '1', '--end', '1000'] ['3/1to2/1_0']
< success 1 ['--step-length', '1', '--end', '1000'] ['3/1to2/1_0']
< success 10 ['--step-length', '1', '--end', '1000'] ['3/1to2/1_0']
<truncated after showing first 30 lines>

TEST had known bugs (see #254) on ts-sim-build-ba : sumo output two_vehicles_diff_speed ( Last six runs Sep2022 )

different outputs from detectors which should detect the same
(This bug was triggered by text found in file 'output' matching 'failed')
---------- Differences in output ----------
0a1,24
> failed 0.1 ['--step-length', '.1', '--end', '51'] 3/1to2/1_0 (38.4, 38.5) <zip object at 0x7fde4ec2c4c0>
> failed 1 ['--step-length', '.1', '--end', '51'] 3/1to2/1_0 (38.0, 39.0) <zip object at 0x7fde4ec1fb40>
> failed 10 ['--step-length', '.1', '--end', '51'] 3/1to2/1_0 (30.0, 40.0) <zip object at 0x7fde4ec2e240>
> failed 100 ['--step-length', '.1', '--end', '51'] 3/1to2/1_0 (0.0, 51.0) <zip object at 0x7fde4ec2e140>
> failed 0.1 ['--step-length', '.1', '--end', '100'] 3/1to2/1_0 (38.4, 38.5) <zip object at 0x7fde4ebd8f00>
> failed 1 ['--step-length', '.1', '--end', '100'] 3/1to2/1_0 (38.0, 39.0) <zip object at 0x7fde4ec03b80>
> failed 10 ['--step-length', '.1', '--end', '100'] 3/1to2/1_0 (30.0, 40.0) <zip object at 0x7fde4ec03f40>
> failed 100 ['--step-length', '.1', '--end', '100'] 3/1to2/1_0 (0.0, 100.0) <zip object at 0x7fde4ec03d40>
> failed 0.1 ['--step-length', '.1', '--end', '1000'] 3/1to2/1_0 (38.4, 38.5) <zip object at 0x7fde4e835fc0>
> failed 1 ['--step-length', '.1', '--end', '1000'] 3/1to2/1_0 (38.0, 39.0) <zip object at 0x7fde4eb815c0>
> failed 10 ['--step-length', '.1', '--end', '1000'] 3/1to2/1_0 (30.0, 40.0) <zip object at 0x7fde4eb81540>
> failed 100 ['--step-length', '.1', '--end', '1000'] 3/1to2/1_0 (0.0, 100.0) <zip object at 0x7fde4ebfecc0>
> failed 0.1 ['--step-length', '1', '--end', '51'] 3/1to2/1_0 (39.0, 40.0) <zip object at 0x7fde4ebfe780>
> failed 1 ['--step-length', '1', '--end', '51'] 3/1to2/1_0 (39.0, 40.0) <zip object at 0x7fde4ebfe9c0>
> failed 10 ['--step-length', '1', '--end', '51'] 3/1to2/1_0 (30.0, 40.0) <zip object at 0x7fde4ebfebc0>
> failed 100 ['--step-length', '1', '--end', '51'] 3/1to2/1_0 (0.0, 51.0) <zip object at 0x7fde4ebd8900>
> failed 0.1 ['--step-length', '1', '--end', '100'] 3/1to2/1_0 (39.0, 40.0) <zip object at 0x7fde4ebd8b00>
> failed 1 ['--step-length', '1', '--end', '100'] 3/1to2/1_0 (39.0, 40.0) <zip object at 0x7fde4ebd8480>
> failed 10 ['--step-length', '1', '--end', '100'] 3/1to2/1_0 (30.0, 40.0) <zip object at 0x7fde4ebd8700>
> failed 100 ['--step-length', '1', '--end', '100'] 3/1to2/1_0 (0.0, 100.0) <zip object at 0x7fde4ebd8780>
> failed 0.1 ['--step-length', '1', '--end', '1000'] 3/1to2/1_0 (39.0, 40.0) <zip object at 0x7fde4ebd8280>
> failed 1 ['--step-length', '1', '--end', '1000'] 3/1to2/1_0 (39.0, 40.0) <zip object at 0x7fde4eb7c8c0>
> failed 10 ['--step-length', '1', '--end', '1000'] 3/1to2/1_0 (30.0, 40.0) <zip object at 0x7fde4ec1f580>
> failed 100 ['--step-length', '1', '--end', '1000'] 3/1to2/1_0 (0.0, 100.0) <zip object at 0x7fde4ebe2c80>

TEST had known bugs (see #3263) on ts-sim-build-ba : traci vehicle moveToXY keepRoute2 ( Last six runs Sep2022 )

mapping failure
(This bug was triggered by text found in file 'output' matching 'failed')
---------- Differences in output ----------
0a1
> internal corner (inside, segment2) failed: x=198, x2=198.0,   y=1.9, y2=1.9,   lane=middle_0, lane2=middle_0, pos=102, pos2=98.0   posLat=2.0 posLat2=1.9

TEST had known bugs (see #6192) on ts-sim-build-ba : traci vehicle openGap with_low_maxDecel_fast_CACC ( Last six runs Sep2022 )

not even failing as intended
(This bug was triggered by text found in file 'errors' matching 'Error')
---------- Differences in errors ----------
0a1,8
> Traceback (most recent call last):
>   File "/home/delphi/coverageGcc/sumo/tests/../tests/complex/traci/vehicle/openGap/runner.py", line 156, in <module>
>     runSingle(targetTimeHeadway, targetSpaceHeadway, duration, changeRate, maxDecel, refVehID)
>   File "/home/delphi/coverageGcc/sumo/tests/../tests/complex/traci/vehicle/openGap/runner.py", line 66, in runSingle
>     leader = results[tc.VAR_LEADER][0]
> TypeError: 'NoneType' object is not subscriptable
> Error: tcpip::Socket::recvAndCheck @ recv: peer shutdown
> Quitting (on error).
---------- Differences in output ----------
3,102c3,102
< Time 2.0: Gap 'follower'->'leader' = 5.938 (headway=0.367)
< 'follower' speed = 16.161582708
< Time 3.0: Gap 'follower'->'leader' = 8.966 (headway=0.528)
< 'follower' speed = 16.9836198736
< Time 4.0: Gap 'follower'->'leader' = 11.281 (headway=0.641)
< 'follower' speed = 17.5863190784
< Time 5.0: Gap 'follower'->'leader' = 13.069 (headway=0.725)
< 'follower' speed = 18.0379935645
< Time 6.0: Gap 'follower'->'leader' = 14.459 (headway=0.787)
< 'follower' speed = 18.3815472225
< Time 7.0: Gap 'follower'->'leader' = 15.545 (headway=0.834)
< 'follower' speed = 18.6456171431
< Time 8.0: Gap 'follower'->'leader' = 16.397 (headway=0.870)
< 'follower' speed = 18.8501483763
< Time 9.0: Gap 'follower'->'leader' = 17.068 (headway=0.898)
< 'follower' speed = 19.0094667411
< Time 10.0: Gap 'follower'->'leader' = 17.596 (headway=0.920)
< 'follower' speed = 19.1340998278
< Time 11.0: Gap 'follower'->'leader' = 18.013 (headway=0.937)
< 'follower' speed = 19.231918606
< Time 12.0: Gap 'follower'->'leader' = 18.342 (headway=0.950)
< 'follower' speed = 19.3088858604
< Time 13.0: Gap 'follower'->'leader' = 18.603 (headway=0.960)
< 'follower' speed = 19.3695649077
< Time 14.0: Gap 'follower'->'leader' = 18.810 (headway=0.969)
< 'follower' speed = 19.4174756866
< Time 15.0: Gap 'follower'->'leader' = 18.973 (headway=0.975)
< 'follower' speed = 19.4553500651
< Time 16.0: Gap 'follower'->'leader' = 19.103 (headway=0.980)
<truncated after showing first 30 lines>