Test results for COMPLEX

(generated by unknown at 22Jan08:56)

libsumo.python3 libtraci.python3 meso python3

test_default.libsumo.python3.pngtest_default.libtraci.python3.pngtest_default.meso.pngtest_default.python3.png

Last six runs

Dec2020 Jan2021


libsumo.python3

test_default.libsumo.python3.png

Test16Jan202117Jan202118Jan202119Jan202120Jan202121Jan2021
Summary257 tests: 255 FAILED 2 known bugs 257 tests: 255 FAILED 2 known bugs 257 tests: 255 FAILED 2 known bugs 257 tests: 255 FAILED 2 known bugs 257 tests: 255 FAILED 2 known bugs 257 tests: 255 FAILED 2 known bugs
simpla config errors different ts-sim-build-baerrors different ts-sim-build-baerrors different ts-sim-build-baerrors different ts-sim-build-baerrors different ts-sim-build-baerrors different ts-sim-build-ba
simpla openGap errors different ts-sim-build-baerrors different ts-sim-build-baerrors different ts-sim-build-baerrors different ts-sim-build-baerrors different ts-sim-build-baerrors different ts-sim-build-ba
simpla platoon_manager errors different ts-sim-build-baerrors different ts-sim-build-baerrors different ts-sim-build-baerrors different ts-sim-build-baerrors different ts-sim-build-baerrors different ts-sim-build-ba
traci ContextSubscriptionFilters fieldOfVision incompatible_filter errors different ts-sim-build-baerrors different ts-sim-build-baerrors different ts-sim-build-baerrors different ts-sim-build-baerrors different ts-sim-build-baerrors different ts-sim-build-ba
traci ContextSubscriptionFilters fieldOfVision persons range_50_angle_90 errors different ts-sim-build-baerrors different ts-sim-build-baerrors different ts-sim-build-baerrors different ts-sim-build-baerrors different ts-sim-build-baerrors different ts-sim-build-ba
traci ContextSubscriptionFilters fieldOfVision range_0_angle_90 errors different ts-sim-build-baerrors different ts-sim-build-baerrors different ts-sim-build-baerrors different ts-sim-build-baerrors different ts-sim-build-baerrors different ts-sim-build-ba
traci ContextSubscriptionFilters fieldOfVision range_50_angle_0 errors different ts-sim-build-baerrors different ts-sim-build-baerrors different ts-sim-build-baerrors different ts-sim-build-baerrors different ts-sim-build-baerrors different ts-sim-build-ba
traci ContextSubscriptionFilters fieldOfVision range_50_angle_270 errors different ts-sim-build-baerrors different ts-sim-build-baerrors different ts-sim-build-baerrors different ts-sim-build-baerrors different ts-sim-build-baerrors different ts-sim-build-ba
traci ContextSubscriptionFilters fieldOfVision range_50_angle_360 errors different ts-sim-build-baerrors different ts-sim-build-baerrors different ts-sim-build-baerrors different ts-sim-build-baerrors different ts-sim-build-baerrors different ts-sim-build-ba
traci ContextSubscriptionFilters fieldOfVision range_50_angle_90 errors different ts-sim-build-baerrors different ts-sim-build-baerrors different ts-sim-build-baerrors different ts-sim-build-baerrors different ts-sim-build-baerrors different ts-sim-build-ba
traci ContextSubscriptionFilters lanesUpDownDistance lanesLeftOpposite errors different ts-sim-build-baerrors different ts-sim-build-baerrors different ts-sim-build-baerrors different ts-sim-build-baerrors different ts-sim-build-baerrors different ts-sim-build-ba
traci ContextSubscriptionFilters lanesUpDownDistance lanesLeftOppositeDownDistZero errors different ts-sim-build-baerrors different ts-sim-build-baerrors different ts-sim-build-baerrors different ts-sim-build-baerrors different ts-sim-build-baerrors different ts-sim-build-ba
traci ContextSubscriptionFilters lanesUpDownDistance lanesLeftOppositeUpDistZero errors different ts-sim-build-baerrors different ts-sim-build-baerrors different ts-sim-build-baerrors different ts-sim-build-baerrors different ts-sim-build-baerrors different ts-sim-build-ba
traci ContextSubscriptionFilters lanesUpDownDistance lanesOppositeAll errors different ts-sim-build-baerrors different ts-sim-build-baerrors different ts-sim-build-baerrors different ts-sim-build-baerrors different ts-sim-build-baerrors different ts-sim-build-ba
traci ContextSubscriptionFilters lanesUpDownDistance lanesOppositeAllDownDistZero errors different ts-sim-build-baerrors different ts-sim-build-baerrors different ts-sim-build-baerrors different ts-sim-build-baerrors different ts-sim-build-baerrors different ts-sim-build-ba
traci ContextSubscriptionFilters lanesUpDownDistance lanesOppositeAllUpDistZero errors different ts-sim-build-baerrors different ts-sim-build-baerrors different ts-sim-build-baerrors different ts-sim-build-baerrors different ts-sim-build-baerrors different ts-sim-build-ba
traci ContextSubscriptionFilters lanesUpDownDistance lanesOutOfBounds errors different ts-sim-build-baerrors different ts-sim-build-baerrors different ts-sim-build-baerrors different ts-sim-build-baerrors different ts-sim-build-baerrors different ts-sim-build-ba
traci ContextSubscriptionFilters lanesUpDownDistance lanesOutOfBoundsDownDistZero errors different ts-sim-build-baerrors different ts-sim-build-baerrors different ts-sim-build-baerrors different ts-sim-build-baerrors different ts-sim-build-baerrors different ts-sim-build-ba
traci ContextSubscriptionFilters lanesUpDownDistance lanesOutOfBoundsUpDistZero errors different ts-sim-build-baerrors different ts-sim-build-baerrors different ts-sim-build-baerrors different ts-sim-build-baerrors different ts-sim-build-baerrors different ts-sim-build-ba
traci ContextSubscriptionFilters lanesUpDownDistance lanesRight errors different ts-sim-build-baerrors different ts-sim-build-baerrors different ts-sim-build-baerrors different ts-sim-build-baerrors different ts-sim-build-baerrors different ts-sim-build-ba
traci ContextSubscriptionFilters lanesUpDownDistance lanesRightDownDistZero errors different ts-sim-build-baerrors different ts-sim-build-baerrors different ts-sim-build-baerrors different ts-sim-build-baerrors different ts-sim-build-baerrors different ts-sim-build-ba
traci ContextSubscriptionFilters lanesUpDownDistance lanesRightUpDistZero errors different ts-sim-build-baerrors different ts-sim-build-baerrors different ts-sim-build-baerrors different ts-sim-build-baerrors different ts-sim-build-baerrors different ts-sim-build-ba
traci ContextSubscriptionFilters lateralDistance incompatible_filter errors different ts-sim-build-baerrors different ts-sim-build-baerrors different ts-sim-build-baerrors different ts-sim-build-baerrors different ts-sim-build-baerrors different ts-sim-build-ba
traci ContextSubscriptionFilters lateralDistance internal_edges errors different ts-sim-build-baerrors different ts-sim-build-baerrors different ts-sim-build-baerrors different ts-sim-build-baerrors different ts-sim-build-baerrors different ts-sim-build-ba
traci ContextSubscriptionFilters lateralDistance persons range_50_lateralDist_50 errors different ts-sim-build-baerrors different ts-sim-build-baerrors different ts-sim-build-baerrors different ts-sim-build-baerrors different ts-sim-build-baerrors different ts-sim-build-ba
traci ContextSubscriptionFilters lateralDistance range_50_lateralDist_50 errors different ts-sim-build-baerrors different ts-sim-build-baerrors different ts-sim-build-baerrors different ts-sim-build-baerrors different ts-sim-build-baerrors different ts-sim-build-ba
traci ContextSubscriptionFilters leadFollow carFollowing errors different(+) ts-sim-build-baerrors different(+) ts-sim-build-baerrors different(+) ts-sim-build-baerrors different(+) ts-sim-build-baerrors different(+) ts-sim-build-baerrors different(+) ts-sim-build-ba
traci ContextSubscriptionFilters leadFollow laneChangeLeft errors different(+) ts-sim-build-baerrors different(+) ts-sim-build-baerrors different(+) ts-sim-build-baerrors different(+) ts-sim-build-baerrors different(+) ts-sim-build-baerrors different(+) ts-sim-build-ba
traci ContextSubscriptionFilters leadFollow laneChangeNeighbors errors different(+) ts-sim-build-baerrors different(+) ts-sim-build-baerrors different(+) ts-sim-build-baerrors different(+) ts-sim-build-baerrors different(+) ts-sim-build-baerrors different(+) ts-sim-build-ba
traci ContextSubscriptionFilters leadFollow laneChangeRight errors different(+) ts-sim-build-baerrors different(+) ts-sim-build-baerrors different(+) ts-sim-build-baerrors different(+) ts-sim-build-baerrors different(+) ts-sim-build-baerrors different(+) ts-sim-build-ba
traci ContextSubscriptionFilters leadFollowOpposite laneChangeOpposite errors different ts-sim-build-baerrors different ts-sim-build-baerrors different ts-sim-build-baerrors different ts-sim-build-baerrors different ts-sim-build-baerrors different ts-sim-build-ba
traci ContextSubscriptionFilters noOpposite lanesInclOpposite errors different ts-sim-build-baerrors different ts-sim-build-baerrors different ts-sim-build-baerrors different ts-sim-build-baerrors different ts-sim-build-baerrors different ts-sim-build-ba
traci ContextSubscriptionFilters roadnetSearch_noOpposite dist_10 errors different ts-sim-build-baerrors different ts-sim-build-baerrors different ts-sim-build-baerrors different ts-sim-build-baerrors different ts-sim-build-baerrors different ts-sim-build-ba
traci ContextSubscriptionFilters roadnetSearch_noOpposite dist_10_disregard_opposite errors different ts-sim-build-baerrors different ts-sim-build-baerrors different ts-sim-build-baerrors different ts-sim-build-baerrors different ts-sim-build-baerrors different ts-sim-build-ba
traci ContextSubscriptionFilters roadnetSearch_noOpposite dist_d10u100 errors different ts-sim-build-baerrors different ts-sim-build-baerrors different ts-sim-build-baerrors different ts-sim-build-baerrors different ts-sim-build-baerrors different ts-sim-build-ba
traci ContextSubscriptionFilters roadnetSearch_noOpposite dist_d10u80 errors different ts-sim-build-baerrors different ts-sim-build-baerrors different ts-sim-build-baerrors different ts-sim-build-baerrors different ts-sim-build-baerrors different ts-sim-build-ba
traci ContextSubscriptionFilters roadnetSearch_noOpposite dist_d155u65 errors different ts-sim-build-baerrors different ts-sim-build-baerrors different ts-sim-build-baerrors different ts-sim-build-baerrors different ts-sim-build-baerrors different ts-sim-build-ba
traci ContextSubscriptionFilters roadnetSearch_noOpposite dist_d200u10 errors different ts-sim-build-baerrors different ts-sim-build-baerrors different ts-sim-build-baerrors different ts-sim-build-baerrors different ts-sim-build-baerrors different ts-sim-build-ba
traci ContextSubscriptionFilters roadnetSearch_noOpposite dist_d20u30 errors different ts-sim-build-baerrors different ts-sim-build-baerrors different ts-sim-build-baerrors different ts-sim-build-baerrors different ts-sim-build-baerrors different ts-sim-build-ba
traci ContextSubscriptionFilters roadnetSearch_noOpposite dist_d30u20 errors different ts-sim-build-baerrors different ts-sim-build-baerrors different ts-sim-build-baerrors different ts-sim-build-baerrors different ts-sim-build-baerrors different ts-sim-build-ba
traci ContextSubscriptionFilters roadnetSearch_withOpposite dist_10_with_opposite errors different ts-sim-build-baerrors different ts-sim-build-baerrors different ts-sim-build-baerrors different ts-sim-build-baerrors different ts-sim-build-baerrors different ts-sim-build-ba
traci ContextSubscriptionFilters roadnetSearch_withOpposite dist_d0_u150_only_opposite errors different ts-sim-build-baerrors different ts-sim-build-baerrors different ts-sim-build-baerrors different ts-sim-build-baerrors different ts-sim-build-baerrors different ts-sim-build-ba
traci ContextSubscriptionFilters roadnetSearch_withOpposite dist_d0_u150_with_opposite errors different ts-sim-build-baerrors different ts-sim-build-baerrors different ts-sim-build-baerrors different ts-sim-build-baerrors different ts-sim-build-baerrors different ts-sim-build-ba
traci ContextSubscriptionFilters roadnetSearch_withOpposite dist_d100_u0_with_opposite errors different ts-sim-build-baerrors different ts-sim-build-baerrors different ts-sim-build-baerrors different ts-sim-build-baerrors different ts-sim-build-baerrors different ts-sim-build-ba
traci ContextSubscriptionFilters roadnetSearch_withOpposite dist_d250_u0_only_opposite errors different ts-sim-build-baerrors different ts-sim-build-baerrors different ts-sim-build-baerrors different ts-sim-build-baerrors different ts-sim-build-baerrors different ts-sim-build-ba
traci ContextSubscriptionFilters roadnetSearch_withOpposite dist_d250_u0_with_opposite errors different ts-sim-build-baerrors different ts-sim-build-baerrors different ts-sim-build-baerrors different ts-sim-build-baerrors different ts-sim-build-baerrors different ts-sim-build-ba
traci ContextSubscriptionFilters roadnetSearch_withOpposite dist_d250_u250_all errors different ts-sim-build-baerrors different ts-sim-build-baerrors different ts-sim-build-baerrors different ts-sim-build-baerrors different ts-sim-build-baerrors different ts-sim-build-ba
traci ContextSubscriptionFilters turn turn_d250_u250 errors different ts-sim-build-baerrors different ts-sim-build-baerrors different ts-sim-build-baerrors different ts-sim-build-baerrors different ts-sim-build-baerrors different ts-sim-build-ba
traci ContextSubscriptionFilters turn turn_d50_u50 errors different ts-sim-build-baerrors different ts-sim-build-baerrors different ts-sim-build-baerrors different ts-sim-build-baerrors different ts-sim-build-baerrors different ts-sim-build-ba
traci ContextSubscriptionFilters vType_and_vClass none errors different ts-sim-build-baerrors different ts-sim-build-baerrors different ts-sim-build-baerrors different ts-sim-build-baerrors different ts-sim-build-baerrors different ts-sim-build-ba
traci ContextSubscriptionFilters vType_and_vClass vClass_negative errors different ts-sim-build-baerrors different ts-sim-build-baerrors different ts-sim-build-baerrors different ts-sim-build-baerrors different ts-sim-build-baerrors different ts-sim-build-ba
traci ContextSubscriptionFilters vType_and_vClass vClass_positive errors different ts-sim-build-baerrors different ts-sim-build-baerrors different ts-sim-build-baerrors different ts-sim-build-baerrors different ts-sim-build-baerrors different ts-sim-build-ba
traci ContextSubscriptionFilters vType_and_vClass vType_negative errors different ts-sim-build-baerrors different ts-sim-build-baerrors different ts-sim-build-baerrors different ts-sim-build-baerrors different ts-sim-build-baerrors different ts-sim-build-ba
traci ContextSubscriptionFilters vType_and_vClass vType_positive errors different ts-sim-build-baerrors different ts-sim-build-baerrors different ts-sim-build-baerrors different ts-sim-build-baerrors different ts-sim-build-baerrors different ts-sim-build-ba
traci bugs ticket1010 errors different ts-sim-build-baerrors different ts-sim-build-baerrors different ts-sim-build-baerrors different ts-sim-build-baerrors different ts-sim-build-baerrors different ts-sim-build-ba
traci bugs ticket1433 errors different ts-sim-build-baerrors different ts-sim-build-baerrors different ts-sim-build-baerrors different ts-sim-build-baerrors different ts-sim-build-baerrors different ts-sim-build-ba
traci bugs ticket2321 errors different ts-sim-build-baerrors different ts-sim-build-baerrors different ts-sim-build-baerrors different ts-sim-build-baerrors different ts-sim-build-baerrors different ts-sim-build-ba
traci bugs ticket2777 errors different ts-sim-build-baerrors different ts-sim-build-baerrors different ts-sim-build-baerrors different ts-sim-build-baerrors different ts-sim-build-baerrors different ts-sim-build-ba
traci bugs ticket2803 errors different ts-sim-build-baerrors different ts-sim-build-baerrors different ts-sim-build-baerrors different ts-sim-build-baerrors different ts-sim-build-baerrors different ts-sim-build-ba
traci bugs ticket2804 errors different ts-sim-build-baerrors different ts-sim-build-baerrors different ts-sim-build-baerrors different ts-sim-build-baerrors different ts-sim-build-baerrors different ts-sim-build-ba
traci bugs ticket3140 errors different ts-sim-build-baerrors different ts-sim-build-baerrors different ts-sim-build-baerrors different ts-sim-build-baerrors different ts-sim-build-baerrors different ts-sim-build-ba
traci bugs ticket3348 errors different ts-sim-build-baerrors different ts-sim-build-baerrors different ts-sim-build-baerrors different ts-sim-build-baerrors different ts-sim-build-baerrors different ts-sim-build-ba
traci bugs ticket3349 errors different ts-sim-build-baerrors different ts-sim-build-baerrors different ts-sim-build-baerrors different ts-sim-build-baerrors different ts-sim-build-baerrors different ts-sim-build-ba
traci bugs ticket3505 errors different ts-sim-build-baerrors different ts-sim-build-baerrors different ts-sim-build-baerrors different ts-sim-build-baerrors different ts-sim-build-baerrors different ts-sim-build-ba
traci bugs ticket3505_test_with_begin_ge_savetime errors different ts-sim-build-baerrors different ts-sim-build-baerrors different ts-sim-build-baerrors different ts-sim-build-baerrors different ts-sim-build-baerrors different ts-sim-build-ba
traci bugs ticket3505_with_load_offset errors different ts-sim-build-baerrors different ts-sim-build-baerrors different ts-sim-build-baerrors different ts-sim-build-baerrors different ts-sim-build-baerrors different ts-sim-build-ba
traci bugs ticket3522 errors different ts-sim-build-baerrors different ts-sim-build-baerrors different ts-sim-build-baerrors different ts-sim-build-baerrors different ts-sim-build-baerrors different ts-sim-build-ba
traci bugs ticket3634 errors different ts-sim-build-baerrors different ts-sim-build-baerrors different ts-sim-build-baerrors different ts-sim-build-baerrors different ts-sim-build-baerrors different ts-sim-build-ba
traci bugs ticket3648 errors different ts-sim-build-baerrors different ts-sim-build-baerrors different ts-sim-build-baerrors different ts-sim-build-baerrors different ts-sim-build-baerrors different ts-sim-build-ba
traci bugs ticket3810 errors different ts-sim-build-baerrors different ts-sim-build-baerrors different ts-sim-build-baerrors different ts-sim-build-baerrors different ts-sim-build-baerrors different ts-sim-build-ba
traci bugs ticket4141 errors different ts-sim-build-baerrors different ts-sim-build-baerrors different ts-sim-build-baerrors different ts-sim-build-baerrors different ts-sim-build-baerrors different ts-sim-build-ba
traci bugs ticket4214 errors different ts-sim-build-baerrors different ts-sim-build-baerrors different ts-sim-build-baerrors different ts-sim-build-baerrors different ts-sim-build-baerrors different ts-sim-build-ba
traci bugs ticket4307 errors different ts-sim-build-baerrors different ts-sim-build-baerrors different ts-sim-build-baerrors different ts-sim-build-baerrors different ts-sim-build-baerrors different ts-sim-build-ba
traci bugs ticket4324 errors different ts-sim-build-baerrors different ts-sim-build-baerrors different ts-sim-build-baerrors different ts-sim-build-baerrors different ts-sim-build-baerrors different ts-sim-build-ba
traci bugs ticket4418 errors different ts-sim-build-baerrors different ts-sim-build-baerrors different ts-sim-build-baerrors different ts-sim-build-baerrors different ts-sim-build-baerrors different ts-sim-build-ba
traci bugs ticket4432 errors different ts-sim-build-baerrors different ts-sim-build-baerrors different ts-sim-build-baerrors different ts-sim-build-baerrors different ts-sim-build-baerrors different ts-sim-build-ba
traci bugs ticket4514 errors different ts-sim-build-baerrors different ts-sim-build-baerrors different ts-sim-build-baerrors different ts-sim-build-baerrors different ts-sim-build-baerrors different ts-sim-build-ba
traci bugs ticket4563 errors different ts-sim-build-baerrors different ts-sim-build-baerrors different ts-sim-build-baerrors different ts-sim-build-baerrors different ts-sim-build-baerrors different ts-sim-build-ba
traci bugs ticket4642 errors different ts-sim-build-baerrors different ts-sim-build-baerrors different ts-sim-build-baerrors different ts-sim-build-baerrors different ts-sim-build-baerrors different ts-sim-build-ba
traci bugs ticket4920 errors different ts-sim-build-baerrors different ts-sim-build-baerrors different ts-sim-build-baerrors different ts-sim-build-baerrors different ts-sim-build-baerrors different ts-sim-build-ba
traci bugs ticket5029 errors different ts-sim-build-baerrors different ts-sim-build-baerrors different ts-sim-build-baerrors different ts-sim-build-baerrors different ts-sim-build-baerrors different ts-sim-build-ba
traci bugs ticket5114 errors different ts-sim-build-baerrors different ts-sim-build-baerrors different ts-sim-build-baerrors different ts-sim-build-baerrors different ts-sim-build-baerrors different ts-sim-build-ba
traci bugs ticket5309 errors different ts-sim-build-baerrors different ts-sim-build-baerrors different ts-sim-build-baerrors different ts-sim-build-baerrors different ts-sim-build-baerrors different ts-sim-build-ba
traci bugs ticket5390 errors different ts-sim-build-baerrors different ts-sim-build-baerrors different ts-sim-build-baerrors different ts-sim-build-baerrors different ts-sim-build-baerrors different ts-sim-build-ba
traci bugs ticket5561 errors different ts-sim-build-baerrors different ts-sim-build-baerrors different ts-sim-build-baerrors different ts-sim-build-baerrors different ts-sim-build-baerrors different ts-sim-build-ba
traci bugs ticket5620 errors different ts-sim-build-baerrors different ts-sim-build-baerrors different ts-sim-build-baerrors different ts-sim-build-baerrors different ts-sim-build-baerrors different ts-sim-build-ba
traci bugs ticket5674 errors different ts-sim-build-baerrors different ts-sim-build-baerrors different ts-sim-build-baerrors different ts-sim-build-baerrors different ts-sim-build-baerrors different ts-sim-build-ba
traci bugs ticket5712 errors different ts-sim-build-baerrors different ts-sim-build-baerrors different ts-sim-build-baerrors different ts-sim-build-baerrors different ts-sim-build-baerrors different ts-sim-build-ba
traci bugs ticket5831 errors different ts-sim-build-baerrors different ts-sim-build-baerrors different ts-sim-build-baerrors different ts-sim-build-baerrors different ts-sim-build-baerrors different ts-sim-build-ba
traci bugs ticket5932 errors different ts-sim-build-baerrors different ts-sim-build-baerrors different ts-sim-build-baerrors different ts-sim-build-baerrors different ts-sim-build-baerrors different ts-sim-build-ba
traci bugs ticket5990 errors different ts-sim-build-baerrors different ts-sim-build-baerrors different ts-sim-build-baerrors different ts-sim-build-baerrors different ts-sim-build-baerrors different ts-sim-build-ba
traci bugs ticket6626 errors different ts-sim-build-baerrors different ts-sim-build-baerrors different ts-sim-build-baerrors different ts-sim-build-baerrors different ts-sim-build-baerrors different ts-sim-build-ba
traci bugs ticket7057 errors different ts-sim-build-baerrors different ts-sim-build-baerrors different ts-sim-build-baerrors different ts-sim-build-baerrors different ts-sim-build-baerrors different ts-sim-build-ba
traci bugs ticket7949 errors different ts-sim-build-baerrors different ts-sim-build-baerrors different ts-sim-build-baerrors different ts-sim-build-baerrors different ts-sim-build-baerrors different ts-sim-build-ba
traci busstop busstop errors different ts-sim-build-baerrors different ts-sim-build-baerrors different ts-sim-build-baerrors different ts-sim-build-baerrors different ts-sim-build-baerrors different ts-sim-build-ba
traci calibrator calibrator errors different ts-sim-build-baerrors different ts-sim-build-baerrors different ts-sim-build-baerrors different ts-sim-build-baerrors different ts-sim-build-baerrors different ts-sim-build-ba
traci chargingstation chargingstation errors different ts-sim-build-baerrors different ts-sim-build-baerrors different ts-sim-build-baerrors different ts-sim-build-baerrors different ts-sim-build-baerrors different ts-sim-build-ba
traci contextSubscriptions edge_100m errors different ts-sim-build-baerrors different ts-sim-build-baerrors different ts-sim-build-baerrors different ts-sim-build-baerrors different ts-sim-build-baerrors different ts-sim-build-ba
traci contextSubscriptions edge_200m errors different ts-sim-build-baerrors different ts-sim-build-baerrors different ts-sim-build-baerrors different ts-sim-build-baerrors different ts-sim-build-baerrors different ts-sim-build-ba
traci contextSubscriptions junction_100m errors different ts-sim-build-baerrors different ts-sim-build-baerrors different ts-sim-build-baerrors different ts-sim-build-baerrors different ts-sim-build-baerrors different ts-sim-build-ba
traci contextSubscriptions junction_200m errors different ts-sim-build-baerrors different ts-sim-build-baerrors different ts-sim-build-baerrors different ts-sim-build-baerrors different ts-sim-build-baerrors different ts-sim-build-ba
traci contextSubscriptions lane_100m errors different ts-sim-build-baerrors different ts-sim-build-baerrors different ts-sim-build-baerrors different ts-sim-build-baerrors different ts-sim-build-baerrors different ts-sim-build-ba
traci contextSubscriptions lane_200m errors different ts-sim-build-baerrors different ts-sim-build-baerrors different ts-sim-build-baerrors different ts-sim-build-baerrors different ts-sim-build-baerrors different ts-sim-build-ba
traci contextSubscriptions parking errors different ts-sim-build-baerrors different ts-sim-build-baerrors different ts-sim-build-baerrors different ts-sim-build-baerrors different ts-sim-build-baerrors different ts-sim-build-ba
traci contextSubscriptions person_100m errors different ts-sim-build-baerrors different ts-sim-build-baerrors different ts-sim-build-baerrors different ts-sim-build-baerrors different ts-sim-build-baerrors different ts-sim-build-ba
traci contextSubscriptions person_200m errors different ts-sim-build-baerrors different ts-sim-build-baerrors different ts-sim-build-baerrors different ts-sim-build-baerrors different ts-sim-build-baerrors different ts-sim-build-ba
traci contextSubscriptions poi_100m errors different ts-sim-build-baerrors different ts-sim-build-baerrors different ts-sim-build-baerrors different ts-sim-build-baerrors different ts-sim-build-baerrors different ts-sim-build-ba
traci contextSubscriptions poi_200m errors different ts-sim-build-baerrors different ts-sim-build-baerrors different ts-sim-build-baerrors different ts-sim-build-baerrors different ts-sim-build-baerrors different ts-sim-build-ba
traci contextSubscriptions polygon_100m errors different ts-sim-build-baerrors different ts-sim-build-baerrors different ts-sim-build-baerrors different ts-sim-build-baerrors different ts-sim-build-baerrors different ts-sim-build-ba
traci contextSubscriptions polygon_200m errors different ts-sim-build-baerrors different ts-sim-build-baerrors different ts-sim-build-baerrors different ts-sim-build-baerrors different ts-sim-build-baerrors different ts-sim-build-ba
traci contextSubscriptions range_100m errors different ts-sim-build-baerrors different ts-sim-build-baerrors different ts-sim-build-baerrors different ts-sim-build-baerrors different ts-sim-build-baerrors different ts-sim-build-ba
traci contextSubscriptions range_200m errors different ts-sim-build-baerrors different ts-sim-build-baerrors different ts-sim-build-baerrors different ts-sim-build-baerrors different ts-sim-build-baerrors different ts-sim-build-ba
traci edge edge errors different ts-sim-build-baerrors different ts-sim-build-baerrors different ts-sim-build-baerrors different ts-sim-build-baerrors different ts-sim-build-baerrors different ts-sim-build-ba
traci inductionloop inductionloop errors different ts-sim-build-baerrors different ts-sim-build-baerrors different ts-sim-build-baerrors different ts-sim-build-baerrors different ts-sim-build-baerrors different ts-sim-build-ba
traci junction junction errors different ts-sim-build-baerrors different ts-sim-build-baerrors different ts-sim-build-baerrors different ts-sim-build-baerrors different ts-sim-build-baerrors different ts-sim-build-ba
traci lane lane errors different ts-sim-build-baerrors different ts-sim-build-baerrors different ts-sim-build-baerrors different ts-sim-build-baerrors different ts-sim-build-baerrors different ts-sim-build-ba
traci lane lane_intermodal errors different ts-sim-build-baerrors different ts-sim-build-baerrors different ts-sim-build-baerrors different ts-sim-build-baerrors different ts-sim-build-baerrors different ts-sim-build-ba
traci lanearea lanearea errors different ts-sim-build-baerrors different ts-sim-build-baerrors different ts-sim-build-baerrors different ts-sim-build-baerrors different ts-sim-build-baerrors different ts-sim-build-ba
traci lanearea subsecond errors different ts-sim-build-baerrors different ts-sim-build-baerrors different ts-sim-build-baerrors different ts-sim-build-baerrors different ts-sim-build-baerrors different ts-sim-build-ba
traci meandata meandata errors different ts-sim-build-baerrors different ts-sim-build-baerrors different ts-sim-build-baerrors different ts-sim-build-baerrors different ts-sim-build-baerrors different ts-sim-build-ba
traci misc lateralCollision laneChanging leftLane errors different ts-sim-build-baerrors different ts-sim-build-baerrors different ts-sim-build-baerrors different ts-sim-build-baerrors different ts-sim-build-baerrors different ts-sim-build-ba
traci misc lateralCollision laneChanging rightLane errors different ts-sim-build-baerrors different ts-sim-build-baerrors different ts-sim-build-baerrors different ts-sim-build-baerrors different ts-sim-build-baerrors different ts-sim-build-ba
traci misc lateralCollision sublaneChanging leftLane0.2 errors different ts-sim-build-baerrors different ts-sim-build-baerrors different ts-sim-build-baerrors different ts-sim-build-baerrors different ts-sim-build-baerrors different ts-sim-build-ba
traci misc lateralCollision sublaneChanging leftLane0.5 errors different ts-sim-build-baerrors different ts-sim-build-baerrors different ts-sim-build-baerrors different ts-sim-build-baerrors different ts-sim-build-baerrors different ts-sim-build-ba
traci misc lateralCollision sublaneChanging rightLane0.2 errors different ts-sim-build-baerrors different ts-sim-build-baerrors different ts-sim-build-baerrors different ts-sim-build-baerrors different ts-sim-build-baerrors different ts-sim-build-ba
traci misc lateralCollision sublaneChanging rightLane0.5 errors different ts-sim-build-baerrors different ts-sim-build-baerrors different ts-sim-build-baerrors different ts-sim-build-baerrors different ts-sim-build-baerrors different ts-sim-build-ba
traci misc params errors different ts-sim-build-baerrors different ts-sim-build-baerrors different ts-sim-build-baerrors different ts-sim-build-baerrors different ts-sim-build-baerrors different ts-sim-build-ba
traci misc paramsWithKey errors different ts-sim-build-baerrors different ts-sim-build-baerrors different ts-sim-build-baerrors different ts-sim-build-baerrors different ts-sim-build-baerrors different ts-sim-build-ba
traci misc paramsWithKey_subscription errors different ts-sim-build-baerrors different ts-sim-build-baerrors different ts-sim-build-baerrors different ts-sim-build-baerrors different ts-sim-build-baerrors different ts-sim-build-ba
traci misc rerouting add_with_taz errors different ts-sim-build-baerrors different ts-sim-build-baerrors different ts-sim-build-baerrors different ts-sim-build-baerrors different ts-sim-build-baerrors different ts-sim-build-ba
traci misc rerouting findIntermodalRoute car_public_speedFactor errors different ts-sim-build-baerrors different ts-sim-build-baerrors different ts-sim-build-baerrors different ts-sim-build-baerrors different ts-sim-build-baerrors different ts-sim-build-ba
traci misc rerouting findIntermodalRoute car_public_speedFactor_routingMode errors different ts-sim-build-baerrors different ts-sim-build-baerrors different ts-sim-build-baerrors different ts-sim-build-baerrors different ts-sim-build-baerrors different ts-sim-build-ba
traci misc rerouting findIntermodalRoute taxi errors different ts-sim-build-baerrors different ts-sim-build-baerrors different ts-sim-build-baerrors different ts-sim-build-baerrors different ts-sim-build-baerrors different ts-sim-build-ba
traci misc rerouting person stop_walk_stop_walk errors different ts-sim-build-baerrors different ts-sim-build-baerrors different ts-sim-build-baerrors different ts-sim-build-baerrors different ts-sim-build-baerrors different ts-sim-build-ba
traci misc rerouting person walk errors different ts-sim-build-baerrors different ts-sim-build-baerrors different ts-sim-build-baerrors different ts-sim-build-baerrors different ts-sim-build-baerrors different ts-sim-build-ba
traci misc rerouting person walk_stop_walk errors different ts-sim-build-baerrors different ts-sim-build-baerrors different ts-sim-build-baerrors different ts-sim-build-baerrors different ts-sim-build-baerrors different ts-sim-build-ba
traci misc rerouting person walk_walk_stop_walk errors different ts-sim-build-baerrors different ts-sim-build-baerrors different ts-sim-build-baerrors different ts-sim-build-baerrors different ts-sim-build-baerrors different ts-sim-build-ba
traci misc rerouting rerouteParkingArea_end errors different ts-sim-build-baerrors different ts-sim-build-baerrors different ts-sim-build-baerrors different ts-sim-build-baerrors different ts-sim-build-baerrors different ts-sim-build-ba
traci misc rerouting rerouteParkingArea_intermediate errors different ts-sim-build-baerrors different ts-sim-build-baerrors different ts-sim-build-baerrors different ts-sim-build-baerrors different ts-sim-build-baerrors different ts-sim-build-ba
traci misc rerouting rerouteTraveltime_adaptEdgeWeight errors different ts-sim-build-baerrors different ts-sim-build-baerrors different ts-sim-build-baerrors different ts-sim-build-baerrors different ts-sim-build-baerrors different ts-sim-build-ba
traci misc rerouting rerouteTraveltime_adaptEdgeWeight_varyWithTime errors different ts-sim-build-baerrors different ts-sim-build-baerrors different ts-sim-build-baerrors different ts-sim-build-baerrors different ts-sim-build-baerrors different ts-sim-build-ba
traci misc rerouting rerouteTraveltime_adaptVehicleEdgeWeight errors different ts-sim-build-baerrors different ts-sim-build-baerrors different ts-sim-build-baerrors different ts-sim-build-baerrors different ts-sim-build-baerrors different ts-sim-build-ba
traci misc rerouting rerouteTraveltime_default errors different ts-sim-build-baerrors different ts-sim-build-baerrors different ts-sim-build-baerrors different ts-sim-build-baerrors different ts-sim-build-baerrors different ts-sim-build-ba
traci misc rerouting routingMode rerouteTraveltime_aggregated errors different ts-sim-build-baerrors different ts-sim-build-baerrors different ts-sim-build-baerrors different ts-sim-build-baerrors different ts-sim-build-baerrors different ts-sim-build-ba
traci misc rerouting routingMode rerouteTraveltime_default errors different ts-sim-build-baerrors different ts-sim-build-baerrors different ts-sim-build-baerrors different ts-sim-build-baerrors different ts-sim-build-baerrors different ts-sim-build-ba
traci misc ssm basic errors different ts-sim-build-baerrors different ts-sim-build-baerrors different ts-sim-build-baerrors different ts-sim-build-baerrors different ts-sim-build-baerrors different ts-sim-build-ba
traci misc ssm junction errors different ts-sim-build-baerrors different ts-sim-build-baerrors different ts-sim-build-baerrors different ts-sim-build-baerrors different ts-sim-build-baerrors different ts-sim-build-ba
traci misc steplistener errors different ts-sim-build-baerrors different ts-sim-build-baerrors different ts-sim-build-baerrors different ts-sim-build-baerrors different ts-sim-build-baerrors different ts-sim-build-ba
traci misc tracing errors different ts-sim-build-baerrors different ts-sim-build-baerrors different ts-sim-build-baerrors different ts-sim-build-baerrors different ts-sim-build-baerrors different ts-sim-build-ba
traci misc tracing_noGetters errors different ts-sim-build-baerrors different ts-sim-build-baerrors different ts-sim-build-baerrors different ts-sim-build-baerrors different ts-sim-build-baerrors different ts-sim-build-ba
traci multientryexit multientryexit errors different ts-sim-build-baerrors different ts-sim-build-baerrors different ts-sim-build-baerrors different ts-sim-build-baerrors different ts-sim-build-baerrors different ts-sim-build-ba
traci overheadwire overheadwire errors different ts-sim-build-baerrors different ts-sim-build-baerrors different ts-sim-build-baerrors different ts-sim-build-baerrors different ts-sim-build-baerrors different ts-sim-build-ba
traci parkingarea parkingarea errors different ts-sim-build-baerrors different ts-sim-build-baerrors different ts-sim-build-baerrors different ts-sim-build-baerrors different ts-sim-build-baerrors different ts-sim-build-ba
traci person arrivalPos errors different ts-sim-build-baerrors different ts-sim-build-baerrors different ts-sim-build-baerrors different ts-sim-build-baerrors different ts-sim-build-baerrors different ts-sim-build-ba
traci person moveToXY after_creation errors different ts-sim-build-baerrors different ts-sim-build-baerrors different ts-sim-build-baerrors different ts-sim-build-baerrors different ts-sim-build-baerrors different ts-sim-build-ba
traci person moveToXY after_creation_add_walk errors different ts-sim-build-baerrors different ts-sim-build-baerrors different ts-sim-build-baerrors different ts-sim-build-baerrors different ts-sim-build-baerrors different ts-sim-build-ba
traci person moveToXY keepRoute1_junction errors different ts-sim-build-baerrors different ts-sim-build-baerrors different ts-sim-build-baerrors different ts-sim-build-baerrors different ts-sim-build-baerrors different ts-sim-build-ba
traci person moveToXY keepRoute2_junction errors different ts-sim-build-baerrors different ts-sim-build-baerrors different ts-sim-build-baerrors different ts-sim-build-baerrors different ts-sim-build-baerrors different ts-sim-build-ba
traci person moveToXY keepRoute2_junction_offroad errors different ts-sim-build-baerrors different ts-sim-build-baerrors different ts-sim-build-baerrors different ts-sim-build-baerrors different ts-sim-build-baerrors different ts-sim-build-ba
traci person moveToXY leaveRoute errors different ts-sim-build-baerrors different ts-sim-build-baerrors different ts-sim-build-baerrors different ts-sim-build-baerrors different ts-sim-build-baerrors different ts-sim-build-ba
traci person moveToXY leaveRoute_jaywalk errors different ts-sim-build-baerrors different ts-sim-build-baerrors different ts-sim-build-baerrors different ts-sim-build-baerrors different ts-sim-build-baerrors different ts-sim-build-ba
traci person moveToXY leaveRoute_walkingarea errors different ts-sim-build-baerrors different ts-sim-build-baerrors different ts-sim-build-baerrors different ts-sim-build-baerrors different ts-sim-build-baerrors different ts-sim-build-ba
traci person moveToXY outside_network errors different ts-sim-build-baerrors different ts-sim-build-baerrors different ts-sim-build-baerrors different ts-sim-build-baerrors different ts-sim-build-baerrors different ts-sim-build-ba
traci person moveToXY within_route errors different ts-sim-build-baerrors different ts-sim-build-baerrors different ts-sim-build-baerrors different ts-sim-build-baerrors different ts-sim-build-baerrors different ts-sim-build-ba
traci person moveToXY within_route_jaywalk errors different ts-sim-build-baerrors different ts-sim-build-baerrors different ts-sim-build-baerrors different ts-sim-build-baerrors different ts-sim-build-baerrors different ts-sim-build-ba
traci person moveToXY within_route_onRoad errors different ts-sim-build-baerrors different ts-sim-build-baerrors different ts-sim-build-baerrors different ts-sim-build-baerrors different ts-sim-build-baerrors different ts-sim-build-ba
traci person moveToXY within_route_walkingarea errors different ts-sim-build-baerrors different ts-sim-build-baerrors different ts-sim-build-baerrors different ts-sim-build-baerrors different ts-sim-build-baerrors different ts-sim-build-ba
traci person person errors different ts-sim-build-baerrors different ts-sim-build-baerrors different ts-sim-build-baerrors different ts-sim-build-baerrors different ts-sim-build-baerrors different ts-sim-build-ba
traci person priorStage errors different ts-sim-build-baerrors different ts-sim-build-baerrors different ts-sim-build-baerrors different ts-sim-build-baerrors different ts-sim-build-baerrors different ts-sim-build-ba
traci person priorStage2 errors different ts-sim-build-baerrors different ts-sim-build-baerrors different ts-sim-build-baerrors different ts-sim-build-baerrors different ts-sim-build-baerrors different ts-sim-build-ba
traci poi poi errors different ts-sim-build-baerrors different ts-sim-build-baerrors different ts-sim-build-baerrors different ts-sim-build-baerrors different ts-sim-build-baerrors different ts-sim-build-ba
traci polygon add_large errors different ts-sim-build-baerrors different ts-sim-build-baerrors different ts-sim-build-baerrors different ts-sim-build-baerrors different ts-sim-build-baerrors different ts-sim-build-ba
traci polygon polygon errors different ts-sim-build-baerrors different ts-sim-build-baerrors different ts-sim-build-baerrors different ts-sim-build-baerrors different ts-sim-build-baerrors different ts-sim-build-ba
traci polygon polygon_dynamics errors different ts-sim-build-baerrors different ts-sim-build-baerrors different ts-sim-build-baerrors different ts-sim-build-baerrors different ts-sim-build-baerrors different ts-sim-build-ba
traci rerouter rerouter errors different ts-sim-build-baerrors different ts-sim-build-baerrors different ts-sim-build-baerrors different ts-sim-build-baerrors different ts-sim-build-baerrors different ts-sim-build-ba
traci route route errors different ts-sim-build-baerrors different ts-sim-build-baerrors different ts-sim-build-baerrors different ts-sim-build-baerrors different ts-sim-build-baerrors different ts-sim-build-ba
traci routeprobe routeprobe errors different ts-sim-build-baerrors different ts-sim-build-baerrors different ts-sim-build-baerrors different ts-sim-build-baerrors different ts-sim-build-baerrors different ts-sim-build-ba
traci simulation collisions errors different ts-sim-build-baerrors different ts-sim-build-baerrors different ts-sim-build-baerrors different ts-sim-build-baerrors different ts-sim-build-baerrors different ts-sim-build-ba
traci simulation load errors different ts-sim-build-baerrors different ts-sim-build-baerrors different ts-sim-build-baerrors different ts-sim-build-baerrors different ts-sim-build-baerrors different ts-sim-build-ba
traci simulation loadState IDList errors different ts-sim-build-baerrors different ts-sim-build-baerrors different ts-sim-build-baerrors different ts-sim-build-baerrors different ts-sim-build-baerrors different ts-sim-build-ba
traci simulation loadState busStop errors different ts-sim-build-baerrors different ts-sim-build-baerrors different ts-sim-build-baerrors different ts-sim-build-baerrors different ts-sim-build-baerrors different ts-sim-build-ba
traci simulation loadState detectors errors different ts-sim-build-baerrors different ts-sim-build-baerrors different ts-sim-build-baerrors different ts-sim-build-baerrors different ts-sim-build-baerrors different ts-sim-build-ba
traci simulation loadState railSignal errors different ts-sim-build-baerrors different ts-sim-build-baerrors different ts-sim-build-baerrors different ts-sim-build-baerrors different ts-sim-build-baerrors different ts-sim-build-ba
traci simulation loadState repeat errors different ts-sim-build-baerrors different ts-sim-build-baerrors different ts-sim-build-baerrors different ts-sim-build-baerrors different ts-sim-build-baerrors different ts-sim-build-ba
traci simulation loadState rerouting errors different ts-sim-build-baerrors different ts-sim-build-baerrors different ts-sim-build-baerrors different ts-sim-build-baerrors different ts-sim-build-baerrors different ts-sim-build-ba
traci simulation simulation errors different ts-sim-build-baerrors different ts-sim-build-baerrors different ts-sim-build-baerrors different ts-sim-build-baerrors different ts-sim-build-baerrors different ts-sim-build-ba
traci trafficlight actuated errors different ts-sim-build-baerrors different ts-sim-build-baerrors different ts-sim-build-baerrors different ts-sim-build-baerrors different ts-sim-build-baerrors different ts-sim-build-ba
traci trafficlight getBlocking_reroute errors different ts-sim-build-baerrors different ts-sim-build-baerrors different ts-sim-build-baerrors different ts-sim-build-baerrors different ts-sim-build-baerrors different ts-sim-build-ba
traci trafficlight railsignal_state errors different ts-sim-build-baerrors different ts-sim-build-baerrors different ts-sim-build-baerrors different ts-sim-build-baerrors different ts-sim-build-baerrors different ts-sim-build-ba
traci trafficlight trafficlight errors different ts-sim-build-baerrors different ts-sim-build-baerrors different ts-sim-build-baerrors different ts-sim-build-baerrors different ts-sim-build-baerrors different ts-sim-build-ba
traci variablespeedsign variablespeedsign errors different ts-sim-build-baerrors different ts-sim-build-baerrors different ts-sim-build-baerrors different ts-sim-build-baerrors different ts-sim-build-baerrors different ts-sim-build-ba
traci vehicle changeOpposite errors different ts-sim-build-baerrors different ts-sim-build-baerrors different ts-sim-build-baerrors different ts-sim-build-baerrors different ts-sim-build-baerrors different ts-sim-build-ba
traci vehicle changeOpposite_default errors different ts-sim-build-baerrors different ts-sim-build-baerrors different ts-sim-build-baerrors different ts-sim-build-baerrors different ts-sim-build-baerrors different ts-sim-build-ba
traci vehicle changeRelative_invalid errors different ts-sim-build-baerrors different ts-sim-build-baerrors different ts-sim-build-baerrors different ts-sim-build-baerrors different ts-sim-build-baerrors different ts-sim-build-ba
traci vehicle distance_after_reroute errors different ts-sim-build-baerrors different ts-sim-build-baerrors different ts-sim-build-baerrors different ts-sim-build-baerrors different ts-sim-build-baerrors different ts-sim-build-ba
traci vehicle driverstate errors different ts-sim-build-baerrors different ts-sim-build-baerrors different ts-sim-build-baerrors different ts-sim-build-baerrors different ts-sim-build-baerrors different ts-sim-build-ba
traci vehicle getFollowSpeed errors different ts-sim-build-baerrors different ts-sim-build-baerrors different ts-sim-build-baerrors different ts-sim-build-baerrors different ts-sim-build-baerrors different ts-sim-build-ba
traci vehicle getFollower errors different ts-sim-build-baerrors different ts-sim-build-baerrors different ts-sim-build-baerrors different ts-sim-build-baerrors different ts-sim-build-baerrors different ts-sim-build-ba
traci vehicle getNeighbors errors different ts-sim-build-baerrors different ts-sim-build-baerrors different ts-sim-build-baerrors different ts-sim-build-baerrors different ts-sim-build-baerrors different ts-sim-build-ba
traci vehicle getNeighborsSublane #5180 ts-sim-build-ba#5180 ts-sim-build-ba#5180 ts-sim-build-ba#5180 ts-sim-build-ba#5180 ts-sim-build-ba#5180 ts-sim-build-ba
traci vehicle getStops errors different ts-sim-build-baerrors different ts-sim-build-baerrors different ts-sim-build-baerrors different ts-sim-build-baerrors different ts-sim-build-baerrors different ts-sim-build-ba
traci vehicle moveToXY customLength_keepRoute2 errors different ts-sim-build-baerrors different ts-sim-build-baerrors different ts-sim-build-baerrors different ts-sim-build-baerrors different ts-sim-build-baerrors different ts-sim-build-ba
traci vehicle moveToXY elevation_sublane errors different ts-sim-build-baerrors different ts-sim-build-baerrors different ts-sim-build-baerrors different ts-sim-build-baerrors different ts-sim-build-baerrors different ts-sim-build-ba
traci vehicle moveToXY extreme_elevation errors different ts-sim-build-baerrors different ts-sim-build-baerrors different ts-sim-build-baerrors different ts-sim-build-baerrors different ts-sim-build-baerrors different ts-sim-build-ba
traci vehicle moveToXY extreme_elevation_keeproute2 errors different ts-sim-build-baerrors different ts-sim-build-baerrors different ts-sim-build-baerrors different ts-sim-build-baerrors different ts-sim-build-baerrors different ts-sim-build-ba
traci vehicle moveToXY intersection errors different ts-sim-build-baerrors different ts-sim-build-baerrors different ts-sim-build-baerrors different ts-sim-build-baerrors different ts-sim-build-baerrors different ts-sim-build-ba
traci vehicle moveToXY keepRoute2 errors different(+) ts-sim-build-baerrors different(+) ts-sim-build-baerrors different(+) ts-sim-build-baerrors different(+) ts-sim-build-baerrors different(+) ts-sim-build-baerrors different(+) ts-sim-build-ba
traci vehicle moveToXY multi_lane errors different ts-sim-build-baerrors different ts-sim-build-baerrors different ts-sim-build-baerrors different ts-sim-build-baerrors different ts-sim-build-baerrors different ts-sim-build-ba
traci vehicle moveToXY multi_lane_sublane errors different ts-sim-build-baerrors different ts-sim-build-baerrors different ts-sim-build-baerrors different ts-sim-build-baerrors different ts-sim-build-baerrors different ts-sim-build-ba
traci vehicle moveToXY permissions errors different ts-sim-build-baerrors different ts-sim-build-baerrors different ts-sim-build-baerrors different ts-sim-build-baerrors different ts-sim-build-baerrors different ts-sim-build-ba
traci vehicle moveToXY short_edges errors different ts-sim-build-baerrors different ts-sim-build-baerrors different ts-sim-build-baerrors different ts-sim-build-baerrors different ts-sim-build-baerrors different ts-sim-build-ba
traci vehicle moveToXY speedWithoutTraCI errors different ts-sim-build-baerrors different ts-sim-build-baerrors different ts-sim-build-baerrors different ts-sim-build-baerrors different ts-sim-build-baerrors different ts-sim-build-ba
traci vehicle moveToXY waitingTime errors different ts-sim-build-baerrors different ts-sim-build-baerrors different ts-sim-build-baerrors different ts-sim-build-baerrors different ts-sim-build-baerrors different ts-sim-build-ba
traci vehicle moveTo_detector errors different ts-sim-build-baerrors different ts-sim-build-baerrors different ts-sim-build-baerrors different ts-sim-build-baerrors different ts-sim-build-baerrors different ts-sim-build-ba
traci vehicle nextTLS errors different ts-sim-build-baerrors different ts-sim-build-baerrors different ts-sim-build-baerrors different ts-sim-build-baerrors different ts-sim-build-baerrors different ts-sim-build-ba
traci vehicle openGap braking_leader errors different ts-sim-build-baerrors different ts-sim-build-baerrors different ts-sim-build-baerrors different ts-sim-build-baerrors different ts-sim-build-baerrors different ts-sim-build-ba
traci vehicle openGap braking_leader_spaceGap errors different ts-sim-build-baerrors different ts-sim-build-baerrors different ts-sim-build-baerrors different ts-sim-build-baerrors different ts-sim-build-baerrors different ts-sim-build-ba
traci vehicle openGap merger errors different ts-sim-build-baerrors different ts-sim-build-baerrors different ts-sim-build-baerrors different ts-sim-build-baerrors different ts-sim-build-baerrors different ts-sim-build-ba
traci vehicle openGap merger_as_reference_vehicle errors different ts-sim-build-baerrors different ts-sim-build-baerrors different ts-sim-build-baerrors different ts-sim-build-baerrors different ts-sim-build-baerrors different ts-sim-build-ba
traci vehicle openGap merger_overtakeRightCheckDisabled errors different ts-sim-build-baerrors different ts-sim-build-baerrors different ts-sim-build-baerrors different ts-sim-build-baerrors different ts-sim-build-baerrors different ts-sim-build-ba
traci vehicle openGap merger_with_reference_vehicle errors different ts-sim-build-baerrors different ts-sim-build-baerrors different ts-sim-build-baerrors different ts-sim-build-baerrors different ts-sim-build-baerrors different ts-sim-build-ba
traci vehicle openGap reference_vehicle_removed errors different ts-sim-build-baerrors different ts-sim-build-baerrors different ts-sim-build-baerrors different ts-sim-build-baerrors different ts-sim-build-baerrors different ts-sim-build-ba
traci vehicle openGap warning_smaller_headway errors different ts-sim-build-baerrors different ts-sim-build-baerrors different ts-sim-build-baerrors different ts-sim-build-baerrors different ts-sim-build-baerrors different ts-sim-build-ba
traci vehicle openGap with_low_maxDecel_fast errors different ts-sim-build-baerrors different ts-sim-build-baerrors different ts-sim-build-baerrors different ts-sim-build-baerrors different ts-sim-build-baerrors different ts-sim-build-ba
traci vehicle openGap with_low_maxDecel_fast_CACC see #6192 ts-sim-build-basee #6192 ts-sim-build-basee #6192 ts-sim-build-basee #6192 ts-sim-build-basee #6192 ts-sim-build-basee #6192 ts-sim-build-ba
traci vehicle openGap with_low_maxDecel_slow errors different ts-sim-build-baerrors different ts-sim-build-baerrors different ts-sim-build-baerrors different ts-sim-build-baerrors different ts-sim-build-baerrors different ts-sim-build-ba
traci vehicle openGap without_maxDecel_fast errors different ts-sim-build-baerrors different ts-sim-build-baerrors different ts-sim-build-baerrors different ts-sim-build-baerrors different ts-sim-build-baerrors different ts-sim-build-ba
traci vehicle openGap without_maxDecel_slow errors different ts-sim-build-baerrors different ts-sim-build-baerrors different ts-sim-build-baerrors different ts-sim-build-baerrors different ts-sim-build-baerrors different ts-sim-build-ba
traci vehicle openGap without_maxDecel_slow_spacegap errors different ts-sim-build-baerrors different ts-sim-build-baerrors different ts-sim-build-baerrors different ts-sim-build-baerrors different ts-sim-build-baerrors different ts-sim-build-ba
traci vehicle pastStops_stateLoaded errors different ts-sim-build-baerrors different ts-sim-build-baerrors different ts-sim-build-baerrors different ts-sim-build-baerrors different ts-sim-build-baerrors different ts-sim-build-ba
traci vehicle replaceStop all errors different ts-sim-build-baerrors different ts-sim-build-baerrors different ts-sim-build-baerrors different ts-sim-build-baerrors different ts-sim-build-baerrors different ts-sim-build-ba
traci vehicle replaceStop default errors different ts-sim-build-baerrors different ts-sim-build-baerrors different ts-sim-build-baerrors different ts-sim-build-baerrors different ts-sim-build-baerrors different ts-sim-build-ba
traci vehicle replaceStop first errors different ts-sim-build-baerrors different ts-sim-build-baerrors different ts-sim-build-baerrors different ts-sim-build-baerrors different ts-sim-build-baerrors different ts-sim-build-ba
traci vehicle replaceStop first_init errors different ts-sim-build-baerrors different ts-sim-build-baerrors different ts-sim-build-baerrors different ts-sim-build-baerrors different ts-sim-build-baerrors different ts-sim-build-ba
traci vehicle replaceStop first_later errors different ts-sim-build-baerrors different ts-sim-build-baerrors different ts-sim-build-baerrors different ts-sim-build-baerrors different ts-sim-build-baerrors different ts-sim-build-ba
traci vehicle replaceStop invalid errors different ts-sim-build-baerrors different ts-sim-build-baerrors different ts-sim-build-baerrors different ts-sim-build-baerrors different ts-sim-build-baerrors different ts-sim-build-ba
traci vehicle replaceStop last errors different ts-sim-build-baerrors different ts-sim-build-baerrors different ts-sim-build-baerrors different ts-sim-build-baerrors different ts-sim-build-baerrors different ts-sim-build-ba
traci vehicle replaceStop last_destination errors different ts-sim-build-baerrors different ts-sim-build-baerrors different ts-sim-build-baerrors different ts-sim-build-baerrors different ts-sim-build-baerrors different ts-sim-build-ba
traci vehicle replaceStop last_later errors different ts-sim-build-baerrors different ts-sim-build-baerrors different ts-sim-build-baerrors different ts-sim-build-baerrors different ts-sim-build-baerrors different ts-sim-build-ba
traci vehicle replaceStop second errors different ts-sim-build-baerrors different ts-sim-build-baerrors different ts-sim-build-baerrors different ts-sim-build-baerrors different ts-sim-build-baerrors different ts-sim-build-ba
traci vehicle replaceStop unreachable errors different ts-sim-build-baerrors different ts-sim-build-baerrors different ts-sim-build-baerrors different ts-sim-build-baerrors different ts-sim-build-baerrors different ts-sim-build-ba
traci vehicle resume errors different ts-sim-build-baerrors different ts-sim-build-baerrors different ts-sim-build-baerrors different ts-sim-build-baerrors different ts-sim-build-baerrors different ts-sim-build-ba
traci vehicle setReroutingPeriod errors different ts-sim-build-baerrors different ts-sim-build-baerrors different ts-sim-build-baerrors different ts-sim-build-baerrors different ts-sim-build-baerrors different ts-sim-build-ba
traci vehicle slowDown errors different ts-sim-build-baerrors different ts-sim-build-baerrors different ts-sim-build-baerrors different ts-sim-build-baerrors different ts-sim-build-baerrors different ts-sim-build-ba
traci vehicle slowDown_subsecond errors different ts-sim-build-baerrors different ts-sim-build-baerrors different ts-sim-build-baerrors different ts-sim-build-baerrors different ts-sim-build-baerrors different ts-sim-build-ba
traci vehicle stopDelay errors different ts-sim-build-baerrors different ts-sim-build-baerrors different ts-sim-build-baerrors different ts-sim-build-baerrors different ts-sim-build-baerrors different ts-sim-build-ba
traci vehicle stopDelay2 errors different ts-sim-build-baerrors different ts-sim-build-baerrors different ts-sim-build-baerrors different ts-sim-build-baerrors different ts-sim-build-baerrors different ts-sim-build-ba
traci vehicle stopDelay_waypoint errors different ts-sim-build-baerrors different ts-sim-build-baerrors different ts-sim-build-baerrors different ts-sim-build-baerrors different ts-sim-build-baerrors different ts-sim-build-ba
traci vehicle taxi basic errors different ts-sim-build-baerrors different ts-sim-build-baerrors different ts-sim-build-baerrors different ts-sim-build-baerrors different ts-sim-build-baerrors different ts-sim-build-ba
traci vehicle taxi shared_3 errors different ts-sim-build-baerrors different ts-sim-build-baerrors different ts-sim-build-baerrors different ts-sim-build-baerrors different ts-sim-build-baerrors different ts-sim-build-ba
traci vehicle vehicle errors different ts-sim-build-baerrors different ts-sim-build-baerrors different ts-sim-build-baerrors different ts-sim-build-baerrors different ts-sim-build-baerrors different ts-sim-build-ba
traci vehicle vehicle_asl errors different ts-sim-build-baerrors different ts-sim-build-baerrors different ts-sim-build-baerrors different ts-sim-build-baerrors different ts-sim-build-baerrors different ts-sim-build-ba
traci vehicle vehicle_context errors different ts-sim-build-baerrors different ts-sim-build-baerrors different ts-sim-build-baerrors different ts-sim-build-baerrors different ts-sim-build-baerrors different ts-sim-build-ba
traci vehicle vehicle_sublane errors different ts-sim-build-baerrors different ts-sim-build-baerrors different ts-sim-build-baerrors different ts-sim-build-baerrors different ts-sim-build-baerrors different ts-sim-build-ba
traci vehicle vehicle_sublane_asl errors different(+) ts-sim-build-baerrors different ts-sim-build-baerrors different ts-sim-build-baerrors different ts-sim-build-baerrors different ts-sim-build-baerrors different ts-sim-build-ba
traci vehicletype save_and_load_vtype_params errors different ts-sim-build-baerrors different ts-sim-build-baerrors different ts-sim-build-baerrors different ts-sim-build-baerrors different ts-sim-build-baerrors different ts-sim-build-ba
traci vehicletype vehicletype errors different ts-sim-build-baerrors different ts-sim-build-baerrors different ts-sim-build-baerrors different ts-sim-build-baerrors different ts-sim-build-baerrors different ts-sim-build-ba

libtraci.python3

test_default.libtraci.python3.png

Test16Jan202117Jan202118Jan202119Jan202120Jan202121Jan2021
Summary280 tests: 278 FAILED 2 known bugs 280 tests: 278 FAILED 2 known bugs 280 tests: 278 FAILED 2 known bugs 280 tests: 278 FAILED 2 known bugs 280 tests: 278 FAILED 2 known bugs 280 tests: 278 FAILED 2 known bugs
simpla config errors different ts-sim-build-baerrors different ts-sim-build-baerrors different ts-sim-build-baerrors different ts-sim-build-baerrors different ts-sim-build-baerrors different ts-sim-build-ba
simpla openGap errors different ts-sim-build-baerrors different ts-sim-build-baerrors different ts-sim-build-baerrors different ts-sim-build-baerrors different ts-sim-build-baerrors different ts-sim-build-ba
simpla platoon_manager errors different ts-sim-build-baerrors different ts-sim-build-baerrors different ts-sim-build-baerrors different ts-sim-build-baerrors different ts-sim-build-baerrors different ts-sim-build-ba
traci ContextSubscriptionFilters fieldOfVision incompatible_filter errors different ts-sim-build-baerrors different ts-sim-build-baerrors different ts-sim-build-baerrors different ts-sim-build-baerrors different ts-sim-build-baerrors different ts-sim-build-ba
traci ContextSubscriptionFilters fieldOfVision persons range_50_angle_90 errors different ts-sim-build-baerrors different ts-sim-build-baerrors different ts-sim-build-baerrors different ts-sim-build-baerrors different ts-sim-build-baerrors different ts-sim-build-ba
traci ContextSubscriptionFilters fieldOfVision range_0_angle_90 errors different ts-sim-build-baerrors different ts-sim-build-baerrors different ts-sim-build-baerrors different ts-sim-build-baerrors different ts-sim-build-baerrors different ts-sim-build-ba
traci ContextSubscriptionFilters fieldOfVision range_50_angle_0 errors different ts-sim-build-baerrors different ts-sim-build-baerrors different ts-sim-build-baerrors different ts-sim-build-baerrors different ts-sim-build-baerrors different ts-sim-build-ba
traci ContextSubscriptionFilters fieldOfVision range_50_angle_270 errors different ts-sim-build-baerrors different ts-sim-build-baerrors different ts-sim-build-baerrors different ts-sim-build-baerrors different ts-sim-build-baerrors different ts-sim-build-ba
traci ContextSubscriptionFilters fieldOfVision range_50_angle_360 errors different ts-sim-build-baerrors different ts-sim-build-baerrors different ts-sim-build-baerrors different ts-sim-build-baerrors different ts-sim-build-baerrors different ts-sim-build-ba
traci ContextSubscriptionFilters fieldOfVision range_50_angle_90 errors different ts-sim-build-baerrors different ts-sim-build-baerrors different ts-sim-build-baerrors different ts-sim-build-baerrors different ts-sim-build-baerrors different ts-sim-build-ba
traci ContextSubscriptionFilters lanesUpDownDistance lanesLeftOpposite errors different ts-sim-build-baerrors different ts-sim-build-baerrors different ts-sim-build-baerrors different ts-sim-build-baerrors different ts-sim-build-baerrors different ts-sim-build-ba
traci ContextSubscriptionFilters lanesUpDownDistance lanesLeftOppositeDownDistZero errors different ts-sim-build-baerrors different ts-sim-build-baerrors different ts-sim-build-baerrors different ts-sim-build-baerrors different ts-sim-build-baerrors different ts-sim-build-ba
traci ContextSubscriptionFilters lanesUpDownDistance lanesLeftOppositeUpDistZero errors different ts-sim-build-baerrors different ts-sim-build-baerrors different ts-sim-build-baerrors different ts-sim-build-baerrors different ts-sim-build-baerrors different ts-sim-build-ba
traci ContextSubscriptionFilters lanesUpDownDistance lanesOppositeAll errors different ts-sim-build-baerrors different ts-sim-build-baerrors different ts-sim-build-baerrors different ts-sim-build-baerrors different ts-sim-build-baerrors different ts-sim-build-ba
traci ContextSubscriptionFilters lanesUpDownDistance lanesOppositeAllDownDistZero errors different ts-sim-build-baerrors different ts-sim-build-baerrors different ts-sim-build-baerrors different ts-sim-build-baerrors different ts-sim-build-baerrors different ts-sim-build-ba
traci ContextSubscriptionFilters lanesUpDownDistance lanesOppositeAllUpDistZero errors different ts-sim-build-baerrors different ts-sim-build-baerrors different ts-sim-build-baerrors different ts-sim-build-baerrors different ts-sim-build-baerrors different ts-sim-build-ba
traci ContextSubscriptionFilters lanesUpDownDistance lanesOutOfBounds errors different ts-sim-build-baerrors different ts-sim-build-baerrors different ts-sim-build-baerrors different ts-sim-build-baerrors different ts-sim-build-baerrors different ts-sim-build-ba
traci ContextSubscriptionFilters lanesUpDownDistance lanesOutOfBoundsDownDistZero errors different ts-sim-build-baerrors different ts-sim-build-baerrors different ts-sim-build-baerrors different ts-sim-build-baerrors different ts-sim-build-baerrors different ts-sim-build-ba
traci ContextSubscriptionFilters lanesUpDownDistance lanesOutOfBoundsUpDistZero errors different ts-sim-build-baerrors different ts-sim-build-baerrors different ts-sim-build-baerrors different ts-sim-build-baerrors different ts-sim-build-baerrors different ts-sim-build-ba
traci ContextSubscriptionFilters lanesUpDownDistance lanesRight errors different ts-sim-build-baerrors different ts-sim-build-baerrors different ts-sim-build-baerrors different ts-sim-build-baerrors different ts-sim-build-baerrors different ts-sim-build-ba
traci ContextSubscriptionFilters lanesUpDownDistance lanesRightDownDistZero errors different ts-sim-build-baerrors different ts-sim-build-baerrors different ts-sim-build-baerrors different ts-sim-build-baerrors different ts-sim-build-baerrors different ts-sim-build-ba
traci ContextSubscriptionFilters lanesUpDownDistance lanesRightUpDistZero errors different ts-sim-build-baerrors different ts-sim-build-baerrors different ts-sim-build-baerrors different ts-sim-build-baerrors different ts-sim-build-baerrors different ts-sim-build-ba
traci ContextSubscriptionFilters lateralDistance incompatible_filter errors different ts-sim-build-baerrors different ts-sim-build-baerrors different ts-sim-build-baerrors different ts-sim-build-baerrors different ts-sim-build-baerrors different ts-sim-build-ba
traci ContextSubscriptionFilters lateralDistance internal_edges errors different ts-sim-build-baerrors different ts-sim-build-baerrors different ts-sim-build-baerrors different ts-sim-build-baerrors different ts-sim-build-baerrors different ts-sim-build-ba
traci ContextSubscriptionFilters lateralDistance persons range_50_lateralDist_50 errors different ts-sim-build-baerrors different ts-sim-build-baerrors different ts-sim-build-baerrors different ts-sim-build-baerrors different ts-sim-build-baerrors different ts-sim-build-ba
traci ContextSubscriptionFilters lateralDistance range_50_lateralDist_50 errors different ts-sim-build-baerrors different ts-sim-build-baerrors different ts-sim-build-baerrors different ts-sim-build-baerrors different ts-sim-build-baerrors different ts-sim-build-ba
traci ContextSubscriptionFilters leadFollow carFollowing errors different(+) ts-sim-build-baerrors different(+) ts-sim-build-baerrors different(+) ts-sim-build-baerrors different(+) ts-sim-build-baerrors different(+) ts-sim-build-baerrors different(+) ts-sim-build-ba
traci ContextSubscriptionFilters leadFollow laneChangeLeft errors different(+) ts-sim-build-baerrors different(+) ts-sim-build-baerrors different(+) ts-sim-build-baerrors different(+) ts-sim-build-baerrors different(+) ts-sim-build-baerrors different(+) ts-sim-build-ba
traci ContextSubscriptionFilters leadFollow laneChangeNeighbors errors different(+) ts-sim-build-baerrors different(+) ts-sim-build-baerrors different(+) ts-sim-build-baerrors different(+) ts-sim-build-baerrors different(+) ts-sim-build-baerrors different(+) ts-sim-build-ba
traci ContextSubscriptionFilters leadFollow laneChangeRight errors different(+) ts-sim-build-baerrors different(+) ts-sim-build-baerrors different(+) ts-sim-build-baerrors different(+) ts-sim-build-baerrors different(+) ts-sim-build-baerrors different(+) ts-sim-build-ba
traci ContextSubscriptionFilters leadFollowOpposite laneChangeOpposite errors different ts-sim-build-baerrors different ts-sim-build-baerrors different ts-sim-build-baerrors different ts-sim-build-baerrors different ts-sim-build-baerrors different ts-sim-build-ba
traci ContextSubscriptionFilters noOpposite lanesInclOpposite errors different ts-sim-build-baerrors different ts-sim-build-baerrors different ts-sim-build-baerrors different ts-sim-build-baerrors different ts-sim-build-baerrors different ts-sim-build-ba
traci ContextSubscriptionFilters roadnetSearch_noOpposite dist_10 errors different ts-sim-build-baerrors different ts-sim-build-baerrors different ts-sim-build-baerrors different ts-sim-build-baerrors different ts-sim-build-baerrors different ts-sim-build-ba
traci ContextSubscriptionFilters roadnetSearch_noOpposite dist_10_disregard_opposite errors different ts-sim-build-baerrors different ts-sim-build-baerrors different ts-sim-build-baerrors different ts-sim-build-baerrors different ts-sim-build-baerrors different ts-sim-build-ba
traci ContextSubscriptionFilters roadnetSearch_noOpposite dist_d10u100 errors different ts-sim-build-baerrors different ts-sim-build-baerrors different ts-sim-build-baerrors different ts-sim-build-baerrors different ts-sim-build-baerrors different ts-sim-build-ba
traci ContextSubscriptionFilters roadnetSearch_noOpposite dist_d10u80 errors different ts-sim-build-baerrors different ts-sim-build-baerrors different ts-sim-build-baerrors different ts-sim-build-baerrors different ts-sim-build-baerrors different ts-sim-build-ba
traci ContextSubscriptionFilters roadnetSearch_noOpposite dist_d155u65 errors different ts-sim-build-baerrors different ts-sim-build-baerrors different ts-sim-build-baerrors different ts-sim-build-baerrors different ts-sim-build-baerrors different ts-sim-build-ba
traci ContextSubscriptionFilters roadnetSearch_noOpposite dist_d200u10 errors different ts-sim-build-baerrors different ts-sim-build-baerrors different ts-sim-build-baerrors different ts-sim-build-baerrors different ts-sim-build-baerrors different ts-sim-build-ba
traci ContextSubscriptionFilters roadnetSearch_noOpposite dist_d20u30 errors different ts-sim-build-baerrors different ts-sim-build-baerrors different ts-sim-build-baerrors different ts-sim-build-baerrors different ts-sim-build-baerrors different ts-sim-build-ba
traci ContextSubscriptionFilters roadnetSearch_noOpposite dist_d30u20 errors different ts-sim-build-baerrors different ts-sim-build-baerrors different ts-sim-build-baerrors different ts-sim-build-baerrors different ts-sim-build-baerrors different ts-sim-build-ba
traci ContextSubscriptionFilters roadnetSearch_withOpposite dist_10_with_opposite errors different ts-sim-build-baerrors different ts-sim-build-baerrors different ts-sim-build-baerrors different ts-sim-build-baerrors different ts-sim-build-baerrors different ts-sim-build-ba
traci ContextSubscriptionFilters roadnetSearch_withOpposite dist_d0_u150_only_opposite errors different ts-sim-build-baerrors different ts-sim-build-baerrors different ts-sim-build-baerrors different ts-sim-build-baerrors different ts-sim-build-baerrors different ts-sim-build-ba
traci ContextSubscriptionFilters roadnetSearch_withOpposite dist_d0_u150_with_opposite errors different ts-sim-build-baerrors different ts-sim-build-baerrors different ts-sim-build-baerrors different ts-sim-build-baerrors different ts-sim-build-baerrors different ts-sim-build-ba
traci ContextSubscriptionFilters roadnetSearch_withOpposite dist_d100_u0_with_opposite errors different ts-sim-build-baerrors different ts-sim-build-baerrors different ts-sim-build-baerrors different ts-sim-build-baerrors different ts-sim-build-baerrors different ts-sim-build-ba
traci ContextSubscriptionFilters roadnetSearch_withOpposite dist_d250_u0_only_opposite errors different ts-sim-build-baerrors different ts-sim-build-baerrors different ts-sim-build-baerrors different ts-sim-build-baerrors different ts-sim-build-baerrors different ts-sim-build-ba
traci ContextSubscriptionFilters roadnetSearch_withOpposite dist_d250_u0_with_opposite errors different ts-sim-build-baerrors different ts-sim-build-baerrors different ts-sim-build-baerrors different ts-sim-build-baerrors different ts-sim-build-baerrors different ts-sim-build-ba
traci ContextSubscriptionFilters roadnetSearch_withOpposite dist_d250_u250_all errors different ts-sim-build-baerrors different ts-sim-build-baerrors different ts-sim-build-baerrors different ts-sim-build-baerrors different ts-sim-build-baerrors different ts-sim-build-ba
traci ContextSubscriptionFilters turn turn_d250_u250 errors different ts-sim-build-baerrors different ts-sim-build-baerrors different ts-sim-build-baerrors different ts-sim-build-baerrors different ts-sim-build-baerrors different ts-sim-build-ba
traci ContextSubscriptionFilters turn turn_d50_u50 errors different ts-sim-build-baerrors different ts-sim-build-baerrors different ts-sim-build-baerrors different ts-sim-build-baerrors different ts-sim-build-baerrors different ts-sim-build-ba
traci ContextSubscriptionFilters vType_and_vClass none errors different ts-sim-build-baerrors different ts-sim-build-baerrors different ts-sim-build-baerrors different ts-sim-build-baerrors different ts-sim-build-baerrors different ts-sim-build-ba
traci ContextSubscriptionFilters vType_and_vClass vClass_negative errors different ts-sim-build-baerrors different ts-sim-build-baerrors different ts-sim-build-baerrors different ts-sim-build-baerrors different ts-sim-build-baerrors different ts-sim-build-ba
traci ContextSubscriptionFilters vType_and_vClass vClass_positive errors different ts-sim-build-baerrors different ts-sim-build-baerrors different ts-sim-build-baerrors different ts-sim-build-baerrors different ts-sim-build-baerrors different ts-sim-build-ba
traci ContextSubscriptionFilters vType_and_vClass vType_negative errors different ts-sim-build-baerrors different ts-sim-build-baerrors different ts-sim-build-baerrors different ts-sim-build-baerrors different ts-sim-build-baerrors different ts-sim-build-ba
traci ContextSubscriptionFilters vType_and_vClass vType_positive errors different ts-sim-build-baerrors different ts-sim-build-baerrors different ts-sim-build-baerrors different ts-sim-build-baerrors different ts-sim-build-baerrors different ts-sim-build-ba
traci bugs ticket1010 errors different ts-sim-build-baerrors different ts-sim-build-baerrors different ts-sim-build-baerrors different ts-sim-build-baerrors different ts-sim-build-baerrors different ts-sim-build-ba
traci bugs ticket1433 errors different ts-sim-build-baerrors different ts-sim-build-baerrors different ts-sim-build-baerrors different ts-sim-build-baerrors different ts-sim-build-baerrors different ts-sim-build-ba
traci bugs ticket2321 errors different ts-sim-build-baerrors different ts-sim-build-baerrors different ts-sim-build-baerrors different ts-sim-build-baerrors different ts-sim-build-baerrors different ts-sim-build-ba
traci bugs ticket2777 errors different ts-sim-build-baerrors different ts-sim-build-baerrors different ts-sim-build-baerrors different ts-sim-build-baerrors different ts-sim-build-baerrors different ts-sim-build-ba
traci bugs ticket2803 errors different ts-sim-build-baerrors different ts-sim-build-baerrors different ts-sim-build-baerrors different ts-sim-build-baerrors different ts-sim-build-baerrors different ts-sim-build-ba
traci bugs ticket2804 errors different ts-sim-build-baerrors different ts-sim-build-baerrors different ts-sim-build-baerrors different ts-sim-build-baerrors different ts-sim-build-baerrors different ts-sim-build-ba
traci bugs ticket3140 errors different ts-sim-build-baerrors different ts-sim-build-baerrors different ts-sim-build-baerrors different ts-sim-build-baerrors different ts-sim-build-baerrors different ts-sim-build-ba
traci bugs ticket3348 errors different ts-sim-build-baerrors different ts-sim-build-baerrors different ts-sim-build-baerrors different ts-sim-build-baerrors different ts-sim-build-baerrors different ts-sim-build-ba
traci bugs ticket3349 errors different ts-sim-build-baerrors different ts-sim-build-baerrors different ts-sim-build-baerrors different ts-sim-build-baerrors different ts-sim-build-baerrors different ts-sim-build-ba
traci bugs ticket3505 errors different ts-sim-build-baerrors different ts-sim-build-baerrors different ts-sim-build-baerrors different ts-sim-build-baerrors different ts-sim-build-baerrors different ts-sim-build-ba
traci bugs ticket3505_test_with_begin_ge_savetime errors different ts-sim-build-baerrors different ts-sim-build-baerrors different ts-sim-build-baerrors different ts-sim-build-baerrors different ts-sim-build-baerrors different ts-sim-build-ba
traci bugs ticket3505_with_load_offset errors different ts-sim-build-baerrors different ts-sim-build-baerrors different ts-sim-build-baerrors different ts-sim-build-baerrors different ts-sim-build-baerrors different ts-sim-build-ba
traci bugs ticket3522 errors different ts-sim-build-baerrors different ts-sim-build-baerrors different ts-sim-build-baerrors different ts-sim-build-baerrors different ts-sim-build-baerrors different ts-sim-build-ba
traci bugs ticket3634 errors different ts-sim-build-baerrors different ts-sim-build-baerrors different ts-sim-build-baerrors different ts-sim-build-baerrors different ts-sim-build-baerrors different ts-sim-build-ba
traci bugs ticket3648 errors different ts-sim-build-baerrors different ts-sim-build-baerrors different ts-sim-build-baerrors different ts-sim-build-baerrors different ts-sim-build-baerrors different ts-sim-build-ba
traci bugs ticket3810 errors different ts-sim-build-baerrors different ts-sim-build-baerrors different ts-sim-build-baerrors different ts-sim-build-baerrors different ts-sim-build-baerrors different ts-sim-build-ba
traci bugs ticket4141 errors different ts-sim-build-baerrors different ts-sim-build-baerrors different ts-sim-build-baerrors different ts-sim-build-baerrors different ts-sim-build-baerrors different ts-sim-build-ba
traci bugs ticket4214 errors different ts-sim-build-baerrors different ts-sim-build-baerrors different ts-sim-build-baerrors different ts-sim-build-baerrors different ts-sim-build-baerrors different ts-sim-build-ba
traci bugs ticket4307 errors different ts-sim-build-baerrors different ts-sim-build-baerrors different ts-sim-build-baerrors different ts-sim-build-baerrors different ts-sim-build-baerrors different ts-sim-build-ba
traci bugs ticket4324 errors different ts-sim-build-baerrors different ts-sim-build-baerrors different ts-sim-build-baerrors different ts-sim-build-baerrors different ts-sim-build-baerrors different ts-sim-build-ba
traci bugs ticket4418 errors different ts-sim-build-baerrors different ts-sim-build-baerrors different ts-sim-build-baerrors different ts-sim-build-baerrors different ts-sim-build-baerrors different ts-sim-build-ba
traci bugs ticket4432 errors different ts-sim-build-baerrors different ts-sim-build-baerrors different ts-sim-build-baerrors different ts-sim-build-baerrors different ts-sim-build-baerrors different ts-sim-build-ba
traci bugs ticket4514 errors different ts-sim-build-baerrors different ts-sim-build-baerrors different ts-sim-build-baerrors different ts-sim-build-baerrors different ts-sim-build-baerrors different ts-sim-build-ba
traci bugs ticket4563 errors different ts-sim-build-baerrors different ts-sim-build-baerrors different ts-sim-build-baerrors different ts-sim-build-baerrors different ts-sim-build-baerrors different ts-sim-build-ba
traci bugs ticket4642 errors different ts-sim-build-baerrors different ts-sim-build-baerrors different ts-sim-build-baerrors different ts-sim-build-baerrors different ts-sim-build-baerrors different ts-sim-build-ba
traci bugs ticket4920 errors different ts-sim-build-baerrors different ts-sim-build-baerrors different ts-sim-build-baerrors different ts-sim-build-baerrors different ts-sim-build-baerrors different ts-sim-build-ba
traci bugs ticket5029 errors different ts-sim-build-baerrors different ts-sim-build-baerrors different ts-sim-build-baerrors different ts-sim-build-baerrors different ts-sim-build-baerrors different ts-sim-build-ba
traci bugs ticket5114 errors different ts-sim-build-baerrors different ts-sim-build-baerrors different ts-sim-build-baerrors different ts-sim-build-baerrors different ts-sim-build-baerrors different ts-sim-build-ba
traci bugs ticket5309 errors different ts-sim-build-baerrors different ts-sim-build-baerrors different ts-sim-build-baerrors different ts-sim-build-baerrors different ts-sim-build-baerrors different ts-sim-build-ba
traci bugs ticket5390 errors different ts-sim-build-baerrors different ts-sim-build-baerrors different ts-sim-build-baerrors different ts-sim-build-baerrors different ts-sim-build-baerrors different ts-sim-build-ba
traci bugs ticket5561 errors different ts-sim-build-baerrors different ts-sim-build-baerrors different ts-sim-build-baerrors different ts-sim-build-baerrors different ts-sim-build-baerrors different ts-sim-build-ba
traci bugs ticket5620 errors different ts-sim-build-baerrors different ts-sim-build-baerrors different ts-sim-build-baerrors different ts-sim-build-baerrors different ts-sim-build-baerrors different ts-sim-build-ba
traci bugs ticket5674 errors different ts-sim-build-baerrors different ts-sim-build-baerrors different ts-sim-build-baerrors different ts-sim-build-baerrors different ts-sim-build-baerrors different ts-sim-build-ba
traci bugs ticket5712 errors different ts-sim-build-baerrors different ts-sim-build-baerrors different ts-sim-build-baerrors different ts-sim-build-baerrors different ts-sim-build-baerrors different ts-sim-build-ba
traci bugs ticket5831 errors different ts-sim-build-baerrors different ts-sim-build-baerrors different ts-sim-build-baerrors different ts-sim-build-baerrors different ts-sim-build-baerrors different ts-sim-build-ba
traci bugs ticket5932 errors different ts-sim-build-baerrors different ts-sim-build-baerrors different ts-sim-build-baerrors different ts-sim-build-baerrors different ts-sim-build-baerrors different ts-sim-build-ba
traci bugs ticket5990 errors different ts-sim-build-baerrors different ts-sim-build-baerrors different ts-sim-build-baerrors different ts-sim-build-baerrors different ts-sim-build-baerrors different ts-sim-build-ba
traci bugs ticket6626 errors different ts-sim-build-baerrors different ts-sim-build-baerrors different ts-sim-build-baerrors different ts-sim-build-baerrors different ts-sim-build-baerrors different ts-sim-build-ba
traci bugs ticket7057 errors different ts-sim-build-baerrors different ts-sim-build-baerrors different ts-sim-build-baerrors different ts-sim-build-baerrors different ts-sim-build-baerrors different ts-sim-build-ba
traci bugs ticket7949 errors different ts-sim-build-baerrors different ts-sim-build-baerrors different ts-sim-build-baerrors different ts-sim-build-baerrors different ts-sim-build-baerrors different ts-sim-build-ba
traci busstop busstop errors different ts-sim-build-baerrors different ts-sim-build-baerrors different ts-sim-build-baerrors different ts-sim-build-baerrors different ts-sim-build-baerrors different ts-sim-build-ba
traci calibrator calibrator errors different ts-sim-build-baerrors different ts-sim-build-baerrors different ts-sim-build-baerrors different ts-sim-build-baerrors different ts-sim-build-baerrors different ts-sim-build-ba
traci chargingstation chargingstation errors different ts-sim-build-baerrors different ts-sim-build-baerrors different ts-sim-build-baerrors different ts-sim-build-baerrors different ts-sim-build-baerrors different ts-sim-build-ba
traci connection busySocket sumo errors different ts-sim-build-baerrors different ts-sim-build-baerrors different ts-sim-build-baerrors different ts-sim-build-baerrors different ts-sim-build-baerrors different ts-sim-build-ba
traci connection busySocket sumo-gui errors different ts-sim-build-baerrors different ts-sim-build-baerrors different ts-sim-build-baerrors different ts-sim-build-baerrors different ts-sim-build-baerrors different ts-sim-build-ba
traci connection clientCloses sumo errors different ts-sim-build-baerrors different ts-sim-build-baerrors different ts-sim-build-baerrors different ts-sim-build-baerrors different ts-sim-build-baerrors different ts-sim-build-ba
traci connection clientCloses sumo-gui errors different ts-sim-build-baerrors different ts-sim-build-baerrors different ts-sim-build-baerrors different ts-sim-build-baerrors different ts-sim-build-baerrors different ts-sim-build-ba
traci connection closingOutput sumo errors different ts-sim-build-baerrors different ts-sim-build-baerrors different ts-sim-build-baerrors different ts-sim-build-baerrors different ts-sim-build-baerrors different ts-sim-build-ba
traci connection closingOutput sumo-gui errors different ts-sim-build-baerrors different ts-sim-build-baerrors different ts-sim-build-baerrors different ts-sim-build-baerrors different ts-sim-build-baerrors different ts-sim-build-ba
traci connection multiconnect errors different ts-sim-build-baerrors different ts-sim-build-baerrors different ts-sim-build-baerrors different ts-sim-build-baerrors different ts-sim-build-baerrors different ts-sim-build-ba
traci connection multipleConnections asyncDisconnect sumo errors different ts-sim-build-baerrors different ts-sim-build-baerrors different ts-sim-build-baerrors different ts-sim-build-baerrors different ts-sim-build-baerrors different ts-sim-build-ba
traci connection multipleConnections basic sumo errors different ts-sim-build-baerrors different ts-sim-build-baerrors different ts-sim-build-baerrors different ts-sim-build-baerrors different ts-sim-build-baerrors different(+) ts-sim-build-ba
traci connection multipleConnections basic sumo-gui errors different(+) ts-sim-build-baerrors different(+) ts-sim-build-baerrors different ts-sim-build-baerrors different ts-sim-build-baerrors different ts-sim-build-baerrors different ts-sim-build-ba
traci connection multipleConnections concurringSubscriptions sumo errors different ts-sim-build-baerrors different ts-sim-build-baerrors different ts-sim-build-baerrors different ts-sim-build-baerrors different ts-sim-build-baerrors different ts-sim-build-ba
traci connection multipleConnections differentSteplengths sumo errors different ts-sim-build-baerrors different ts-sim-build-baerrors different(+) ts-sim-build-baerrors different ts-sim-build-baerrors different ts-sim-build-baerrors different ts-sim-build-ba
traci connection multipleConnections orderDependentResults sumo errors different ts-sim-build-baerrors different ts-sim-build-baerrors different ts-sim-build-baerrors different ts-sim-build-baerrors different ts-sim-build-baerrors different ts-sim-build-ba
traci connection multipleConnections subsecondSUMOstep sumo errors different ts-sim-build-baerrors different ts-sim-build-baerrors different ts-sim-build-baerrors different ts-sim-build-baerrors different ts-sim-build-baerrors different(+) ts-sim-build-ba
traci connection multipleConnections unspecifiedOrderWarning sumo errors different ts-sim-build-baerrors different ts-sim-build-baerrors different ts-sim-build-baerrors different ts-sim-build-baerrors different ts-sim-build-baerrors different ts-sim-build-ba
traci connection parallelConnection sumo errors different ts-sim-build-baerrors different ts-sim-build-baerrors different ts-sim-build-baerrors different ts-sim-build-baerrors different ts-sim-build-baerrors different ts-sim-build-ba
traci connection parallelConnection sumo-gui errors different ts-sim-build-baerrors different ts-sim-build-baerrors different ts-sim-build-baerrors different ts-sim-build-baerrors different ts-sim-build-baerrors different ts-sim-build-ba
traci connection repeatedConnection sumo errors different ts-sim-build-baerrors different ts-sim-build-baerrors different ts-sim-build-baerrors different ts-sim-build-baerrors different ts-sim-build-baerrors different ts-sim-build-ba
traci connection repeatedConnection sumo-gui errors different ts-sim-build-baerrors different ts-sim-build-baerrors different ts-sim-build-baerrors different ts-sim-build-baerrors different ts-sim-build-baerrors different ts-sim-build-ba
traci contextSubscriptions edge_100m errors different ts-sim-build-baerrors different ts-sim-build-baerrors different ts-sim-build-baerrors different ts-sim-build-baerrors different ts-sim-build-baerrors different ts-sim-build-ba
traci contextSubscriptions edge_200m errors different ts-sim-build-baerrors different ts-sim-build-baerrors different ts-sim-build-baerrors different ts-sim-build-baerrors different ts-sim-build-baerrors different ts-sim-build-ba
traci contextSubscriptions junction_100m errors different ts-sim-build-baerrors different ts-sim-build-baerrors different ts-sim-build-baerrors different ts-sim-build-baerrors different ts-sim-build-baerrors different ts-sim-build-ba
traci contextSubscriptions junction_200m errors different ts-sim-build-baerrors different ts-sim-build-baerrors different ts-sim-build-baerrors different ts-sim-build-baerrors different ts-sim-build-baerrors different ts-sim-build-ba
traci contextSubscriptions lane_100m errors different ts-sim-build-baerrors different ts-sim-build-baerrors different ts-sim-build-baerrors different ts-sim-build-baerrors different ts-sim-build-baerrors different ts-sim-build-ba
traci contextSubscriptions lane_200m errors different ts-sim-build-baerrors different ts-sim-build-baerrors different ts-sim-build-baerrors different ts-sim-build-baerrors different ts-sim-build-baerrors different ts-sim-build-ba
traci contextSubscriptions parking errors different ts-sim-build-baerrors different ts-sim-build-baerrors different ts-sim-build-baerrors different ts-sim-build-baerrors different ts-sim-build-baerrors different ts-sim-build-ba
traci contextSubscriptions person_100m errors different ts-sim-build-baerrors different ts-sim-build-baerrors different ts-sim-build-baerrors different ts-sim-build-baerrors different ts-sim-build-baerrors different ts-sim-build-ba
traci contextSubscriptions person_200m errors different ts-sim-build-baerrors different ts-sim-build-baerrors different ts-sim-build-baerrors different ts-sim-build-baerrors different ts-sim-build-baerrors different ts-sim-build-ba
traci contextSubscriptions poi_100m errors different ts-sim-build-baerrors different ts-sim-build-baerrors different ts-sim-build-baerrors different ts-sim-build-baerrors different ts-sim-build-baerrors different ts-sim-build-ba
traci contextSubscriptions poi_200m errors different ts-sim-build-baerrors different ts-sim-build-baerrors different ts-sim-build-baerrors different ts-sim-build-baerrors different ts-sim-build-baerrors different ts-sim-build-ba
traci contextSubscriptions polygon_100m errors different ts-sim-build-baerrors different ts-sim-build-baerrors different ts-sim-build-baerrors different ts-sim-build-baerrors different ts-sim-build-baerrors different ts-sim-build-ba
traci contextSubscriptions polygon_200m errors different ts-sim-build-baerrors different ts-sim-build-baerrors different ts-sim-build-baerrors different ts-sim-build-baerrors different ts-sim-build-baerrors different ts-sim-build-ba
traci contextSubscriptions range_100m errors different ts-sim-build-baerrors different ts-sim-build-baerrors different ts-sim-build-baerrors different ts-sim-build-baerrors different ts-sim-build-baerrors different ts-sim-build-ba
traci contextSubscriptions range_200m errors different ts-sim-build-baerrors different ts-sim-build-baerrors different ts-sim-build-baerrors different ts-sim-build-baerrors different ts-sim-build-baerrors different ts-sim-build-ba
traci edge edge errors different ts-sim-build-baerrors different ts-sim-build-baerrors different ts-sim-build-baerrors different ts-sim-build-baerrors different ts-sim-build-baerrors different ts-sim-build-ba
traci gui b50 errors different ts-sim-build-baerrors different ts-sim-build-baerrors different ts-sim-build-baerrors different ts-sim-build-baerrors different ts-sim-build-baerrors different ts-sim-build-ba
traci gui gui errors different ts-sim-build-baerrors different ts-sim-build-baerrors different ts-sim-build-baerrors different ts-sim-build-baerrors different ts-sim-build-baerrors different ts-sim-build-ba
traci gui polygon_dynamics_gui errors different ts-sim-build-baerrors different ts-sim-build-baerrors different ts-sim-build-baerrors different ts-sim-build-baerrors different ts-sim-build-baerrors different ts-sim-build-ba
traci gui polygon_dynamics_remove errors different ts-sim-build-baerrors different ts-sim-build-baerrors different ts-sim-build-baerrors different ts-sim-build-baerrors different ts-sim-build-baerrors different ts-sim-build-ba
traci inductionloop inductionloop errors different ts-sim-build-baerrors different ts-sim-build-baerrors different ts-sim-build-baerrors different ts-sim-build-baerrors different ts-sim-build-baerrors different ts-sim-build-ba
traci junction junction errors different ts-sim-build-baerrors different ts-sim-build-baerrors different ts-sim-build-baerrors different ts-sim-build-baerrors different ts-sim-build-baerrors different ts-sim-build-ba
traci lane lane errors different ts-sim-build-baerrors different ts-sim-build-baerrors different ts-sim-build-baerrors different ts-sim-build-baerrors different ts-sim-build-baerrors different ts-sim-build-ba
traci lane lane_intermodal errors different ts-sim-build-baerrors different ts-sim-build-baerrors different ts-sim-build-baerrors different ts-sim-build-baerrors different ts-sim-build-baerrors different ts-sim-build-ba
traci lanearea lanearea errors different ts-sim-build-baerrors different ts-sim-build-baerrors different ts-sim-build-baerrors different ts-sim-build-baerrors different ts-sim-build-baerrors different ts-sim-build-ba
traci lanearea subsecond errors different ts-sim-build-baerrors different ts-sim-build-baerrors different ts-sim-build-baerrors different ts-sim-build-baerrors different ts-sim-build-baerrors different ts-sim-build-ba
traci meandata meandata errors different ts-sim-build-baerrors different ts-sim-build-baerrors different ts-sim-build-baerrors different ts-sim-build-baerrors different ts-sim-build-baerrors different ts-sim-build-ba
traci misc lateralCollision laneChanging leftLane errors different ts-sim-build-baerrors different ts-sim-build-baerrors different ts-sim-build-baerrors different ts-sim-build-baerrors different ts-sim-build-baerrors different ts-sim-build-ba
traci misc lateralCollision laneChanging rightLane errors different ts-sim-build-baerrors different ts-sim-build-baerrors different ts-sim-build-baerrors different ts-sim-build-baerrors different ts-sim-build-baerrors different ts-sim-build-ba
traci misc lateralCollision sublaneChanging leftLane0.2 errors different ts-sim-build-baerrors different ts-sim-build-baerrors different ts-sim-build-baerrors different ts-sim-build-baerrors different ts-sim-build-baerrors different ts-sim-build-ba
traci misc lateralCollision sublaneChanging leftLane0.5 errors different ts-sim-build-baerrors different ts-sim-build-baerrors different ts-sim-build-baerrors different ts-sim-build-baerrors different ts-sim-build-baerrors different ts-sim-build-ba
traci misc lateralCollision sublaneChanging rightLane0.2 errors different ts-sim-build-baerrors different ts-sim-build-baerrors different ts-sim-build-baerrors different ts-sim-build-baerrors different ts-sim-build-baerrors different ts-sim-build-ba
traci misc lateralCollision sublaneChanging rightLane0.5 errors different ts-sim-build-baerrors different ts-sim-build-baerrors different ts-sim-build-baerrors different ts-sim-build-baerrors different ts-sim-build-baerrors different ts-sim-build-ba
traci misc params errors different ts-sim-build-baerrors different ts-sim-build-baerrors different ts-sim-build-baerrors different ts-sim-build-baerrors different ts-sim-build-baerrors different ts-sim-build-ba
traci misc paramsWithKey errors different ts-sim-build-baerrors different ts-sim-build-baerrors different ts-sim-build-baerrors different ts-sim-build-baerrors different ts-sim-build-baerrors different ts-sim-build-ba
traci misc paramsWithKey_subscription errors different ts-sim-build-baerrors different ts-sim-build-baerrors different ts-sim-build-baerrors different ts-sim-build-baerrors different ts-sim-build-baerrors different ts-sim-build-ba
traci misc rerouting add_with_taz errors different ts-sim-build-baerrors different ts-sim-build-baerrors different ts-sim-build-baerrors different ts-sim-build-baerrors different ts-sim-build-baerrors different ts-sim-build-ba
traci misc rerouting findIntermodalRoute car_public_speedFactor errors different ts-sim-build-baerrors different ts-sim-build-baerrors different ts-sim-build-baerrors different ts-sim-build-baerrors different ts-sim-build-baerrors different ts-sim-build-ba
traci misc rerouting findIntermodalRoute car_public_speedFactor_routingMode errors different ts-sim-build-baerrors different ts-sim-build-baerrors different ts-sim-build-baerrors different ts-sim-build-baerrors different ts-sim-build-baerrors different ts-sim-build-ba
traci misc rerouting findIntermodalRoute taxi errors different ts-sim-build-baerrors different ts-sim-build-baerrors different ts-sim-build-baerrors different ts-sim-build-baerrors different ts-sim-build-baerrors different ts-sim-build-ba
traci misc rerouting person stop_walk_stop_walk errors different ts-sim-build-baerrors different ts-sim-build-baerrors different ts-sim-build-baerrors different ts-sim-build-baerrors different ts-sim-build-baerrors different ts-sim-build-ba
traci misc rerouting person walk errors different ts-sim-build-baerrors different ts-sim-build-baerrors different ts-sim-build-baerrors different ts-sim-build-baerrors different ts-sim-build-baerrors different ts-sim-build-ba
traci misc rerouting person walk_stop_walk errors different ts-sim-build-baerrors different ts-sim-build-baerrors different ts-sim-build-baerrors different ts-sim-build-baerrors different ts-sim-build-baerrors different ts-sim-build-ba
traci misc rerouting person walk_walk_stop_walk errors different ts-sim-build-baerrors different ts-sim-build-baerrors different ts-sim-build-baerrors different ts-sim-build-baerrors different ts-sim-build-baerrors different ts-sim-build-ba
traci misc rerouting rerouteParkingArea_end errors different ts-sim-build-baerrors different ts-sim-build-baerrors different ts-sim-build-baerrors different ts-sim-build-baerrors different ts-sim-build-baerrors different ts-sim-build-ba
traci misc rerouting rerouteParkingArea_intermediate errors different ts-sim-build-baerrors different ts-sim-build-baerrors different ts-sim-build-baerrors different ts-sim-build-baerrors different ts-sim-build-baerrors different ts-sim-build-ba
traci misc rerouting rerouteTraveltime_adaptEdgeWeight errors different ts-sim-build-baerrors different ts-sim-build-baerrors different ts-sim-build-baerrors different ts-sim-build-baerrors different ts-sim-build-baerrors different ts-sim-build-ba
traci misc rerouting rerouteTraveltime_adaptEdgeWeight_varyWithTime errors different ts-sim-build-baerrors different ts-sim-build-baerrors different ts-sim-build-baerrors different ts-sim-build-baerrors different ts-sim-build-baerrors different ts-sim-build-ba
traci misc rerouting rerouteTraveltime_adaptVehicleEdgeWeight errors different ts-sim-build-baerrors different ts-sim-build-baerrors different ts-sim-build-baerrors different ts-sim-build-baerrors different ts-sim-build-baerrors different ts-sim-build-ba
traci misc rerouting rerouteTraveltime_default errors different ts-sim-build-baerrors different ts-sim-build-baerrors different ts-sim-build-baerrors different ts-sim-build-baerrors different ts-sim-build-baerrors different ts-sim-build-ba
traci misc rerouting routingMode rerouteTraveltime_aggregated errors different ts-sim-build-baerrors different ts-sim-build-baerrors different ts-sim-build-baerrors different ts-sim-build-baerrors different ts-sim-build-baerrors different ts-sim-build-ba
traci misc rerouting routingMode rerouteTraveltime_default errors different ts-sim-build-baerrors different ts-sim-build-baerrors different ts-sim-build-baerrors different ts-sim-build-baerrors different ts-sim-build-baerrors different ts-sim-build-ba
traci misc ssm basic errors different ts-sim-build-baerrors different ts-sim-build-baerrors different ts-sim-build-baerrors different ts-sim-build-baerrors different ts-sim-build-baerrors different ts-sim-build-ba
traci misc ssm junction errors different ts-sim-build-baerrors different ts-sim-build-baerrors different ts-sim-build-baerrors different ts-sim-build-baerrors different ts-sim-build-baerrors different ts-sim-build-ba
traci misc steplistener errors different ts-sim-build-baerrors different ts-sim-build-baerrors different ts-sim-build-baerrors different ts-sim-build-baerrors different ts-sim-build-baerrors different ts-sim-build-ba
traci misc tracing errors different ts-sim-build-baerrors different ts-sim-build-baerrors different ts-sim-build-baerrors different ts-sim-build-baerrors different ts-sim-build-baerrors different ts-sim-build-ba
traci misc tracing_noGetters errors different ts-sim-build-baerrors different ts-sim-build-baerrors different ts-sim-build-baerrors different ts-sim-build-baerrors different ts-sim-build-baerrors different ts-sim-build-ba
traci multientryexit multientryexit errors different ts-sim-build-baerrors different ts-sim-build-baerrors different ts-sim-build-baerrors different ts-sim-build-baerrors different ts-sim-build-baerrors different ts-sim-build-ba
traci overheadwire overheadwire errors different ts-sim-build-baerrors different ts-sim-build-baerrors different ts-sim-build-baerrors different ts-sim-build-baerrors different ts-sim-build-baerrors different ts-sim-build-ba
traci parkingarea parkingarea errors different ts-sim-build-baerrors different ts-sim-build-baerrors different ts-sim-build-baerrors different ts-sim-build-baerrors different ts-sim-build-baerrors different ts-sim-build-ba
traci person arrivalPos errors different ts-sim-build-baerrors different ts-sim-build-baerrors different ts-sim-build-baerrors different ts-sim-build-baerrors different ts-sim-build-baerrors different ts-sim-build-ba
traci person moveToXY after_creation errors different ts-sim-build-baerrors different ts-sim-build-baerrors different ts-sim-build-baerrors different ts-sim-build-baerrors different ts-sim-build-baerrors different ts-sim-build-ba
traci person moveToXY after_creation_add_walk errors different ts-sim-build-baerrors different ts-sim-build-baerrors different ts-sim-build-baerrors different ts-sim-build-baerrors different ts-sim-build-baerrors different ts-sim-build-ba
traci person moveToXY keepRoute1_junction errors different ts-sim-build-baerrors different ts-sim-build-baerrors different ts-sim-build-baerrors different ts-sim-build-baerrors different ts-sim-build-baerrors different ts-sim-build-ba
traci person moveToXY keepRoute2_junction errors different ts-sim-build-baerrors different ts-sim-build-baerrors different ts-sim-build-baerrors different ts-sim-build-baerrors different ts-sim-build-baerrors different ts-sim-build-ba
traci person moveToXY keepRoute2_junction_offroad errors different ts-sim-build-baerrors different ts-sim-build-baerrors different ts-sim-build-baerrors different ts-sim-build-baerrors different ts-sim-build-baerrors different ts-sim-build-ba
traci person moveToXY leaveRoute errors different ts-sim-build-baerrors different ts-sim-build-baerrors different ts-sim-build-baerrors different ts-sim-build-baerrors different ts-sim-build-baerrors different ts-sim-build-ba
traci person moveToXY leaveRoute_jaywalk errors different ts-sim-build-baerrors different ts-sim-build-baerrors different ts-sim-build-baerrors different ts-sim-build-baerrors different ts-sim-build-baerrors different ts-sim-build-ba
traci person moveToXY leaveRoute_walkingarea errors different ts-sim-build-baerrors different ts-sim-build-baerrors different ts-sim-build-baerrors different ts-sim-build-baerrors different ts-sim-build-baerrors different ts-sim-build-ba
traci person moveToXY outside_network errors different ts-sim-build-baerrors different ts-sim-build-baerrors different ts-sim-build-baerrors different ts-sim-build-baerrors different ts-sim-build-baerrors different ts-sim-build-ba
traci person moveToXY within_route errors different ts-sim-build-baerrors different ts-sim-build-baerrors different ts-sim-build-baerrors different ts-sim-build-baerrors different ts-sim-build-baerrors different ts-sim-build-ba
traci person moveToXY within_route_jaywalk errors different ts-sim-build-baerrors different ts-sim-build-baerrors different ts-sim-build-baerrors different ts-sim-build-baerrors different ts-sim-build-baerrors different ts-sim-build-ba
traci person moveToXY within_route_onRoad errors different ts-sim-build-baerrors different ts-sim-build-baerrors different ts-sim-build-baerrors different ts-sim-build-baerrors different ts-sim-build-baerrors different ts-sim-build-ba
traci person moveToXY within_route_walkingarea errors different ts-sim-build-baerrors different ts-sim-build-baerrors different ts-sim-build-baerrors different ts-sim-build-baerrors different ts-sim-build-baerrors different ts-sim-build-ba
traci person person errors different ts-sim-build-baerrors different ts-sim-build-baerrors different ts-sim-build-baerrors different ts-sim-build-baerrors different ts-sim-build-baerrors different ts-sim-build-ba
traci person priorStage errors different ts-sim-build-baerrors different ts-sim-build-baerrors different ts-sim-build-baerrors different ts-sim-build-baerrors different ts-sim-build-baerrors different ts-sim-build-ba
traci person priorStage2 errors different ts-sim-build-baerrors different ts-sim-build-baerrors different ts-sim-build-baerrors different ts-sim-build-baerrors different ts-sim-build-baerrors different ts-sim-build-ba
traci poi poi errors different ts-sim-build-baerrors different ts-sim-build-baerrors different ts-sim-build-baerrors different ts-sim-build-baerrors different ts-sim-build-baerrors different ts-sim-build-ba
traci polygon add_large errors different ts-sim-build-baerrors different ts-sim-build-baerrors different ts-sim-build-baerrors different ts-sim-build-baerrors different ts-sim-build-baerrors different ts-sim-build-ba
traci polygon polygon errors different ts-sim-build-baerrors different ts-sim-build-baerrors different ts-sim-build-baerrors different ts-sim-build-baerrors different ts-sim-build-baerrors different ts-sim-build-ba
traci polygon polygon_dynamics errors different ts-sim-build-baerrors different ts-sim-build-baerrors different ts-sim-build-baerrors different ts-sim-build-baerrors different ts-sim-build-baerrors different ts-sim-build-ba
traci rerouter rerouter errors different ts-sim-build-baerrors different ts-sim-build-baerrors different ts-sim-build-baerrors different ts-sim-build-baerrors different ts-sim-build-baerrors different ts-sim-build-ba
traci route route errors different ts-sim-build-baerrors different ts-sim-build-baerrors different ts-sim-build-baerrors different ts-sim-build-baerrors different ts-sim-build-baerrors different ts-sim-build-ba
traci routeprobe routeprobe errors different ts-sim-build-baerrors different ts-sim-build-baerrors different ts-sim-build-baerrors different ts-sim-build-baerrors different ts-sim-build-baerrors different ts-sim-build-ba
traci simulation collisions errors different ts-sim-build-baerrors different ts-sim-build-baerrors different ts-sim-build-baerrors different ts-sim-build-baerrors different ts-sim-build-baerrors different ts-sim-build-ba
traci simulation load errors different ts-sim-build-baerrors different ts-sim-build-baerrors different ts-sim-build-baerrors different ts-sim-build-baerrors different ts-sim-build-baerrors different ts-sim-build-ba
traci simulation loadState IDList errors different ts-sim-build-baerrors different ts-sim-build-baerrors different ts-sim-build-baerrors different ts-sim-build-baerrors different ts-sim-build-baerrors different ts-sim-build-ba
traci simulation loadState busStop errors different ts-sim-build-baerrors different ts-sim-build-baerrors different ts-sim-build-baerrors different ts-sim-build-baerrors different ts-sim-build-baerrors different ts-sim-build-ba
traci simulation loadState detectors errors different ts-sim-build-baerrors different ts-sim-build-baerrors different ts-sim-build-baerrors different ts-sim-build-baerrors different ts-sim-build-baerrors different ts-sim-build-ba
traci simulation loadState railSignal errors different ts-sim-build-baerrors different ts-sim-build-baerrors different ts-sim-build-baerrors different ts-sim-build-baerrors different ts-sim-build-baerrors different ts-sim-build-ba
traci simulation loadState repeat errors different ts-sim-build-baerrors different ts-sim-build-baerrors different ts-sim-build-baerrors different ts-sim-build-baerrors different ts-sim-build-baerrors different ts-sim-build-ba
traci simulation loadState rerouting errors different ts-sim-build-baerrors different ts-sim-build-baerrors different ts-sim-build-baerrors different ts-sim-build-baerrors different ts-sim-build-baerrors different ts-sim-build-ba
traci simulation simulation errors different ts-sim-build-baerrors different ts-sim-build-baerrors different ts-sim-build-baerrors different ts-sim-build-baerrors different ts-sim-build-baerrors different ts-sim-build-ba
traci trafficlight actuated errors different ts-sim-build-baerrors different ts-sim-build-baerrors different ts-sim-build-baerrors different ts-sim-build-baerrors different ts-sim-build-baerrors different ts-sim-build-ba
traci trafficlight getBlocking_reroute errors different ts-sim-build-baerrors different ts-sim-build-baerrors different ts-sim-build-baerrors different ts-sim-build-baerrors different ts-sim-build-baerrors different ts-sim-build-ba
traci trafficlight railsignal_state errors different ts-sim-build-baerrors different ts-sim-build-baerrors different ts-sim-build-baerrors different ts-sim-build-baerrors different ts-sim-build-baerrors different ts-sim-build-ba
traci trafficlight trafficlight errors different ts-sim-build-baerrors different ts-sim-build-baerrors different ts-sim-build-baerrors different ts-sim-build-baerrors different ts-sim-build-baerrors different ts-sim-build-ba
traci variablespeedsign variablespeedsign errors different ts-sim-build-baerrors different ts-sim-build-baerrors different ts-sim-build-baerrors different ts-sim-build-baerrors different ts-sim-build-baerrors different ts-sim-build-ba
traci vehicle changeOpposite errors different ts-sim-build-baerrors different ts-sim-build-baerrors different ts-sim-build-baerrors different ts-sim-build-baerrors different ts-sim-build-baerrors different ts-sim-build-ba
traci vehicle changeOpposite_default errors different ts-sim-build-baerrors different ts-sim-build-baerrors different ts-sim-build-baerrors different ts-sim-build-baerrors different ts-sim-build-baerrors different ts-sim-build-ba
traci vehicle changeRelative_invalid errors different ts-sim-build-baerrors different ts-sim-build-baerrors different ts-sim-build-baerrors different ts-sim-build-baerrors different ts-sim-build-baerrors different ts-sim-build-ba
traci vehicle distance_after_reroute errors different ts-sim-build-baerrors different ts-sim-build-baerrors different ts-sim-build-baerrors different ts-sim-build-baerrors different ts-sim-build-baerrors different ts-sim-build-ba
traci vehicle driverstate errors different ts-sim-build-baerrors different ts-sim-build-baerrors different ts-sim-build-baerrors different ts-sim-build-baerrors different ts-sim-build-baerrors different ts-sim-build-ba
traci vehicle getFollowSpeed errors different ts-sim-build-baerrors different ts-sim-build-baerrors different ts-sim-build-baerrors different ts-sim-build-baerrors different ts-sim-build-baerrors different ts-sim-build-ba
traci vehicle getFollower errors different ts-sim-build-baerrors different ts-sim-build-baerrors different ts-sim-build-baerrors different ts-sim-build-baerrors different ts-sim-build-baerrors different ts-sim-build-ba
traci vehicle getNeighbors errors different ts-sim-build-baerrors different ts-sim-build-baerrors different ts-sim-build-baerrors different ts-sim-build-baerrors different ts-sim-build-baerrors different ts-sim-build-ba
traci vehicle getNeighborsSublane #5180 ts-sim-build-ba#5180 ts-sim-build-ba#5180 ts-sim-build-ba#5180 ts-sim-build-ba#5180 ts-sim-build-ba#5180 ts-sim-build-ba
traci vehicle getStops errors different ts-sim-build-baerrors different ts-sim-build-baerrors different ts-sim-build-baerrors different ts-sim-build-baerrors different ts-sim-build-baerrors different ts-sim-build-ba
traci vehicle moveToXY customLength_keepRoute2 errors different ts-sim-build-baerrors different ts-sim-build-baerrors different ts-sim-build-baerrors different ts-sim-build-baerrors different ts-sim-build-baerrors different ts-sim-build-ba
traci vehicle moveToXY elevation_sublane errors different ts-sim-build-baerrors different ts-sim-build-baerrors different ts-sim-build-baerrors different ts-sim-build-baerrors different ts-sim-build-baerrors different ts-sim-build-ba
traci vehicle moveToXY extreme_elevation errors different ts-sim-build-baerrors different ts-sim-build-baerrors different ts-sim-build-baerrors different ts-sim-build-baerrors different ts-sim-build-baerrors different ts-sim-build-ba
traci vehicle moveToXY extreme_elevation_keeproute2 errors different ts-sim-build-baerrors different ts-sim-build-baerrors different ts-sim-build-baerrors different ts-sim-build-baerrors different ts-sim-build-baerrors different ts-sim-build-ba
traci vehicle moveToXY intersection errors different ts-sim-build-baerrors different ts-sim-build-baerrors different ts-sim-build-baerrors different ts-sim-build-baerrors different ts-sim-build-baerrors different ts-sim-build-ba
traci vehicle moveToXY keepRoute2 errors different(+) ts-sim-build-baerrors different(+) ts-sim-build-baerrors different(+) ts-sim-build-baerrors different(+) ts-sim-build-baerrors different(+) ts-sim-build-baerrors different(+) ts-sim-build-ba
traci vehicle moveToXY multi_lane errors different ts-sim-build-baerrors different ts-sim-build-baerrors different ts-sim-build-baerrors different ts-sim-build-baerrors different ts-sim-build-baerrors different ts-sim-build-ba
traci vehicle moveToXY multi_lane_sublane errors different ts-sim-build-baerrors different ts-sim-build-baerrors different ts-sim-build-baerrors different ts-sim-build-baerrors different ts-sim-build-baerrors different ts-sim-build-ba
traci vehicle moveToXY permissions errors different ts-sim-build-baerrors different ts-sim-build-baerrors different ts-sim-build-baerrors different ts-sim-build-baerrors different ts-sim-build-baerrors different ts-sim-build-ba
traci vehicle moveToXY short_edges errors different ts-sim-build-baerrors different ts-sim-build-baerrors different ts-sim-build-baerrors different ts-sim-build-baerrors different ts-sim-build-baerrors different ts-sim-build-ba
traci vehicle moveToXY speedWithoutTraCI errors different ts-sim-build-baerrors different ts-sim-build-baerrors different ts-sim-build-baerrors different ts-sim-build-baerrors different ts-sim-build-baerrors different ts-sim-build-ba
traci vehicle moveToXY waitingTime errors different ts-sim-build-baerrors different ts-sim-build-baerrors different ts-sim-build-baerrors different ts-sim-build-baerrors different ts-sim-build-baerrors different ts-sim-build-ba
traci vehicle moveTo_detector errors different ts-sim-build-baerrors different ts-sim-build-baerrors different ts-sim-build-baerrors different ts-sim-build-baerrors different ts-sim-build-baerrors different ts-sim-build-ba
traci vehicle nextTLS errors different ts-sim-build-baerrors different ts-sim-build-baerrors different ts-sim-build-baerrors different ts-sim-build-baerrors different ts-sim-build-baerrors different ts-sim-build-ba
traci vehicle openGap braking_leader errors different ts-sim-build-baerrors different ts-sim-build-baerrors different ts-sim-build-baerrors different ts-sim-build-baerrors different ts-sim-build-baerrors different ts-sim-build-ba
traci vehicle openGap braking_leader_spaceGap errors different ts-sim-build-baerrors different ts-sim-build-baerrors different ts-sim-build-baerrors different ts-sim-build-baerrors different ts-sim-build-baerrors different ts-sim-build-ba
traci vehicle openGap merger errors different ts-sim-build-baerrors different ts-sim-build-baerrors different ts-sim-build-baerrors different ts-sim-build-baerrors different ts-sim-build-baerrors different ts-sim-build-ba
traci vehicle openGap merger_as_reference_vehicle errors different ts-sim-build-baerrors different ts-sim-build-baerrors different ts-sim-build-baerrors different ts-sim-build-baerrors different ts-sim-build-baerrors different ts-sim-build-ba
traci vehicle openGap merger_overtakeRightCheckDisabled errors different ts-sim-build-baerrors different ts-sim-build-baerrors different ts-sim-build-baerrors different ts-sim-build-baerrors different ts-sim-build-baerrors different ts-sim-build-ba
traci vehicle openGap merger_with_reference_vehicle errors different ts-sim-build-baerrors different ts-sim-build-baerrors different ts-sim-build-baerrors different ts-sim-build-baerrors different ts-sim-build-baerrors different ts-sim-build-ba
traci vehicle openGap reference_vehicle_removed errors different ts-sim-build-baerrors different ts-sim-build-baerrors different ts-sim-build-baerrors different ts-sim-build-baerrors different ts-sim-build-baerrors different ts-sim-build-ba
traci vehicle openGap warning_smaller_headway errors different ts-sim-build-baerrors different ts-sim-build-baerrors different ts-sim-build-baerrors different ts-sim-build-baerrors different ts-sim-build-baerrors different ts-sim-build-ba
traci vehicle openGap with_low_maxDecel_fast errors different ts-sim-build-baerrors different ts-sim-build-baerrors different ts-sim-build-baerrors different ts-sim-build-baerrors different ts-sim-build-baerrors different ts-sim-build-ba
traci vehicle openGap with_low_maxDecel_fast_CACC see #6192 ts-sim-build-basee #6192 ts-sim-build-basee #6192 ts-sim-build-basee #6192 ts-sim-build-basee #6192 ts-sim-build-basee #6192 ts-sim-build-ba
traci vehicle openGap with_low_maxDecel_slow errors different ts-sim-build-baerrors different ts-sim-build-baerrors different ts-sim-build-baerrors different ts-sim-build-baerrors different ts-sim-build-baerrors different ts-sim-build-ba
traci vehicle openGap without_maxDecel_fast errors different ts-sim-build-baerrors different ts-sim-build-baerrors different ts-sim-build-baerrors different ts-sim-build-baerrors different ts-sim-build-baerrors different ts-sim-build-ba
traci vehicle openGap without_maxDecel_slow errors different ts-sim-build-baerrors different ts-sim-build-baerrors different ts-sim-build-baerrors different ts-sim-build-baerrors different ts-sim-build-baerrors different ts-sim-build-ba
traci vehicle openGap without_maxDecel_slow_spacegap errors different ts-sim-build-baerrors different ts-sim-build-baerrors different ts-sim-build-baerrors different ts-sim-build-baerrors different ts-sim-build-baerrors different ts-sim-build-ba
traci vehicle pastStops_stateLoaded errors different ts-sim-build-baerrors different ts-sim-build-baerrors different ts-sim-build-baerrors different ts-sim-build-baerrors different ts-sim-build-baerrors different ts-sim-build-ba
traci vehicle replaceStop all errors different ts-sim-build-baerrors different ts-sim-build-baerrors different ts-sim-build-baerrors different ts-sim-build-baerrors different ts-sim-build-baerrors different ts-sim-build-ba
traci vehicle replaceStop default errors different ts-sim-build-baerrors different ts-sim-build-baerrors different ts-sim-build-baerrors different ts-sim-build-baerrors different ts-sim-build-baerrors different ts-sim-build-ba
traci vehicle replaceStop first errors different ts-sim-build-baerrors different ts-sim-build-baerrors different ts-sim-build-baerrors different ts-sim-build-baerrors different ts-sim-build-baerrors different ts-sim-build-ba
traci vehicle replaceStop first_init errors different ts-sim-build-baerrors different ts-sim-build-baerrors different ts-sim-build-baerrors different ts-sim-build-baerrors different ts-sim-build-baerrors different ts-sim-build-ba
traci vehicle replaceStop first_later errors different ts-sim-build-baerrors different ts-sim-build-baerrors different ts-sim-build-baerrors different ts-sim-build-baerrors different ts-sim-build-baerrors different ts-sim-build-ba
traci vehicle replaceStop invalid errors different ts-sim-build-baerrors different ts-sim-build-baerrors different ts-sim-build-baerrors different ts-sim-build-baerrors different ts-sim-build-baerrors different ts-sim-build-ba
traci vehicle replaceStop last errors different ts-sim-build-baerrors different ts-sim-build-baerrors different ts-sim-build-baerrors different ts-sim-build-baerrors different ts-sim-build-baerrors different ts-sim-build-ba
traci vehicle replaceStop last_destination errors different ts-sim-build-baerrors different ts-sim-build-baerrors different ts-sim-build-baerrors different ts-sim-build-baerrors different ts-sim-build-baerrors different ts-sim-build-ba
traci vehicle replaceStop last_later errors different ts-sim-build-baerrors different ts-sim-build-baerrors different ts-sim-build-baerrors different ts-sim-build-baerrors different ts-sim-build-baerrors different ts-sim-build-ba
traci vehicle replaceStop second errors different ts-sim-build-baerrors different ts-sim-build-baerrors different ts-sim-build-baerrors different ts-sim-build-baerrors different ts-sim-build-baerrors different ts-sim-build-ba
traci vehicle replaceStop unreachable errors different ts-sim-build-baerrors different ts-sim-build-baerrors different ts-sim-build-baerrors different ts-sim-build-baerrors different ts-sim-build-baerrors different ts-sim-build-ba
traci vehicle resume errors different ts-sim-build-baerrors different ts-sim-build-baerrors different ts-sim-build-baerrors different ts-sim-build-baerrors different ts-sim-build-baerrors different ts-sim-build-ba
traci vehicle setReroutingPeriod errors different ts-sim-build-baerrors different ts-sim-build-baerrors different ts-sim-build-baerrors different ts-sim-build-baerrors different ts-sim-build-baerrors different ts-sim-build-ba
traci vehicle slowDown errors different ts-sim-build-baerrors different ts-sim-build-baerrors different ts-sim-build-baerrors different ts-sim-build-baerrors different ts-sim-build-baerrors different ts-sim-build-ba
traci vehicle slowDown_subsecond errors different ts-sim-build-baerrors different ts-sim-build-baerrors different ts-sim-build-baerrors different ts-sim-build-baerrors different ts-sim-build-baerrors different ts-sim-build-ba
traci vehicle stopDelay errors different ts-sim-build-baerrors different ts-sim-build-baerrors different ts-sim-build-baerrors different ts-sim-build-baerrors different ts-sim-build-baerrors different ts-sim-build-ba
traci vehicle stopDelay2 errors different ts-sim-build-baerrors different ts-sim-build-baerrors different ts-sim-build-baerrors different ts-sim-build-baerrors different ts-sim-build-baerrors different ts-sim-build-ba
traci vehicle stopDelay_waypoint errors different ts-sim-build-baerrors different ts-sim-build-baerrors different ts-sim-build-baerrors different ts-sim-build-baerrors different ts-sim-build-baerrors different ts-sim-build-ba
traci vehicle taxi basic errors different ts-sim-build-baerrors different ts-sim-build-baerrors different ts-sim-build-baerrors different ts-sim-build-baerrors different ts-sim-build-baerrors different ts-sim-build-ba
traci vehicle taxi shared_3 errors different ts-sim-build-baerrors different ts-sim-build-baerrors different ts-sim-build-baerrors different ts-sim-build-baerrors different ts-sim-build-baerrors different ts-sim-build-ba
traci vehicle vehicle errors different ts-sim-build-baerrors different ts-sim-build-baerrors different ts-sim-build-baerrors different ts-sim-build-baerrors different ts-sim-build-baerrors different ts-sim-build-ba
traci vehicle vehicle_asl errors different ts-sim-build-baerrors different ts-sim-build-baerrors different ts-sim-build-baerrors different ts-sim-build-baerrors different ts-sim-build-baerrors different ts-sim-build-ba
traci vehicle vehicle_context errors different ts-sim-build-baerrors different ts-sim-build-baerrors different ts-sim-build-baerrors different ts-sim-build-baerrors different ts-sim-build-baerrors different ts-sim-build-ba
traci vehicle vehicle_sublane errors different ts-sim-build-baerrors different ts-sim-build-baerrors different ts-sim-build-baerrors different ts-sim-build-baerrors different ts-sim-build-baerrors different ts-sim-build-ba
traci vehicle vehicle_sublane_asl errors different(+) ts-sim-build-baerrors different ts-sim-build-baerrors different ts-sim-build-baerrors different ts-sim-build-baerrors different ts-sim-build-baerrors different ts-sim-build-ba
traci vehicletype save_and_load_vtype_params errors different ts-sim-build-baerrors different ts-sim-build-baerrors different ts-sim-build-baerrors different ts-sim-build-baerrors different ts-sim-build-baerrors different ts-sim-build-ba
traci vehicletype vehicletype errors different ts-sim-build-baerrors different ts-sim-build-baerrors different ts-sim-build-baerrors different ts-sim-build-baerrors different ts-sim-build-baerrors different ts-sim-build-ba

meso

test_default.meso.png
Test16Jan202117Jan202118Jan202119Jan202120Jan202121Jan2021
Summary236 tests: 235 FAILED 1 known bugs 236 tests: 235 FAILED 1 known bugs 236 tests: 235 FAILED 1 known bugs 236 tests: 235 FAILED 1 known bugs 236 tests: 235 FAILED 1 known bugs 236 tests: 234 FAILED 1 known bugs 1 unrunnable
state diff_begin errors different ts-sim-build-baerrors different ts-sim-build-baerrors different ts-sim-build-baerrors different ts-sim-build-baerrors different ts-sim-build-baerrors different ts-sim-build-ba
state disconnected errors different ts-sim-build-baerrors different ts-sim-build-baerrors different ts-sim-build-baerrors different ts-sim-build-baerrors different ts-sim-build-baerrors different ts-sim-build-ba
state dists errors different ts-sim-build-baerrors different ts-sim-build-baerrors different ts-sim-build-baerrors different ts-sim-build-baerrors different ts-sim-build-baerrors different ts-sim-build-ba
state dists_gz errors different ts-sim-build-baerrors different ts-sim-build-baerrors different ts-sim-build-baerrors different ts-sim-build-baerrors different ts-sim-build-baerrors different ts-sim-build-ba
state dists_xml errors different ts-sim-build-baerrors different ts-sim-build-baerrors different ts-sim-build-baerrors different ts-sim-build-baerrors different ts-sim-build-baerrors different ts-sim-build-ba
state flow errors different ts-sim-build-baerrors different ts-sim-build-baerrors different ts-sim-build-baerrors different ts-sim-build-baerrors different ts-sim-build-baerrors different ts-sim-build-ba
state multique errors different(+) ts-sim-build-baerrors different(+) ts-sim-build-baerrors different(+) ts-sim-build-baerrors different(+) ts-sim-build-baerrors different(+) ts-sim-build-baerrors different(+) ts-sim-build-ba
state plain errors different ts-sim-build-baerrors different ts-sim-build-baerrors different ts-sim-build-baerrors different ts-sim-build-baerrors different ts-sim-build-baerrors different ts-sim-build-ba
state prefix errors different ts-sim-build-baerrors different ts-sim-build-baerrors different ts-sim-build-baerrors different ts-sim-build-baerrors different ts-sim-build-baerrors different ts-sim-build-ba
state rerouting errors different ts-sim-build-baerrors different ts-sim-build-baerrors different ts-sim-build-baerrors different ts-sim-build-baerrors different ts-sim-build-baerrors different ts-sim-build-ba
state save_cyclic_stops errors different(+) ts-sim-build-baerrors different(+) ts-sim-build-baerrors different(+) ts-sim-build-baerrors different(+) ts-sim-build-baerrors different(+) ts-sim-build-baerrors different(+) ts-sim-build-ba
state save_flow errors different ts-sim-build-baerrors different ts-sim-build-baerrors different ts-sim-build-baerrors different ts-sim-build-baerrors different ts-sim-build-baerrors different ts-sim-build-ba
state save_parking errors different(+) ts-sim-build-baerrors different(+) ts-sim-build-baerrors different(+) ts-sim-build-baerrors different(+) ts-sim-build-baerrors different(+) ts-sim-build-baerrors different(+) ts-sim-build-ba
state save_parking_busStop errors different(+) ts-sim-build-baerrors different(+) ts-sim-build-baerrors different(+) ts-sim-build-baerrors different(+) ts-sim-build-baerrors different(+) ts-sim-build-baerrors different(+) ts-sim-build-ba
state save_rng errors different ts-sim-build-baerrors different ts-sim-build-baerrors different ts-sim-build-baerrors different ts-sim-build-baerrors different ts-sim-build-baerrors different ts-sim-build-ba
state save_routeDistribution errors different ts-sim-build-baerr