18Oct2024 - detailed test results for COMPLEX.libsumo

To reconnect the TextTest GUI to these results, run:

texttest -a complex -d /home/delphi/extraClangDebug/sumo/tests -reconnect /home/delphi/extraClangDebug/texttesttmp/extra_clang3_64D.31Oct110829.812956 -g

To start TextTest for these tests, run:

texttest -a complex -d /home/delphi/extraClangDebug/sumo/tests


libsumo: 536 tests: 536 FAILED

Detailed information for the tests that FAILED:

4 TESTS FAILED on ts-sim-build-ba :

---------- Differences in errors ----------
0a1,3
>   warnings.warn("Could not import libsumo, falling back to pure python traci (%s)." % e)
> /home/delphi/extraClangDebug/sumo/src/utils/common/SUMOTime.cpp:75:15: runtime error: negation of -9223372036854775808 cannot be represented in type 'long long'; cast to an unsigned type to negate this value to itself
> SUMMARY: UndefinedBehaviorSanitizer: undefined-behavior /home/delphi/extraClangDebug/sumo/src/utils/common/SUMOTime.cpp:75:15 
5a9,11
> 
> -- Unordered text as found by filter '^UserWarning:' --
> UserWarning: Could not import libsumo, falling back to pure python traci (cannot import name '_libsumo' from partially initialized module 'libsumo' (most likely due to a circular import) (/home/delphi/extraClangDebug/sumo/tools/libsumo/__init__.py)).
simpla basic ( Last six runs Oct2024 )
simpla headway ( Last six runs Oct2024 )
simpla max_size ( Last six runs Oct2024 )
simpla statistics ( Last six runs Oct2024 )

TEST FAILED on ts-sim-build-ba : simpla config ( Last six runs Oct2024 )

---------- Differences in errors ----------
0a1
>   warnings.warn("Could not import libsumo, falling back to pure python traci (%s)." % e)
20a22,24
> 
> -- Unordered text as found by filter '^UserWarning:' --
> UserWarning: Could not import libsumo, falling back to pure python traci (cannot import name '_libsumo' from partially initialized module 'libsumo' (most likely due to a circular import) (/home/delphi/extraClangDebug/sumo/tools/libsumo/__init__.py)).

287 TESTS FAILED on ts-sim-build-ba :

---------- Differences in errors ----------
0a1,4
>   warnings.warn("Could not import libsumo, falling back to pure python traci (%s)." % e)
> -- Unordered text as found by filter '^UserWarning:' --
> UserWarning: Could not import libsumo, falling back to pure python traci (cannot import name '_libsumo' from partially initialized module 'libsumo' (most likely due to a circular import) (/home/delphi/extraClangDebug/sumo/tools/libsumo/__init__.py)).
> 
simpla openGap ( Last six runs Oct2024 )
traci ContextSubscriptionFilters fieldOfVision incompatible_filter ( Last six runs Oct2024 )
traci ContextSubscriptionFilters fieldOfVision persons range_50_angle_90 ( Last six runs Oct2024 )
traci ContextSubscriptionFilters fieldOfVision range_0_angle_90 ( Last six runs Oct2024 )
traci ContextSubscriptionFilters fieldOfVision range_50_angle_270 ( Last six runs Oct2024 )
traci ContextSubscriptionFilters fieldOfVision range_50_angle_90 ( Last six runs Oct2024 )
traci ContextSubscriptionFilters lanesUpDownDistance lanesLeftOpposite ( Last six runs Oct2024 )
traci ContextSubscriptionFilters lanesUpDownDistance lanesLeftOppositeDownDistZero ( Last six runs Oct2024 )
traci ContextSubscriptionFilters lanesUpDownDistance lanesLeftOppositeUpDistZero ( Last six runs Oct2024 )
traci ContextSubscriptionFilters lanesUpDownDistance lanesOppositeAll ( Last six runs Oct2024 )
traci ContextSubscriptionFilters lanesUpDownDistance lanesOppositeAllDownDistZero ( Last six runs Oct2024 )
traci ContextSubscriptionFilters lanesUpDownDistance lanesOppositeAllUpDistZero ( Last six runs Oct2024 )
traci ContextSubscriptionFilters lanesUpDownDistance lanesOutOfBounds ( Last six runs Oct2024 )
traci ContextSubscriptionFilters lanesUpDownDistance lanesOutOfBoundsDownDistZero ( Last six runs Oct2024 )
traci ContextSubscriptionFilters lanesUpDownDistance lanesOutOfBoundsUpDistZero ( Last six runs Oct2024 )
traci ContextSubscriptionFilters lanesUpDownDistance lanesRight ( Last six runs Oct2024 )
traci ContextSubscriptionFilters lanesUpDownDistance lanesRightDownDistZero ( Last six runs Oct2024 )
traci ContextSubscriptionFilters lanesUpDownDistance lanesRightUpDistZero ( Last six runs Oct2024 )
traci ContextSubscriptionFilters lanesUpDownDistance lanesRight_vClass ( Last six runs Oct2024 )
traci ContextSubscriptionFilters lanesUpDownDistance lanesRight_vType ( Last six runs Oct2024 )
traci ContextSubscriptionFilters lateralDistance incompatible_filter ( Last six runs Oct2024 )
traci ContextSubscriptionFilters lateralDistance internal_edges ( Last six runs Oct2024 )
traci ContextSubscriptionFilters lateralDistance persons range_50_lateralDist_50 ( Last six runs Oct2024 )
traci ContextSubscriptionFilters lateralDistance range_50_lateralDist_50 ( Last six runs Oct2024 )
traci ContextSubscriptionFilters lateralDistance takeover_opposite_lane ( Last six runs Oct2024 )
traci ContextSubscriptionFilters leadFollow carFollowing ( Last six runs Oct2024 )
traci ContextSubscriptionFilters leadFollow laneChangeLeft ( Last six runs Oct2024 )
traci ContextSubscriptionFilters leadFollow laneChangeNeighbors ( Last six runs Oct2024 )
traci ContextSubscriptionFilters leadFollow laneChangeRight ( Last six runs Oct2024 )
traci ContextSubscriptionFilters leadFollowOpposite laneChangeOpposite ( Last six runs Oct2024 )
traci ContextSubscriptionFilters noOpposite lanesInclOpposite ( Last six runs Oct2024 )
traci ContextSubscriptionFilters roadnetSearch_noOpposite dist_10 ( Last six runs Oct2024 )
traci ContextSubscriptionFilters roadnetSearch_noOpposite dist_10_disregard_opposite ( Last six runs Oct2024 )
traci ContextSubscriptionFilters roadnetSearch_noOpposite dist_d10u100 ( Last six runs Oct2024 )
traci ContextSubscriptionFilters roadnetSearch_noOpposite dist_d10u80 ( Last six runs Oct2024 )
traci ContextSubscriptionFilters roadnetSearch_noOpposite dist_d155u65 ( Last six runs Oct2024 )
traci ContextSubscriptionFilters roadnetSearch_noOpposite dist_d200u10 ( Last six runs Oct2024 )
traci ContextSubscriptionFilters roadnetSearch_noOpposite dist_d20u30 ( Last six runs Oct2024 )
traci ContextSubscriptionFilters roadnetSearch_noOpposite dist_d30u20 ( Last six runs Oct2024 )
traci ContextSubscriptionFilters roadnetSearch_withOpposite dist_10_with_opposite ( Last six runs Oct2024 )
traci ContextSubscriptionFilters roadnetSearch_withOpposite dist_d0_u150_only_opposite ( Last six runs Oct2024 )
traci ContextSubscriptionFilters roadnetSearch_withOpposite dist_d0_u150_with_opposite ( Last six runs Oct2024 )
traci ContextSubscriptionFilters roadnetSearch_withOpposite dist_d100_u0_with_opposite ( Last six runs Oct2024 )
traci ContextSubscriptionFilters roadnetSearch_withOpposite dist_d250_u0_only_opposite ( Last six runs Oct2024 )
traci ContextSubscriptionFilters roadnetSearch_withOpposite dist_d250_u0_with_opposite ( Last six runs Oct2024 )
traci ContextSubscriptionFilters roadnetSearch_withOpposite dist_d250_u250_all ( Last six runs Oct2024 )
traci ContextSubscriptionFilters turn combined_with_lanes down50_up0_foeDistToJunction50 ( Last six runs Oct2024 )
traci ContextSubscriptionFilters turn combined_with_lanes noOpposite_down50_up0_foeDistToJunction50 ( Last six runs Oct2024 )
traci ContextSubscriptionFilters turn combined_with_lateralDistance lateral50_down50_up0_foe50 ( Last six runs Oct2024 )
traci ContextSubscriptionFilters turn combined_with_lateralDistance lateral50_down50_up50_foe50 ( Last six runs Oct2024 )
traci ContextSubscriptionFilters turn turn_d250_u250 ( Last six runs Oct2024 )
traci ContextSubscriptionFilters turn turn_d50_u50 ( Last six runs Oct2024 )
traci ContextSubscriptionFilters turn turn_d50_u50_crossing ( Last six runs Oct2024 )
traci ContextSubscriptionFilters vType_and_vClass none ( Last six runs Oct2024 )
traci ContextSubscriptionFilters vType_and_vClass vClass_negative ( Last six runs Oct2024 )
traci ContextSubscriptionFilters vType_and_vClass vClass_positive ( Last six runs Oct2024 )
traci ContextSubscriptionFilters vType_and_vClass vType_negative ( Last six runs Oct2024 )
traci ContextSubscriptionFilters vType_and_vClass vType_positive ( Last six runs Oct2024 )
traci bugs ticket1010 ( Last six runs Oct2024 )
traci bugs ticket10212 ( Last six runs Oct2024 )
traci bugs ticket10212b ( Last six runs Oct2024 )
traci bugs ticket11117 ( Last six runs Oct2024 )
traci bugs ticket11215 ( Last six runs Oct2024 )
traci bugs ticket11870 ( Last six runs Oct2024 )
traci bugs ticket12810 ( Last six runs Oct2024 )
traci bugs ticket12944 ( Last six runs Oct2024 )
traci bugs ticket13053 ( Last six runs Oct2024 )
traci bugs ticket13384 ( Last six runs Oct2024 )
traci bugs ticket13710 ( Last six runs Oct2024 )
traci bugs ticket1433 ( Last six runs Oct2024 )
traci bugs ticket15123 ( Last six runs Oct2024 )
traci bugs ticket2803 ( Last six runs Oct2024 )
traci bugs ticket2804 ( Last six runs Oct2024 )
traci bugs ticket3140 ( Last six runs Oct2024 )
traci bugs ticket3348 ( Last six runs Oct2024 )
traci bugs ticket3349 ( Last six runs Oct2024 )
traci bugs ticket3505 ( Last six runs Oct2024 )
traci bugs ticket3505_with_load_offset ( Last six runs Oct2024 )
traci bugs ticket3522 ( Last six runs Oct2024 )
traci bugs ticket3634 ( Last six runs Oct2024 )
traci bugs ticket4141 ( Last six runs Oct2024 )
traci bugs ticket4214 ( Last six runs Oct2024 )
traci bugs ticket4324 ( Last six runs Oct2024 )
traci bugs ticket4418 ( Last six runs Oct2024 )
traci bugs ticket4514 ( Last six runs Oct2024 )
traci bugs ticket4563 ( Last six runs Oct2024 )
traci bugs ticket4642 ( Last six runs Oct2024 )
traci bugs ticket4920 ( Last six runs Oct2024 )
traci bugs ticket5114 ( Last six runs Oct2024 )
traci bugs ticket5309 ( Last six runs Oct2024 )
traci bugs ticket5390 ( Last six runs Oct2024 )
traci bugs ticket5712 ( Last six runs Oct2024 )
traci bugs ticket5990 ( Last six runs Oct2024 )
traci bugs ticket6239 ( Last six runs Oct2024 )
traci bugs ticket7057 ( Last six runs Oct2024 )
traci bugs ticket8714 ( Last six runs Oct2024 )
traci bugs ticket8945 ( Last six runs Oct2024 )
traci busstop busstop ( Last six runs Oct2024 )
traci busstop noStops ( Last six runs Oct2024 )
traci chargingstation basic ( Last six runs Oct2024 )
traci chargingstation chargingPower ( Last six runs Oct2024 )
traci chargingstation efficiency ( Last six runs Oct2024 )
traci contextSubscriptions edge_100m ( Last six runs Oct2024 )
traci contextSubscriptions edge_200m ( Last six runs Oct2024 )
traci contextSubscriptions elevated ( Last six runs Oct2024 )
traci contextSubscriptions junction_100m ( Last six runs Oct2024 )
traci contextSubscriptions junction_200m ( Last six runs Oct2024 )
traci contextSubscriptions lane_100m ( Last six runs Oct2024 )
traci contextSubscriptions lane_200m ( Last six runs Oct2024 )
traci contextSubscriptions parking ( Last six runs Oct2024 )
traci contextSubscriptions person_100m ( Last six runs Oct2024 )
traci contextSubscriptions person_200m ( Last six runs Oct2024 )
traci contextSubscriptions poi_100m ( Last six runs Oct2024 )
traci contextSubscriptions poi_200m ( Last six runs Oct2024 )
traci contextSubscriptions polygon_100m ( Last six runs Oct2024 )
traci contextSubscriptions polygon_200m ( Last six runs Oct2024 )
traci contextSubscriptions range_100m ( Last six runs Oct2024 )
traci contextSubscriptions range_200m ( Last six runs Oct2024 )
traci edge bidi ( Last six runs Oct2024 )
traci edge edge ( Last six runs Oct2024 )
traci edge setMaxSpeed ( Last six runs Oct2024 )
traci inductionloop inductionloop ( Last six runs Oct2024 )
traci inductionloop intervalData ( Last six runs Oct2024 )
traci inductionloop override ( Last six runs Oct2024 )
traci inductionloop persons_internalDet ( Last six runs Oct2024 )
traci inductionloop persons_walk ( Last six runs Oct2024 )
traci inductionloop persons_walk_wrongType ( Last six runs Oct2024 )
traci junction junction ( Last six runs Oct2024 )
traci lane bidi ( Last six runs Oct2024 )
traci lane internal ( Last six runs Oct2024 )
traci lane lane ( Last six runs Oct2024 )
traci lane lane_intermodal ( Last six runs Oct2024 )
traci lane setMaxSpeed ( Last six runs Oct2024 )
traci lane setMaxSpeed2 ( Last six runs Oct2024 )
traci lane sublane ( Last six runs Oct2024 )
traci lanearea intervalData ( Last six runs Oct2024 )
traci lanearea lanearea ( Last six runs Oct2024 )
traci lanearea null ( Last six runs Oct2024 )
traci lanearea override ( Last six runs Oct2024 )
traci lanearea subsecond ( Last six runs Oct2024 )
traci meandata meandata ( Last six runs Oct2024 )
traci misc concurrent ( Last six runs Oct2024 )
traci misc execute_move ( Last six runs Oct2024 )
traci misc option_list_append ( Last six runs Oct2024 )
traci misc params ( Last six runs Oct2024 )
traci misc paramsWithKey ( Last six runs Oct2024 )
traci misc paramsWithKey_subscription ( Last six runs Oct2024 )
traci misc rerouting person stop_walk_stop_walk ( Last six runs Oct2024 )
traci misc rerouting person walk_stop_walk ( Last six runs Oct2024 )
traci misc rerouting person walk_walk_stop_walk ( Last six runs Oct2024 )
traci misc rerouting rerouteTraveltime_adaptEdgeWeight ( Last six runs Oct2024 )
traci misc rerouting rerouteTraveltime_adaptEdgeWeight_varyWithTime ( Last six runs Oct2024 )
traci misc rerouting rerouteTraveltime_adaptVehicleEdgeWeight ( Last six runs Oct2024 )
traci misc rerouting rerouteTraveltime_default ( Last six runs Oct2024 )
traci misc rerouting rerouter_routingMode rerouteTraveltime_default ( Last six runs Oct2024 )
traci misc rerouting routingMode rerouteTraveltime_aggregated ( Last six runs Oct2024 )
traci misc rerouting routingMode rerouteTraveltime_aggregated_custom ( Last six runs Oct2024 )
traci misc rerouting routingMode rerouteTraveltime_custom ( Last six runs Oct2024 )
traci misc rerouting routingMode rerouteTraveltime_default ( Last six runs Oct2024 )
traci misc rerouting routingMode rerouteTraveltime_raw ( Last six runs Oct2024 )
traci misc rerouting routingMode rerouteTraveltime_raw_custom ( Last six runs Oct2024 )
traci misc tracing ( Last six runs Oct2024 )
traci misc tracing_close_start ( Last six runs Oct2024 )
traci misc tracing_noGetters ( Last six runs Oct2024 )
traci misc tracing_repeat ( Last six runs Oct2024 )
traci misc verbose ( Last six runs Oct2024 )
traci multientryexit multientryexit ( Last six runs Oct2024 )
traci parkingarea parkingarea ( Last six runs Oct2024 )
traci person abort_riding ( Last six runs Oct2024 )
traci person appendDrivingStage_stoppingPlaces ( Last six runs Oct2024 )
traci person arrivalPos ( Last six runs Oct2024 )
traci person force_depart ( Last six runs Oct2024 )
traci person junctionModel.ignoreProb ( Last six runs Oct2024 )
traci person moveTo after_creation ( Last six runs Oct2024 )
traci person moveTo after_creation_walkingarea ( Last six runs Oct2024 )
traci person moveTo after_creation_walkingarea2 ( Last six runs Oct2024 )
traci person moveToXY after_creation ( Last six runs Oct2024 )
traci person moveToXY after_creation_add_walk ( Last six runs Oct2024 )
traci person moveToXY leaveRoute ( Last six runs Oct2024 )
traci person moveToXY leaveRoute_walkingarea ( Last six runs Oct2024 )
traci person moveToXY within_route ( Last six runs Oct2024 )
traci person remove_crossing ( Last six runs Oct2024 )
traci person setSpeedFactor ( Last six runs Oct2024 )
traci person setSpeedFactor2 ( Last six runs Oct2024 )
traci person start_in_vehicle ( Last six runs Oct2024 )
traci polygon add_large ( Last six runs Oct2024 )
traci rerouter rerouter ( Last six runs Oct2024 )
traci simulation loadState IDList ( Last six runs Oct2024 )
traci simulation loadState calibrator ( Last six runs Oct2024 )
traci simulation loadState subscription ( Last six runs Oct2024 )
traci trafficlight actuated_conditions ( Last six runs Oct2024 )
traci trafficlight offset ( Last six runs Oct2024 )
traci trafficlight setProgramLogic_types ( Last six runs Oct2024 )
traci variablespeedsign variablespeedsign ( Last six runs Oct2024 )
traci vehicle add add_internal ( Last six runs Oct2024 )
traci vehicle add departTriggered ( Last six runs Oct2024 )
traci vehicle add remove_reinsert ( Last six runs Oct2024 )
traci vehicle alightingPersons ( Last six runs Oct2024 )
traci vehicle changeLane basic ( Last six runs Oct2024 )
traci vehicle changeLane changeOpposite ( Last six runs Oct2024 )
traci vehicle changeLane changeOpposite_default ( Last six runs Oct2024 )
traci vehicle changeLane changeRelative ( Last six runs Oct2024 )
traci vehicle changeLane changed_while_blocked ( Last six runs Oct2024 )
traci vehicle changeLane stay ( Last six runs Oct2024 )
traci vehicle changeLane_subLane basic ( Last six runs Oct2024 )
traci vehicle changeLane_subLane changeCurrent ( Last six runs Oct2024 )
traci vehicle changeLane_subLane changeOpposite ( Last six runs Oct2024 )
traci vehicle changeLane_subLane changeOpposite_default ( Last six runs Oct2024 )
traci vehicle changeLane_subLane changeRelative ( Last six runs Oct2024 )
traci vehicle changeLane_subLane changeRelative_blocked ( Last six runs Oct2024 )
traci vehicle changeLane_subLane stay ( Last six runs Oct2024 )
traci vehicle changeSublane left_0.6 ( Last six runs Oct2024 )
traci vehicle changeSublane left_1.2 ( Last six runs Oct2024 )
traci vehicle changeSublane left_3.2 ( Last six runs Oct2024 )
traci vehicle changeSublane left_6.4 ( Last six runs Oct2024 )
traci vehicle changeSublane opposite_3.2 ( Last six runs Oct2024 )
traci vehicle changeSublane right_0.6 ( Last six runs Oct2024 )
traci vehicle changeSublane right_1.2 ( Last six runs Oct2024 )
traci vehicle changeSublane right_3.2 ( Last six runs Oct2024 )
traci vehicle changeSublane right_6.4 ( Last six runs Oct2024 )
traci vehicle distance_after_reroute ( Last six runs Oct2024 )
traci vehicle driverstate ( Last six runs Oct2024 )
traci vehicle getFollowSpeed ( Last six runs Oct2024 )
traci vehicle getInvisible ( Last six runs Oct2024 )
traci vehicle getLeader ( Last six runs Oct2024 )
traci vehicle getLeader2 ( Last six runs Oct2024 )
traci vehicle getNeighbors ( Last six runs Oct2024 )
traci vehicle getNeighborsOpposite ( Last six runs Oct2024 )
traci vehicle getNeighborsSublane ( Last six runs Oct2024 )
traci vehicle getNextTLS ( Last six runs Oct2024 )
traci vehicle getStops ( Last six runs Oct2024 )
traci vehicle ignoreJunctionFoes ( Last six runs Oct2024 )
traci vehicle insertStop keepRoute ( Last six runs Oct2024 )
traci vehicle insertStop keepRoute2 ( Last six runs Oct2024 )
traci vehicle insertStop routeStop_init ( Last six runs Oct2024 )
traci vehicle insertStop second_change_attribute ( Last six runs Oct2024 )
traci vehicle moveTo controller_loop ( Last six runs Oct2024 )
traci vehicle moveTo moveTo_detector ( Last six runs Oct2024 )
traci vehicle moveTo odometer ( Last six runs Oct2024 )
traci vehicle moveToXY extreme_elevation_keeproute2 ( Last six runs Oct2024 )
traci vehicle moveToXY guess_next_edge_keepRoute0 ( Last six runs Oct2024 )
traci vehicle moveToXY guess_next_edge_keepRoute2 ( Last six runs Oct2024 )
traci vehicle moveToXY guess_next_edge_keepRoute2_reverse ( Last six runs Oct2024 )
traci vehicle moveToXY low_stepLength ( Last six runs Oct2024 )
traci vehicle moveToXY low_stepLength_keepRoute2 ( Last six runs Oct2024 )
traci vehicle moveToXY multi_lane ( Last six runs Oct2024 )
traci vehicle moveToXY multi_lane_sublane ( Last six runs Oct2024 )
traci vehicle moveToXY odometer ( Last six runs Oct2024 )
traci vehicle moveToXY parallel_internal_edges ( Last six runs Oct2024 )
traci vehicle moveToXY permissions ( Last six runs Oct2024 )
traci vehicle moveToXY short_edges ( Last six runs Oct2024 )
traci vehicle moveToXY speedWithoutTraCI ( Last six runs Oct2024 )
traci vehicle moveToXY ticket5029 ( Last six runs Oct2024 )
traci vehicle openGap braking_leader ( Last six runs Oct2024 )
traci vehicle openGap braking_leader_spaceGap ( Last six runs Oct2024 )
traci vehicle openGap merger ( Last six runs Oct2024 )
traci vehicle openGap merger_as_reference_vehicle ( Last six runs Oct2024 )
traci vehicle openGap merger_overtakeRightCheckDisabled ( Last six runs Oct2024 )
traci vehicle openGap merger_with_reference_vehicle ( Last six runs Oct2024 )
traci vehicle openGap reference_vehicle_removed ( Last six runs Oct2024 )
traci vehicle openGap with_low_maxDecel_fast ( Last six runs Oct2024 )
traci vehicle openGap with_low_maxDecel_fast_CACC ( Last six runs Oct2024 )
traci vehicle openGap with_low_maxDecel_slow ( Last six runs Oct2024 )
traci vehicle openGap without_maxDecel_fast ( Last six runs Oct2024 )
traci vehicle openGap without_maxDecel_slow ( Last six runs Oct2024 )
traci vehicle openGap without_maxDecel_slow_spacegap ( Last six runs Oct2024 )
traci vehicle openGap without_maxDecel_slow_spacegap_ACC ( Last six runs Oct2024 )
traci vehicle pastStops_stateLoaded ( Last six runs Oct2024 )
traci vehicle replaceStop routeStop_init ( Last six runs Oct2024 )
traci vehicle replaceStop second_change_attribute ( Last six runs Oct2024 )
traci vehicle resume ( Last six runs Oct2024 )
traci vehicle setAcceleration ( Last six runs Oct2024 )
traci vehicle setRoute_internal ( Last six runs Oct2024 )
traci vehicle setStop abort ( Last six runs Oct2024 )
traci vehicle setStop newBusStop ( Last six runs Oct2024 )
traci vehicle setStop newInternalStop ( Last six runs Oct2024 )
traci vehicle setStop newStop ( Last six runs Oct2024 )
traci vehicle setStop newStop_fast ( Last six runs Oct2024 )
traci vehicle setStop pos_0 ( Last six runs Oct2024 )
traci vehicle setStop updateDuration_reached ( Last six runs Oct2024 )
traci vehicle setStop updateDuration_upcoming ( Last six runs Oct2024 )
traci vehicle slowDown ( Last six runs Oct2024 )
traci vehicle slowDown_subsecond ( Last six runs Oct2024 )
traci vehicle tripinfoRetrieval ( Last six runs Oct2024 )
traci vehicle vehicle_asl ( Last six runs Oct2024 )
traci vehicle vehicle_context ( Last six runs Oct2024 )
traci vehicle vehicle_sublane_asl ( Last six runs Oct2024 )

TEST FAILED on ts-sim-build-ba : simpla platoon_manager ( Last six runs Oct2024 )

---------- Differences in errors ----------
0a1
>   warnings.warn("Could not import libsumo, falling back to pure python traci (%s)." % e)
24a26,28
> 
> -- Unordered text as found by filter '^UserWarning:' --
> UserWarning: Could not import libsumo, falling back to pure python traci (cannot import name '_libsumo' from partially initialized module 'libsumo' (most likely due to a circular import) (/home/delphi/extraClangDebug/sumo/tools/libsumo/__init__.py)).

TEST FAILED on ts-sim-build-ba : simpla vtypemap_incomplete ( Last six runs Oct2024 )

---------- Differences in errors ----------
0a1,3
>   warnings.warn("Could not import libsumo, falling back to pure python traci (%s)." % e)
> /home/delphi/extraClangDebug/sumo/src/utils/common/SUMOTime.cpp:75:15: runtime error: negation of -9223372036854775808 cannot be represented in type 'long long'; cast to an unsigned type to negate this value to itself
> SUMMARY: UndefinedBehaviorSanitizer: undefined-behavior /home/delphi/extraClangDebug/sumo/src/utils/common/SUMOTime.cpp:75:15 
11a15,17
> 
> -- Unordered text as found by filter '^UserWarning:' --
> UserWarning: Could not import libsumo, falling back to pure python traci (cannot import name '_libsumo' from partially initialized module 'libsumo' (most likely due to a circular import) (/home/delphi/extraClangDebug/sumo/tools/libsumo/__init__.py)).

36 TESTS FAILED on ts-sim-build-ba :

---------- Differences in errors ----------
0a1
>   warnings.warn("Could not import libsumo, falling back to pure python traci (%s)." % e)
1a3,5
> -- Unordered text as found by filter '^UserWarning:' --
> UserWarning: Could not import libsumo, falling back to pure python traci (cannot import name '_libsumo' from partially initialized module 'libsumo' (most likely due to a circular import) (/home/delphi/extraClangDebug/sumo/tools/libsumo/__init__.py)).
> 
traci ContextSubscriptionFilters fieldOfVision range_50_angle_0 ( Last six runs Oct2024 )
traci ContextSubscriptionFilters fieldOfVision range_50_angle_360 ( Last six runs Oct2024 )
traci ContextSubscriptionFilters lateralDistance persons r50_latDist50_ego_person ( Last six runs Oct2024 )
traci bugs ticket2321 ( Last six runs Oct2024 )
traci bugs ticket3505_test_with_begin_ge_savetime ( Last six runs Oct2024 )
traci bugs ticket5831 ( Last six runs Oct2024 )
traci bugs ticket6626 ( Last six runs Oct2024 )
traci misc steplistener ( Last six runs Oct2024 )
traci overheadwire overheadwire ( Last six runs Oct2024 )
traci person junctionModel.ignore ( Last six runs Oct2024 )
traci person moveTo after_creation_crossing ( Last six runs Oct2024 )
traci person moveToXY keepRoute1_junction ( Last six runs Oct2024 )
traci person moveToXY keepRoute2_junction ( Last six runs Oct2024 )
traci person moveToXY matchThreshold ( Last six runs Oct2024 )
traci person moveToXY within_route_walkingarea ( Last six runs Oct2024 )
traci polygon polygon ( Last six runs Oct2024 )
traci trafficlight actuated ( Last six runs Oct2024 )
traci trafficlight trafficlight ( Last six runs Oct2024 )
traci vehicle add departSpeed_invalid ( Last six runs Oct2024 )
traci vehicle add departSpeed_invalid_ignore ( Last six runs Oct2024 )
traci vehicle cfmodel CACC ( Last six runs Oct2024 )
traci vehicle cfmodel setParameter ( Last six runs Oct2024 )
traci vehicle changeLane_subLane lane_deadend ( Last six runs Oct2024 )
traci vehicle getFollower ( Last six runs Oct2024 )
traci vehicle getNextLinks ( Last six runs Oct2024 )
traci vehicle junctionModel.ignore ( Last six runs Oct2024 )
traci vehicle moveToXY customLength_keepRoute2 ( Last six runs Oct2024 )
traci vehicle moveToXY elevation_sublane ( Last six runs Oct2024 )
traci vehicle moveToXY extreme_elevation ( Last six runs Oct2024 )
traci vehicle moveToXY matchThreshold ( Last six runs Oct2024 )
traci vehicle nextTLS ( Last six runs Oct2024 )
traci vehicle nextTLS_parking ( Last six runs Oct2024 )
traci vehicle openGap warning_smaller_headway ( Last six runs Oct2024 )
traci vehicle setSpeedFactor_IDM ( Last six runs Oct2024 )
traci vehicle setStop onPrevNormal ( Last six runs Oct2024 )
traci vehicle taxi undeparted ( Last six runs Oct2024 )

TEST FAILED on ts-sim-build-ba : traci ContextSubscriptionFilters turn persons turn_d50_u50 ( Last six runs Oct2024 )

---------- Differences in errors ----------
0a1
>   warnings.warn("Could not import libsumo, falling back to pure python traci (%s)." % e)
28a30,32
> -- Unordered text as found by filter '^UserWarning:' --
> UserWarning: Could not import libsumo, falling back to pure python traci (cannot import name '_libsumo' from partially initialized module 'libsumo' (most likely due to a circular import) (/home/delphi/extraClangDebug/sumo/tools/libsumo/__init__.py)).
> 

98 TESTS FAILED on ts-sim-build-ba :

---------- Differences in errors ----------
0a1,6
>   warnings.warn("Could not import libsumo, falling back to pure python traci (%s)." % e)
> /home/delphi/extraClangDebug/sumo/src/utils/common/SUMOTime.cpp:75:15: runtime error: negation of -9223372036854775808 cannot be represented in type 'long long'; cast to an unsigned type to negate this value to itself
> SUMMARY: UndefinedBehaviorSanitizer: undefined-behavior /home/delphi/extraClangDebug/sumo/src/utils/common/SUMOTime.cpp:75:15 
> -- Unordered text as found by filter '^UserWarning:' --
> UserWarning: Could not import libsumo, falling back to pure python traci (cannot import name '_libsumo' from partially initialized module 'libsumo' (most likely due to a circular import) (/home/delphi/extraClangDebug/sumo/tools/libsumo/__init__.py)).
> 
traci bugs ticket15486 ( Last six runs Oct2024 )
traci bugs ticket15603 ( Last six runs Oct2024 )
traci bugs ticket3810 ( Last six runs Oct2024 )
traci bugs ticket4432 ( Last six runs Oct2024 )
traci bugs ticket5620 ( Last six runs Oct2024 )
traci bugs ticket5674 ( Last six runs Oct2024 )
traci bugs ticket7949 ( Last six runs Oct2024 )
traci misc rerouting add_with_taz ( Last six runs Oct2024 )
traci misc rerouting rerouteParkingArea_end ( Last six runs Oct2024 )
traci misc rerouting rerouteParkingArea_intermediate ( Last six runs Oct2024 )
traci misc rerouting rerouteParkingArea_undeparted ( Last six runs Oct2024 )
traci person moveToXY outside_network ( Last six runs Oct2024 )
traci person moveToXY within_route_jaywalk ( Last six runs Oct2024 )
traci person moveToXY within_route_onRoad ( Last six runs Oct2024 )
traci person remove ( Last six runs Oct2024 )
traci person remove_add ( Last six runs Oct2024 )
traci person trip_chain ( Last six runs Oct2024 )
traci simulation loadState busStop ( Last six runs Oct2024 )
traci simulation loadState detectors ( Last six runs Oct2024 )
traci simulation loadState persons ( Last six runs Oct2024 )
traci simulation loadState persons2 ( Last six runs Oct2024 )
traci simulation loadState persons_include ( Last six runs Oct2024 )
traci simulation loadState repeat ( Last six runs Oct2024 )
traci simulation loadState rerouting ( Last six runs Oct2024 )
traci simulation loadState reset_routeFiles ( Last six runs Oct2024 )
traci trafficlight constraints getConstraints_types ( Last six runs Oct2024 )
traci trafficlight constraints removeConstraints_all ( Last six runs Oct2024 )
traci trafficlight constraints removeConstraints_foeId ( Last six runs Oct2024 )
traci trafficlight constraints removeConstraints_foeSignal ( Last six runs Oct2024 )
traci trafficlight constraints removeConstraints_signalId ( Last six runs Oct2024 )
traci trafficlight constraints removeConstraints_tripId ( Last six runs Oct2024 )
traci vehicle add addTrip ( Last six runs Oct2024 )
traci vehicle add addTrip2 ( Last six runs Oct2024 )
traci vehicle add attributes ( Last six runs Oct2024 )
traci vehicle changeTarget ( Last six runs Oct2024 )
traci vehicle getJunctionFoes ( Last six runs Oct2024 )
traci vehicle insertStop all ( Last six runs Oct2024 )
traci vehicle insertStop default ( Last six runs Oct2024 )
traci vehicle insertStop first ( Last six runs Oct2024 )
traci vehicle insertStop first_init ( Last six runs Oct2024 )
traci vehicle insertStop first_init_setSpeed ( Last six runs Oct2024 )
traci vehicle insertStop first_later ( Last six runs Oct2024 )
traci vehicle insertStop first_loop ( Last six runs Oct2024 )
traci vehicle insertStop last ( Last six runs Oct2024 )
traci vehicle insertStop on_junction ( Last six runs Oct2024 )
traci vehicle insertStop second ( Last six runs Oct2024 )
traci vehicle insertStop second_unreachable_ignore_rerouter ( Last six runs Oct2024 )
traci vehicle insertStop stop_forbidden_ignore_rerouter_copy ( Last six runs Oct2024 )
traci vehicle insertStop third ( Last six runs Oct2024 )
traci vehicle insertStop third_later ( Last six runs Oct2024 )
traci vehicle moveToXY intersection ( Last six runs Oct2024 )
traci vehicle moveToXY waitingTime ( Last six runs Oct2024 )
traci vehicle replaceStop all ( Last six runs Oct2024 )
traci vehicle replaceStop customParam ( Last six runs Oct2024 )
traci vehicle replaceStop default ( Last six runs Oct2024 )
traci vehicle replaceStop first ( Last six runs Oct2024 )
traci vehicle replaceStop first_init ( Last six runs Oct2024 )
traci vehicle replaceStop first_later ( Last six runs Oct2024 )
traci vehicle replaceStop first_parameter ( Last six runs Oct2024 )
traci vehicle replaceStop first_parameter_edge ( Last six runs Oct2024 )
traci vehicle replaceStop first_teleport ( Last six runs Oct2024 )
traci vehicle replaceStop first_teleport_custom_duration ( Last six runs Oct2024 )
traci vehicle replaceStop last ( Last six runs Oct2024 )
traci vehicle replaceStop last_destination ( Last six runs Oct2024 )
traci vehicle replaceStop last_later ( Last six runs Oct2024 )
traci vehicle replaceStop last_same_location_teleport ( Last six runs Oct2024 )
traci vehicle replaceStop on_junction ( Last six runs Oct2024 )
traci vehicle replaceStop remove_reroute ( Last six runs Oct2024 )
traci vehicle replaceStop remove_teleport ( Last six runs Oct2024 )
traci vehicle replaceStop remove_teleport_once ( Last six runs Oct2024 )
traci vehicle replaceStop remove_teleport_once_custom ( Last six runs Oct2024 )
traci vehicle replaceStop remove_teleport_once_custom2 ( Last six runs Oct2024 )
traci vehicle replaceStop remove_teleport_once_stopDelay ( Last six runs Oct2024 )
traci vehicle replaceStop second ( Last six runs Oct2024 )
traci vehicle replaceStop second_remove ( Last six runs Oct2024 )
traci vehicle replaceStop second_remove_init ( Last six runs Oct2024 )
traci vehicle replaceStop second_remove_rider ( Last six runs Oct2024 )
traci vehicle replaceStop second_teleport ( Last six runs Oct2024 )
traci vehicle replaceStop second_unreachable_teleport ( Last six runs Oct2024 )
traci vehicle setReroutingPeriod ( Last six runs Oct2024 )
traci vehicle setStop_default_state ( Last six runs Oct2024 )
traci vehicle ssm basic ( Last six runs Oct2024 )
traci vehicle ssm junction ( Last six runs Oct2024 )
traci vehicle stopDelay ( Last six runs Oct2024 )
traci vehicle stopDelay2 ( Last six runs Oct2024 )
traci vehicle taxi basic ( Last six runs Oct2024 )
traci vehicle taxi case1_redispatch_after_pickup ( Last six runs Oct2024 )
traci vehicle taxi case1_redispatch_before_pickup ( Last six runs Oct2024 )
traci vehicle taxi case1_redispatch_before_pickup_close_to_stop ( Last six runs Oct2024 )
traci vehicle taxi case2_redispatch_after_pickup ( Last six runs Oct2024 )
traci vehicle taxi case2_redispatch_before_pickup ( Last six runs Oct2024 )
traci vehicle taxi case3_redispatch_after_pickup ( Last six runs Oct2024 )
traci vehicle taxi case4_redispatch_after_pickup ( Last six runs Oct2024 )
traci vehicle taxi getTaxiFleet ( Last six runs Oct2024 )
traci vehicle taxi looped_dispatch ( Last six runs Oct2024 )
traci vehicle taxi remove_person ( Last six runs Oct2024 )
traci vehicle taxi shared_3 ( Last six runs Oct2024 )
traci vehicle taxi splitReservation ( Last six runs Oct2024 )

2 TESTS FAILED on ts-sim-build-ba :

---------- Differences in errors ----------
0a1
>   warnings.warn("Could not import libsumo, falling back to pure python traci (%s)." % e)
6a8,10
> -- Unordered text as found by filter '^UserWarning:' --
> UserWarning: Could not import libsumo, falling back to pure python traci (cannot import name '_libsumo' from partially initialized module 'libsumo' (most likely due to a circular import) (/home/delphi/extraClangDebug/sumo/tools/libsumo/__init__.py)).
> 
traci bugs ticket2777 ( Last six runs Oct2024 )
traci simulation collisions ( Last six runs Oct2024 )

11 TESTS FAILED on ts-sim-build-ba :

---------- Differences in errors ----------
0a1,3
>   warnings.warn("Could not import libsumo, falling back to pure python traci (%s)." % e)
> /home/delphi/extraClangDebug/sumo/src/utils/common/SUMOTime.cpp:75:15: runtime error: negation of -9223372036854775808 cannot be represented in type 'long long'; cast to an unsigned type to negate this value to itself
> SUMMARY: UndefinedBehaviorSanitizer: undefined-behavior /home/delphi/extraClangDebug/sumo/src/utils/common/SUMOTime.cpp:75:15 
1a5,7
> -- Unordered text as found by filter '^UserWarning:' --
> UserWarning: Could not import libsumo, falling back to pure python traci (cannot import name '_libsumo' from partially initialized module 'libsumo' (most likely due to a circular import) (/home/delphi/extraClangDebug/sumo/tools/libsumo/__init__.py)).
> 
traci bugs ticket3648 ( Last six runs Oct2024 )
traci misc parkingSearch retrieveParkingMemory ( Last six runs Oct2024 )
traci vehicle insertStop empty_id ( Last six runs Oct2024 )
traci vehicle insertStop invalid ( Last six runs Oct2024 )
traci vehicle insertStop reached_invalid ( Last six runs Oct2024 )
traci vehicle insertStop unreachable ( Last six runs Oct2024 )
traci vehicle meso ( Last six runs Oct2024 )
traci vehicle replaceStop invalid ( Last six runs Oct2024 )
traci vehicle replaceStop reached_invalid ( Last six runs Oct2024 )
traci vehicle replaceStop unreachable ( Last six runs Oct2024 )
traci vehicle stopDelay_waypoint ( Last six runs Oct2024 )

2 TESTS FAILED on ts-sim-build-ba :

---------- Differences in errors ----------
0a1,3
>   warnings.warn("Could not import libsumo, falling back to pure python traci (%s)." % e)
> /home/delphi/extraClangDebug/sumo/src/utils/common/SUMOTime.cpp:75:15: runtime error: negation of -9223372036854775808 cannot be represented in type 'long long'; cast to an unsigned type to negate this value to itself
> SUMMARY: UndefinedBehaviorSanitizer: undefined-behavior /home/delphi/extraClangDebug/sumo/src/utils/common/SUMOTime.cpp:75:15 
4a8,10
> -- Unordered text as found by filter '^UserWarning:' --
> UserWarning: Could not import libsumo, falling back to pure python traci (cannot import name '_libsumo' from partially initialized module 'libsumo' (most likely due to a circular import) (/home/delphi/extraClangDebug/sumo/tools/libsumo/__init__.py)).
> 
traci bugs ticket5561 ( Last six runs Oct2024 )
traci person priorStage ( Last six runs Oct2024 )

2 TESTS FAILED on ts-sim-build-ba :

---------- Differences in errors ----------
0a1,3
>   warnings.warn("Could not import libsumo, falling back to pure python traci (%s)." % e)
> /home/delphi/extraClangDebug/sumo/src/utils/common/SUMOTime.cpp:75:15: runtime error: negation of -9223372036854775808 cannot be represented in type 'long long'; cast to an unsigned type to negate this value to itself
> SUMMARY: UndefinedBehaviorSanitizer: undefined-behavior /home/delphi/extraClangDebug/sumo/src/utils/common/SUMOTime.cpp:75:15 
3a7,9
> -- Unordered text as found by filter '^UserWarning:' --
> UserWarning: Could not import libsumo, falling back to pure python traci (cannot import name '_libsumo' from partially initialized module 'libsumo' (most likely due to a circular import) (/home/delphi/extraClangDebug/sumo/tools/libsumo/__init__.py)).
> 
traci bugs ticket5932 ( Last six runs Oct2024 )
traci vehicle keepAfterArrival ( Last six runs Oct2024 )

TEST FAILED on ts-sim-build-ba : traci calibrator calibrator ( Last six runs Oct2024 )

---------- Differences in errors ----------
0a1
>   warnings.warn("Could not import libsumo, falling back to pure python traci (%s)." % e)
2a4,25
> 
> =================================================================
> ==4137153==ERROR: LeakSanitizer: detected memory leaks
> 
> Direct leak of 608 byte(s) in 1 object(s) allocated from:
>     #0 0x5d6edfbe88b1 in operator new(unsigned long) (/home/delphi/extraClangDebug/sumo/bin/sumoD+0x255c8b1) (BuildId: 2def77f78b0d3ed8747c35d0286147d2dede0b5f)
>     #1 0x5d6ee16d2104 in MSCalibrator::setFlow(long long, long long, double, double, SUMOVehicleParameter) /home/delphi/extraClangDebug/sumo/src/microsim/trigger/MSCalibrator.cpp:747:30
>     #2 0x5d6ee0a9a11b in libsumo::Calibrator::setFlow(std::__cxx11::basic_string<char, std::char_traits<char>, std::allocator<char>> const&, double, double, double, double, std::__cxx11::basic_string<char, std::char_traits<char>, std::allocator<char>> const&, std::__cxx11::basic_string<char, std::char_traits<char>, std::allocator<char>> const&, std::__cxx11::basic_string<char, std::char_traits<char>, std::allocator<char>> const&, std::__cxx11::basic_string<char, std::char_traits<char>, std::al
locator<char>> const&) /home/delphi/extraClangDebug/sumo/src/libsumo/Calibrator.cpp:172:34
>     #3 0x5d6ee08118f5 in TraCIServerAPI_Calibrator::processSet(TraCIServer&, tcpip::Storage&, tcpip::Storage&) /home/delphi/extraClangDebug/sumo/src/traci-server/TraCIServerAPI_Calibrator.cpp:78:17
>     #4 0x5d6ee074fa1c in TraCIServer::dispatchCommand() /home/delphi/extraClangDebug/sumo/src/traci-server/TraCIServer.cpp:764:19
>     #5 0x5d6ee075a48f in TraCIServer::processCommands(long long, bool) /home/delphi/extraClangDebug/sumo/src/traci-server/TraCIServer.cpp:656:41
>     #6 0x5d6edfc018e9 in MSNet::simulationStep(bool) /home/delphi/extraClangDebug/sumo/src/microsim/MSNet.cpp:730:27
>     #7 0x5d6edfc00368 in MSNet::simulate(long long, long long) /home/delphi/extraClangDebug/sumo/src/microsim/MSNet.cpp:412:9
>     #8 0x5d6edfbec865 in main /home/delphi/extraClangDebug/sumo/src/sumo_main.cpp:100:30
>     #9 0x79cc2502a1c9 in __libc_start_call_main csu/../sysdeps/nptl/libc_start_call_main.h:58:16
>     #10 0x79cc2502a28a in __libc_start_main csu/../csu/libc-start.c:360:3
>     #11 0x5d6edfb0f444 in _start (/home/delphi/extraClangDebug/sumo/bin/sumoD+0x2483444) (BuildId: 2def77f78b0d3ed8747c35d0286147d2dede0b5f)
> 
> SUMMARY: AddressSanitizer: 608 byte(s) leaked in 1 allocation(s).
> -- Unordered text as found by filter '^UserWarning:' --
> UserWarning: Could not import libsumo, falling back to pure python traci (cannot import name '_libsumo' from partially initialized module 'libsumo' (most likely due to a circular import) (/home/delphi/extraClangDebug/sumo/tools/libsumo/__init__.py)).
> 

2 TESTS FAILED on ts-sim-build-ba :

---------- Differences in errors ----------
0a1
>   warnings.warn("Could not import libsumo, falling back to pure python traci (%s)." % e)
220a222,224
> -- Unordered text as found by filter '^UserWarning:' --
> UserWarning: Could not import libsumo, falling back to pure python traci (cannot import name '_libsumo' from partially initialized module 'libsumo' (most likely due to a circular import) (/home/delphi/extraClangDebug/sumo/tools/libsumo/__init__.py)).
> 
traci contextSubscriptions matrix_test ( Last six runs Oct2024 )
traci contextSubscriptions matrix_test_defaults ( Last six runs Oct2024 )

TEST FAILED on ts-sim-build-ba : traci contextSubscriptions simulation_5 ( Last six runs Oct2024 )

---------- Differences in errors ----------
0a1
>   warnings.warn("Could not import libsumo, falling back to pure python traci (%s)." % e)
11a13,15
> -- Unordered text as found by filter '^UserWarning:' --
> UserWarning: Could not import libsumo, falling back to pure python traci (cannot import name '_libsumo' from partially initialized module 'libsumo' (most likely due to a circular import) (/home/delphi/extraClangDebug/sumo/tools/libsumo/__init__.py)).
> 

TEST FAILED on ts-sim-build-ba : traci misc encoding ( Last six runs Oct2024 )

---------- Differences in errors ----------
0a1,8
>   warnings.warn("Could not import libsumo, falling back to pure python traci (%s)." % e)
> /usr/bin/../lib/gcc/x86_64-linux-gnu/14/../../../../include/c++/14/bits/basic_string.h:466:32: runtime error: implicit conversion from type 'unsigned char' of value 195 (8-bit, unsigned) to type 'const char_type' (aka 'const char') changed the value to -61 (8-bit, signed)
> SUMMARY: UndefinedBehaviorSanitizer: undefined-behavior /usr/bin/../lib/gcc/x86_64-linux-gnu/14/../../../../include/c++/14/bits/basic_string.h:466:32 
> /usr/bin/../lib/gcc/x86_64-linux-gnu/14/../../../../include/c++/14/bits/stl_algobase.h:403:20: runtime error: implicit conversion from type 'char' of value -61 (8-bit, signed) to type 'unsigned char' changed the value to 195 (8-bit, unsigned)
> SUMMARY: UndefinedBehaviorSanitizer: undefined-behavior /usr/bin/../lib/gcc/x86_64-linux-gnu/14/../../../../include/c++/14/bits/stl_algobase.h:403:20 
> -- Unordered text as found by filter '^UserWarning:' --
> UserWarning: Could not import libsumo, falling back to pure python traci (cannot import name '_libsumo' from partially initialized module 'libsumo' (most likely due to a circular import) (/home/delphi/extraClangDebug/sumo/tools/libsumo/__init__.py)).
> 

TEST FAILED on ts-sim-build-ba : traci misc rerouting findIntermodalRoute car_public_speedFactor ( Last six runs Oct2024 )

---------- Differences in errors ----------
0a1,4
>   warnings.warn("Could not import libsumo, falling back to pure python traci (%s)." % e)
> -- Unordered text as found by filter '^UserWarning:' --
> UserWarning: Could not import libsumo, falling back to pure python traci (cannot import name '_libsumo' from partially initialized module 'libsumo' (most likely due to a circular import) (/home/delphi/extraClangDebug/sumo/tests/../tests/complex/traci/misc/rerouting/findIntermodalRoute/car_public_speedFactor/../../../../../../../tools/libsumo/__init__.py)).
> 

TEST FAILED on ts-sim-build-ba : traci misc rerouting findIntermodalRoute car_public_speedFactor_noTrains ( Last six runs Oct2024 )

---------- Differences in errors ----------
0a1,4
>   warnings.warn("Could not import libsumo, falling back to pure python traci (%s)." % e)
> -- Unordered text as found by filter '^UserWarning:' --
> UserWarning: Could not import libsumo, falling back to pure python traci (cannot import name '_libsumo' from partially initialized module 'libsumo' (most likely due to a circular import) (/home/delphi/extraClangDebug/sumo/tests/../tests/complex/traci/misc/rerouting/findIntermodalRoute/car_public_speedFactor_noTrains/../../../../../../../tools/libsumo/__init__.py)).
> 

TEST FAILED on ts-sim-build-ba : traci misc rerouting findIntermodalRoute car_public_speedFactor_routingMode ( Last six runs Oct2024 )

---------- Differences in errors ----------
0a1,4
>   warnings.warn("Could not import libsumo, falling back to pure python traci (%s)." % e)
> -- Unordered text as found by filter '^UserWarning:' --
> UserWarning: Could not import libsumo, falling back to pure python traci (cannot import name '_libsumo' from partially initialized module 'libsumo' (most likely due to a circular import) (/home/delphi/extraClangDebug/sumo/tests/../tests/complex/traci/misc/rerouting/findIntermodalRoute/car_public_speedFactor_routingMode/../../../../../../../tools/libsumo/__init__.py)).
> 

TEST FAILED on ts-sim-build-ba : traci misc rerouting findIntermodalRoute taxi ( Last six runs Oct2024 )

---------- Differences in errors ----------
0a1,4
>   warnings.warn("Could not import libsumo, falling back to pure python traci (%s)." % e)
> -- Unordered text as found by filter '^UserWarning:' --
> UserWarning: Could not import libsumo, falling back to pure python traci (cannot import name '_libsumo' from partially initialized module 'libsumo' (most likely due to a circular import) (/home/delphi/extraClangDebug/sumo/tests/../tests/complex/traci/misc/rerouting/findIntermodalRoute/taxi/../../../../../../../tools/libsumo/__init__.py)).
> 

TEST FAILED on ts-sim-build-ba : traci misc rerouting findIntermodalRoute taxi_startEndWalk ( Last six runs Oct2024 )

---------- Differences in errors ----------
0a1,4
>   warnings.warn("Could not import libsumo, falling back to pure python traci (%s)." % e)
> -- Unordered text as found by filter '^UserWarning:' --
> UserWarning: Could not import libsumo, falling back to pure python traci (cannot import name '_libsumo' from partially initialized module 'libsumo' (most likely due to a circular import) (/home/delphi/extraClangDebug/sumo/tests/../tests/complex/traci/misc/rerouting/findIntermodalRoute/taxi_startEndWalk/../../../../../../../tools/libsumo/__init__.py)).
> 

TEST FAILED on ts-sim-build-ba : traci misc rerouting person walk ( Last six runs Oct2024 )

---------- Differences in errors ----------
0a1,4
>   warnings.warn("Could not import libsumo, falling back to pure python traci (%s)." % e)
> -- Unordered text as found by filter '^UserWarning:' --
> UserWarning: Could not import libsumo, falling back to pure python traci (cannot import name '_libsumo' from partially initialized module 'libsumo' (most likely due to a circular import) (/home/delphi/extraClangDebug/sumo/tests/../tests/complex/traci/misc/rerouting/person/walk/../../../../../../../tools/libsumo/__init__.py)).
> 

17 TESTS FAILED on ts-sim-build-ba :

---------- Differences in errors ----------
0a1
>   warnings.warn("Could not import libsumo, falling back to pure python traci (%s)." % e)
2a4,6
> -- Unordered text as found by filter '^UserWarning:' --
> UserWarning: Could not import libsumo, falling back to pure python traci (cannot import name '_libsumo' from partially initialized module 'libsumo' (most likely due to a circular import) (/home/delphi/extraClangDebug/sumo/tools/libsumo/__init__.py)).
> 
traci misc rerouting rerouter_routingMode rerouteTraveltime_ignoreRerouter ( Last six runs Oct2024 )
traci route route ( Last six runs Oct2024 )
traci simulation load ( Last six runs Oct2024 )
traci simulation loadState tlProgramOnline ( Last six runs Oct2024 )
traci trafficlight NEMA maxGreens ( Last six runs Oct2024 )
traci trafficlight NEMA offset ( Last six runs Oct2024 )
traci trafficlight NEMA phaseCalls ( Last six runs Oct2024 )
traci trafficlight NEMA splits ( Last six runs Oct2024 )
traci trafficlight NEMA splits_invalid ( Last six runs Oct2024 )
traci trafficlight setLogic_duration0 ( Last six runs Oct2024 )
traci trafficlight setLogic_repeated ( Last six runs Oct2024 )
traci vehicle changeLane changeRelative_invalid ( Last six runs Oct2024 )
traci vehicle changeLane lane_deadend ( Last six runs Oct2024 )
traci vehicle changeLane_subLane changeRelative_invalid ( Last six runs Oct2024 )
traci vehicle lateralCollision laneChanging leftLane ( Last six runs Oct2024 )
traci vehicle lateralCollision laneChanging rightLane ( Last six runs Oct2024 )
traci vehicle moveToXY collision ( Last six runs Oct2024 )

TEST FAILED on ts-sim-build-ba : traci misc signature ( Last six runs Oct2024 )

---------- Differences in errors ----------
0a1,13
>   warnings.warn("Could not import libsumo, falling back to pure python traci (%s)." % e)
> Traceback (most recent call last):
>   File "/home/delphi/extraClangDebug/sumo/tests/../tests/complex/traci/misc/signature/runner.py", line 27, in <module>
>     import libsumo
>   File "/home/delphi/extraClangDebug/sumo/tools/libsumo/__init__.py", line 38, in <module>
>     from .libsumo import vehicle, simulation, person, trafficlight, edge  # noqa
>     ^^^^^^^^^^^^^^^^^^^^^^^^^^^^^^^^^^^^^^^^^^^^^^^^^^^^^^^^^^^^^^^^^^^^
>   File "/home/delphi/extraClangDebug/sumo/tools/libsumo/libsumo.py", line 10, in <module>
>     from . import _libsumo
> ImportError: cannot import name '_libsumo' from partially initialized module 'libsumo' (most likely due to a circular import) (/home/delphi/extraClangDebug/sumo/tools/libsumo/__init__.py)
> -- Unordered text as found by filter '^UserWarning:' --
> UserWarning: Could not import libsumo, falling back to pure python traci (cannot import name '_libsumo' from partially initialized module 'libsumo' (most likely due to a circular import) (/home/delphi/extraClangDebug/sumo/tools/libsumo/__init__.py)).
> 

3 TESTS FAILED on ts-sim-build-ba :

---------- Differences in errors ----------
0a1
>   warnings.warn("Could not import libsumo, falling back to pure python traci (%s)." % e)
8a10,12
> -- Unordered text as found by filter '^UserWarning:' --
> UserWarning: Could not import libsumo, falling back to pure python traci (cannot import name '_libsumo' from partially initialized module 'libsumo' (most likely due to a circular import) (/home/delphi/extraClangDebug/sumo/tools/libsumo/__init__.py)).
> 
traci person moveToXY keepRoute2_junction_offroad ( Last six runs Oct2024 )
traci vehicle lateralCollision sublaneChanging leftLane0.5 ( Last six runs Oct2024 )
traci vehicle lateralCollision sublaneChanging rightLane0.5 ( Last six runs Oct2024 )

5 TESTS FAILED on ts-sim-build-ba :

---------- Differences in errors ----------
0a1,3
>   warnings.warn("Could not import libsumo, falling back to pure python traci (%s)." % e)
> /home/delphi/extraClangDebug/sumo/src/utils/common/SUMOTime.cpp:75:15: runtime error: negation of -9223372036854775808 cannot be represented in type 'long long'; cast to an unsigned type to negate this value to itself
> SUMMARY: UndefinedBehaviorSanitizer: undefined-behavior /home/delphi/extraClangDebug/sumo/src/utils/common/SUMOTime.cpp:75:15 
2a6,8
> -- Unordered text as found by filter '^UserWarning:' --
> UserWarning: Could not import libsumo, falling back to pure python traci (cannot import name '_libsumo' from partially initialized module 'libsumo' (most likely due to a circular import) (/home/delphi/extraClangDebug/sumo/tools/libsumo/__init__.py)).
> 
traci person moveToXY leaveRoute_jaywalk ( Last six runs Oct2024 )
traci vehicle insertStop first_teleport ( Last six runs Oct2024 )
traci vehicle insertStop second_teleport ( Last six runs Oct2024 )
traci vehicle insertStop second_unreachable_teleport ( Last six runs Oct2024 )
traci vehicle keepAfterArrival_state ( Last six runs Oct2024 )

TEST FAILED on ts-sim-build-ba : traci person person ( Last six runs Oct2024 )

---------- Differences in errors ----------
0a1
>   warnings.warn("Could not import libsumo, falling back to pure python traci (%s)." % e)
5,7c6,13
< Error: The stage index must be lower than the number of remaining stages.
< Error: The negative stage index -2 must refer to a valid previous stage.
< Warning: Person 'tripTest2' walking from edge '2fi' to edge '1fi' has a disconnect, time=219.00.
---
> sumo: /home/delphi/extraClangDebug/sumo/src/microsim/transportables/MSPModel_Striping.cpp:388: static const MSPModel_Striping::WalkingAreaPath *MSPModel_Striping::getWalkingAreaPath(const MSEdge *, const MSLane *, const MSLane *): Assertion `pathIt2 != myWalkingAreaPaths.end()' failed.
> Traceback (most recent call last):
>     raise FatalTraCIError("Connection closed by SUMO.")
> traci.exceptions.FatalTraCIError: Connection closed by SUMO.
> /usr/lib/python3.12/subprocess.py:1127: ResourceWarning: subprocess 4136275 is still running
> -- Unordered text as found by filter '^UserWarning:' --
> UserWarning: Could not import libsumo, falling back to pure python traci (cannot import name '_libsumo' from partially initialized module 'libsumo' (most likely due to a circular import) (/home/delphi/extraClangDebug/sumo/tools/libsumo/__init__.py)).
> 
---------- Differences in fcd ----------
80,1655c80
<         <person id="detour2" x="511.55" y="479.48" angle="0.00" speed="1.33" pos="227.98" edge="3si" slope="0.00" type="DEFAULT_PEDTYPE"/>
<         <person id="detour" x="511.55" y="484.24" angle="0.00" speed="1.32" pos="232.74" edge="3si" slope="0.00" type="DEFAULT_PEDTYPE"/>
<     </timestep>
<     <timestep time="11.00">
<         <vehicle id="veh0" x="504.95" y="486.43" angle="0.00" type="DEFAULT_VEHTYPE" speed="0.10" pos="234.93" lane="3si_2" slope="0.00"/>
<         <person id="newPerson" x="504.95" y="486.43" angle="0.00" speed="0.10" pos="234.93" edge="3si" slope="0.00" type="DEFAULT_PEDTYPE"/>
<         <person id="tripTest" x="750.46" y="504.37" angle="351.38" speed="1.23" pos="1.03" edge=":m2_w0" slope="0.00" type="DEFAULT_PEDTYPE"/>
<         <person id="horiz" x="750.46" y="508.59" angle="351.38" speed="1.62" pos="5.20" edge=":m2_w0" slope="0.00" type="pType3@horiz"/>
<         <person id="detour2" x="511.55" y="480.64" angle="0.00" speed="1.16" pos="229.14" edge="3si" slope="0.00" type="DEFAULT_PEDTYPE"/>
<         <person id="detour" x="511.55" y="485.56" angle="0.00" speed="1.32" pos="234.06" edge="3si" slope="0.00" type="DEFAULT_PEDTYPE"/>
<     </timestep>
<     <timestep time="12.00">
<         <vehicle id="veh0" x="504.95" y="486.50" angle="0.00" type="DEFAULT_VEHTYPE" speed="0.07" pos="235.00" lane="3si_2" slope="0.00"/>
<         <person id="newPerson" x="504.95" y="486.50" angle="0.00" speed="0.07" pos="235.00" edge="3si" slope="0.00" type="DEFAULT_PEDTYPE"/>
<         <person id="detour" x="511.19" y="486.76" angle="0.00" speed="1.19" pos="0.21" edge=":0_w2" slope="0.00" type="DEFAULT_PEDTYPE"/>
<         <person id="tripTest" x="750.28" y="505.56" angle="351.38" speed="1.20" pos="2.23" edge=":m2_w0" slope="0.00" type="DEFAULT_PEDTYPE"/>
<         <person id="horiz" x="750.22" y="510.22" angle="351.38" speed="1.65" pos="6.85" edge=":m2_w0" slope="0.00" type="pType3@horiz"/>
<         <person id="detour2" x="511.55" y="481.86" angle="0.00" speed="1.22" pos="230.36" edge="3si" slope="0.00" type="DEFAULT_PEDTYPE"/>
<     </timestep>
<     <timestep time="13.00">
<         <vehicle id="veh0" x="501.65" y="486.53" angle="0.00" type="DEFAULT_VEHTYPE" speed="0.03" pos="235.03" lane="3si_3" slope="0.00"/>
<         <person id="newPerson" x="501.65" y="486.53" angle="0.00" speed="0.03" pos="235.03" edge="3si" slope="0.00" type="DEFAULT_PEDTYPE"/>
<         <person id="detour" x="511.19" y="487.95" angle="0.00" speed="1.20" pos="1.40" edge=":0_w2" slope="0.00" type="DEFAULT_PEDTYPE"/>
<         <person id="tripTest" x="750.11" y="506.67" angle="351.38" speed="1.12" pos="3.36" edge=":m2_w0" slope="0.00" type="DEFAULT_PEDTYPE"/>
<         <person id="horiz" x="748.96" y="511.55" angle="270.00" speed="1.37" pos="8.22" edge=":m2_w0" slope="0.00" type="pType3@horiz"/>
<         <person id="detour2" x="511.55" y="483.17" angle="0.00" speed="1.30" pos="231.67" edge="3si" slope="0.00" type="DEFAULT_PEDTYPE"/>
<     </timestep>
<     <timestep time="14.00">
<         <vehicle id="veh0" x="501.37" y="488.50" angle="356.82" type="DEFAULT_VEHTYPE" speed="1.99" pos="1.96" lane=":0_10_0" slope="0.00"/>
<truncated after showing first 30 lines>
---------- Differences in output ----------
108,140d107
< :0_w1
< 10.204908506891279
< :0_c0
< recovering from exception after asking for invalid stage index
< recovering from exception after asking for invalid stage index
< 214.0 person=tripTest2 edge=2fi pos=10.0
< 215.0 person=tripTest2 edge=2fi pos=10.0
< 216.0 person=tripTest2 edge=2fi pos=11.270260349782701
< 217.0 person=tripTest2 edge=2fi pos=12.633023575698543
< 218.0 person=tripTest2 edge=2fi pos=13.800850237926674
<   tripTest2 new edges edges=('2fi', '1fi')
< 219.0 person=tripTest2 edge=2fi pos=15.108002757058582
< 220.0 person=tripTest2 edge=2fi pos=16.448834158169728
< 221.0 person=tripTest2 edge=2fi pos=17.739631039504378
< 222.0 person=tripTest2 edge=2fi pos=19.050406385277814
< 223.0 person=tripTest2 edge=2fi pos=20.296709538476232
< remaining stages for 'p3' (before replacement of current stage)
<   0: Stage(type=2, edges=('1fi', '1si'), travelTime=10.0, cost=INVALID, length=27.24982758415672, depart=224.0, departPos=238.5, arrivalPos=10.0, description=walking)
< remaining stages for 'p3' (after replacement)
<   0: Stage(type=2, edges=('1fi', '1o'), travelTime=0.0, cost=INVALID, length=495.25, depart=234.0, departPos=10.0, arrivalPos=10.0, description=walking)
< remaining stages for 'p3' (before replacement of next stage)
<   0: Stage(type=2, edges=('1fi', '1o'), travelTime=0.0, cost=INVALID, length=495.25, depart=234.0, departPos=10.0, arrivalPos=10.0, description=walking)
<   1: Stage(type=2, edges=('1o', '3o'), travelTime=INVALID, cost=INVALID, length=39.991248085099585, depart=INVALID, departPos=10.0, arrivalPos=10.0, description=walking)
< remaining stages for 'p3' (after replacement)
<   0: Stage(type=2, edges=('1fi', '1o'), travelTime=0.0, cost=INVALID, length=495.25, depart=234.0, departPos=10.0, arrivalPos=10.0, description=walking)
<   1: Stage(type=2, edges=('1o', '4o'), travelTime=INVALID, cost=INVALID, length=39.991248085099585, depart=INVALID, departPos=10.0, arrivalPos=10.0, description=walking)
< speed (before setSpeed) 0.0
< type maxSpeed (before setSpeed) 10.438888888888888
< person maxSpeed (before setSpeed) 1.3888888888888888
<truncated after showing first 30 lines>

TEST FAILED on ts-sim-build-ba : traci person priorStage2 ( Last six runs Oct2024 )

---------- Differences in errors ----------
0a1,3
>   warnings.warn("Could not import libsumo, falling back to pure python traci (%s)." % e)
> /home/delphi/extraClangDebug/sumo/src/utils/common/SUMOTime.cpp:75:15: runtime error: negation of -9223372036854775808 cannot be represented in type 'long long'; cast to an unsigned type to negate this value to itself
> SUMMARY: UndefinedBehaviorSanitizer: undefined-behavior /home/delphi/extraClangDebug/sumo/src/utils/common/SUMOTime.cpp:75:15 
8a12,14
> -- Unordered text as found by filter '^UserWarning:' --
> UserWarning: Could not import libsumo, falling back to pure python traci (cannot import name '_libsumo' from partially initialized module 'libsumo' (most likely due to a circular import) (/home/delphi/extraClangDebug/sumo/tools/libsumo/__init__.py)).
> 

TEST FAILED on ts-sim-build-ba : traci poi poi ( Last six runs Oct2024 )

---------- Differences in errors ----------
0a1,89
>   warnings.warn("Could not import libsumo, falling back to pure python traci (%s)." % e)
> /home/delphi/extraClangDebug/sumo/src/utils/shapes/ShapeContainer.cpp:51:19: runtime error: member call on address 0x5060000c6020 which does not point to an object of type 'ParametrisedWrappingCommand<ShapeContainer, PolygonDynamics *>'
> 0x5060000c6020: note: object has invalid vptr
>  00 00 00 00  16 5c 00 00 00 00 00 00  00 00 00 00 be be be be  80 91 00 00 30 51 00 00  a0 8f 02 00
>               ^~~~~~~~~~~~~~~~~~~~~~~
>               invalid vptr
> SUMMARY: UndefinedBehaviorSanitizer: undefined-behavior /home/delphi/extraClangDebug/sumo/src/utils/shapes/ShapeContainer.cpp:51:19 
> /home/delphi/extraClangDebug/sumo/src/utils/common/ParametrisedWrappingCommand.h:66:9: runtime error: member access within address 0x5060000c6020 which does not point to an object of type 'ParametrisedWrappingCommand<ShapeContainer, PolygonDynamics *>'
> 0x5060000c6020: note: object has invalid vptr
>  00 00 00 00  16 5c 00 00 00 00 00 00  00 00 00 00 be be be be  80 91 00 00 30 51 00 00  a0 8f 02 00
>               ^~~~~~~~~~~~~~~~~~~~~~~
>               invalid vptr
> SUMMARY: UndefinedBehaviorSanitizer: undefined-behavior /home/delphi/extraClangDebug/sumo/src/utils/common/ParametrisedWrappingCommand.h:66:9 
> =================================================================
> ==4136983==ERROR: AddressSanitizer: heap-use-after-free on address 0x5060000c6050 at pc 0x589db083a885 bp 0x7ffc7c3fdd90 sp 0x7ffc7c3fdd88
> WRITE of size 1 at 0x5060000c6050 thread T0
>     #0 0x589db083a884 in ParametrisedWrappingCommand<ShapeContainer, PolygonDynamics*>::deschedule() /home/delphi/extraClangDebug/sumo/src/utils/common/ParametrisedWrappingCommand.h:66:33
>     #1 0x589db08307e9 in ShapeContainer::~ShapeContainer() /home/delphi/extraClangDebug/sumo/src/utils/shapes/ShapeContainer.cpp:51:19
>     #2 0x589db0830e98 in ShapeContainer::~ShapeContainer() /home/delphi/extraClangDebug/sumo/src/utils/shapes/ShapeContainer.cpp:49:35
>     #3 0x589dade149ad in MSNet::~MSNet() /home/delphi/extraClangDebug/sumo/src/microsim/MSNet.cpp:321:5
>     #4 0x589dade16c28 in MSNet::~MSNet() /home/delphi/extraClangDebug/sumo/src/microsim/MSNet.cpp:294:17
>     #5 0x589dade06ace in main /home/delphi/extraClangDebug/sumo/src/sumo_main.cpp:101:17
>     #6 0x7ebbeb22a1c9 in __libc_start_call_main csu/../sysdeps/nptl/libc_start_call_main.h:58:16
>     #7 0x7ebbeb22a28a in __libc_start_main csu/../csu/libc-start.c:360:3
>     #8 0x589dadd29444 in _start (/home/delphi/extraClangDebug/sumo/bin/sumoD+0x2483444) (BuildId: 2def77f78b0d3ed8747c35d0286147d2dede0b5f)
> 
> 0x5060000c6050 is located 48 bytes inside of 56-byte region [0x5060000c6020,0x5060000c6058)
> freed by thread T0 here:
>     #0 0x589dade03131 in operator delete(void*) (/home/delphi/extraClangDebug/sumo/bin/sumoD+0x255d131) (BuildId: 2def77f78b0d3ed8747c35d0286147d2dede0b5f)
<truncated after showing first 30 lines>

TEST FAILED on ts-sim-build-ba : traci polygon polygon_dynamics ( Last six runs Oct2024 )

---------- Differences in errors ----------
0a1
>   warnings.warn("Could not import libsumo, falling back to pure python traci (%s)." % e)
6a8,12
> /home/delphi/extraClangDebug/sumo/src/utils/common/SUMOTime.cpp:75:15: runtime error: negation of -9223372036854775808 cannot be represented in type 'long long'; cast to an unsigned type to negate this value to itself
> SUMMARY: UndefinedBehaviorSanitizer: undefined-behavior /home/delphi/extraClangDebug/sumo/src/utils/common/SUMOTime.cpp:75:15 
> -- Unordered text as found by filter '^UserWarning:' --
> UserWarning: Could not import libsumo, falling back to pure python traci (cannot import name '_libsumo' from partially initialized module 'libsumo' (most likely due to a circular import) (/home/delphi/extraClangDebug/sumo/tools/libsumo/__init__.py)).
> 

TEST FAILED on ts-sim-build-ba : traci routeprobe routeprobe ( Last six runs Oct2024 )

---------- Differences in errors ----------
0a1
>   warnings.warn("Could not import libsumo, falling back to pure python traci (%s)." % e)
127a129,131
> -- Unordered text as found by filter '^UserWarning:' --
> UserWarning: Could not import libsumo, falling back to pure python traci (cannot import name '_libsumo' from partially initialized module 'libsumo' (most likely due to a circular import) (/home/delphi/extraClangDebug/sumo/tools/libsumo/__init__.py)).
> 

TEST FAILED on ts-sim-build-ba : traci simulation loadState errors ( Last six runs Oct2024 )

---------- Differences in errors ----------
0a1
>   warnings.warn("Could not import libsumo, falling back to pure python traci (%s)." % e)
4a6,8
> 
> -- Unordered text as found by filter '^UserWarning:' --
> UserWarning: Could not import libsumo, falling back to pure python traci (cannot import name '_libsumo' from partially initialized module 'libsumo' (most likely due to a circular import) (/home/delphi/extraClangDebug/sumo/tools/libsumo/__init__.py)).

TEST FAILED on ts-sim-build-ba : traci simulation loadState railSignal ( Last six runs Oct2024 )

---------- Differences in errors ----------
0a1,102
>   warnings.warn("Could not import libsumo, falling back to pure python traci (%s)." % e)
> /home/delphi/extraClangDebug/sumo/src/utils/common/SUMOTime.cpp:75:15: runtime error: negation of -9223372036854775808 cannot be represented in type 'long long'; cast to an unsigned type to negate this value to itself
> SUMMARY: UndefinedBehaviorSanitizer: undefined-behavior /home/delphi/extraClangDebug/sumo/src/utils/common/SUMOTime.cpp:75:15 
> /home/delphi/extraClangDebug/sumo/src/microsim/traffic_lights/MSDriveWay.cpp:553:18: runtime error: member call on address 0x51800001b880 which does not point to an object of type 'SUMOVehicle'
> 0x51800001b880: note: object has invalid vptr
>  00 00 00 00  76 61 00 00 00 00 00 00  98 b8 01 00 80 51 00 00  02 00 00 00 00 00 00 00  74 31 00 be
>               ^~~~~~~~~~~~~~~~~~~~~~~
>               invalid vptr
> SUMMARY: UndefinedBehaviorSanitizer: undefined-behavior /home/delphi/extraClangDebug/sumo/src/microsim/traffic_lights/MSDriveWay.cpp:553:18 
> =================================================================
> ==4137032==ERROR: AddressSanitizer: heap-use-after-free on address 0x51800001b880 at pc 0x64fe6bcb2882 bp 0x7ffe458591b0 sp 0x7ffe458591a8
> READ of size 8 at 0x51800001b880 thread T0
>     #0 0x64fe6bcb2881 in MSDriveWay::hasJoin(SUMOVehicle const*, SUMOVehicle const*) /home/delphi/extraClangDebug/sumo/src/microsim/traffic_lights/MSDriveWay.cpp:553:18
>     #1 0x64fe6bca5616 in MSDriveWay::foeDriveWayOccupied(bool, SUMOVehicle const*, std::vector<MSEdge*, std::allocator<MSEdge*>>&) const /home/delphi/extraClangDebug/sumo/src/microsim/traffic_lights/MSDriveWay.cpp:431:21
>     #2 0x64fe6bca4680 in MSDriveWay::reserve(std::pair<SUMOVehicle const* const, MSLink::ApproachingVehicleInformation const> const&, std::vector<MSEdge*, std::allocator<MSEdge*>>&) /home/delphi/extraClangDebug/sumo/src/microsim/traffic_lights/MSDriveWay.cpp:205:9
>     #3 0x64fe6bc0b2f6 in MSRailSignal::updateCurrentPhase() /home/delphi/extraClangDebug/sumo/src/microsim/traffic_lights/MSRailSignal.cpp:152:39
>     #4 0x64fe6bc68a48 in MSRailSignalControl::updateSignals(long long) /home/delphi/extraClangDebug/sumo/src/microsim/traffic_lights/MSRailSignalControl.cpp:295:37
>     #5 0x64fe69afdc5d in MSNet::simulationStep(bool) /home/delphi/extraClangDebug/sumo/src/microsim/MSNet.cpp:769:44
>     #6 0x64fe69afa368 in MSNet::simulate(long long, long long) /home/delphi/extraClangDebug/sumo/src/microsim/MSNet.cpp:412:9
>     #7 0x64fe69ae6865 in main /home/delphi/extraClangDebug/sumo/src/sumo_main.cpp:100:30
>     #8 0x7187a322a1c9 in __libc_start_call_main csu/../sysdeps/nptl/libc_start_call_main.h:58:16
>     #9 0x7187a322a28a in __libc_start_main csu/../csu/libc-start.c:360:3
>     #10 0x64fe69a09444 in _start (/home/delphi/extraClangDebug/sumo/bin/sumoD+0x2483444) (BuildId: 2def77f78b0d3ed8747c35d0286147d2dede0b5f)
> 
> 0x51800001b880 is located 0 bytes inside of 896-byte region [0x51800001b880,0x51800001bc00)
> freed by thread T0 here:
>     #0 0x64fe69ae3131 in operator delete(void*) (/home/delphi/extraClangDebug/sumo/bin/sumoD+0x255d131) (BuildId: 2def77f78b0d3ed8747c35d0286147d2dede0b5f)
>     #1 0x64fe69edc061 in MSVehicle::~MSVehicle() /home/delphi/extraClangDebug/sumo/src/microsim/MSVehicle.cpp:1014:25
>     #2 0x64fe6a0a6d7d in MSVehicleControl::clearState(bool) /home/delphi/extraClangDebug/sumo/src/microsim/MSVehicleControl.cpp:255:9
<truncated after showing first 30 lines>
---------- Differences in tripinfo ----------
5,7d4
<     <tripinfo id="t0" depart="0.00" departLane="" departPos="45.10" departSpeed="-1.00" departDelay="0.00" arrival="57.00" arrivalLane="e_0" arrivalPos="100.00" arrivalSpeed="8.00" duration="57.00" routeLength="300.20" waitingTime="0.00" waitingCount="0" stopTime="0.00" timeLoss="0.00" rerouteNo="1" devices="tripinfo_t0 routing_t0" vType="train" speedFactor="1.00" vaporized=""/>
<     <tripinfo id="t1" depart="10.00" departLane="" departPos="45.10" departSpeed="-1.00" departDelay="0.00" arrival="92.00" arrivalLane="e_0" arrivalPos="100.00" arrivalSpeed="8.00" duration="82.00" routeLength="500.40" waitingTime="2.00" waitingCount="1" stopTime="0.00" timeLoss="24.76" rerouteNo="1" devices="tripinfo_t1 routing_t1" vType="train" speedFactor="1.00" vaporized=""/>
< </tripinfos>

TEST FAILED on ts-sim-build-ba : traci simulation simulation ( Last six runs Oct2024 )

---------- Differences in errors ----------
0a1
>   warnings.warn("Could not import libsumo, falling back to pure python traci (%s)." % e)
17a19,56
> 
> =================================================================
> ==4137132==ERROR: LeakSanitizer: detected memory leaks
> 
> Direct leak of 608 byte(s) in 1 object(s) allocated from:
>     #0 0x61336d41b8b1 in operator new(unsigned long) (/home/delphi/extraClangDebug/sumo/bin/sumoD+0x255c8b1) (BuildId: 2def77f78b0d3ed8747c35d0286147d2dede0b5f)
>     #1 0x61336e31d351 in libsumo::Simulation::findIntermodalRoute(std::__cxx11::basic_string<char, std::char_traits<char>, std::allocator<char>> const&, std::__cxx11::basic_string<char, std::char_traits<char>, std::allocator<char>> const&, std::__cxx11::basic_string<char, std::char_traits<char>, std::allocator<char>> const&, double, int, double, double, double, double, double, std::__cxx11::basic_string<char, std::char_traits<char>, std::allocator<char>> const&, std::__cxx11::basic_string<char
, std::char_traits<char>, std::allocator<char>> const&, std::__cxx11::basic_string<char, std::char_traits<char>, std::allocator<char>> const&) /home/delphi/extraClangDebug/sumo/src/libsumo/Simulation.cpp:628:24
>     #2 0x61336e06dc07 in TraCIServerAPI_Simulation::processGet(TraCIServer&, tcpip::Storage&, tcpip::Storage&) /home/delphi/extraClangDebug/sumo/src/traci-server/TraCIServerAPI_Simulation.cpp:279:66
>     #3 0x61336df82a1c in TraCIServer::dispatchCommand() /home/delphi/extraClangDebug/sumo/src/traci-server/TraCIServer.cpp:764:19
>     #4 0x61336df8d48f in TraCIServer::processCommands(long long, bool) /home/delphi/extraClangDebug/sumo/src/traci-server/TraCIServer.cpp:656:41
>     #5 0x61336d4348e9 in MSNet::simulationStep(bool) /home/delphi/extraClangDebug/sumo/src/microsim/MSNet.cpp:730:27
>     #6 0x61336d433368 in MSNet::simulate(long long, long long) /home/delphi/extraClangDebug/sumo/src/microsim/MSNet.cpp:412:9
>     #7 0x61336d41f865 in main /home/delphi/extraClangDebug/sumo/src/sumo_main.cpp:100:30
>     #8 0x78809162a1c9 in __libc_start_call_main csu/../sysdeps/nptl/libc_start_call_main.h:58:16
>     #9 0x78809162a28a in __libc_start_main csu/../csu/libc-start.c:360:3
>     #10 0x61336d342444 in _start (/home/delphi/extraClangDebug/sumo/bin/sumoD+0x2483444) (BuildId: 2def77f78b0d3ed8747c35d0286147d2dede0b5f)
> 
> Direct leak of 608 byte(s) in 1 object(s) allocated from:
>     #0 0x61336d41b8b1 in operator new(unsigned long) (/home/delphi/extraClangDebug/sumo/bin/sumoD+0x255c8b1) (BuildId: 2def77f78b0d3ed8747c35d0286147d2dede0b5f)
>     #1 0x61336e31e00c in libsumo::Simulation::findIntermodalRoute(std::__cxx11::basic_string<char, std::char_traits<char>, std::allocator<char>> const&, std::__cxx11::basic_string<char, std::char_traits<char>, std::allocator<char>> const&, std::__cxx11::basic_string<char, std::char_traits<char>, std::allocator<char>> const&, double, int, double, double, double, double, double, std::__cxx11::basic_string<char, std::char_traits<char>, std::allocator<char>> const&, std::__cxx11::basic_string<char
, std::char_traits<char>, std::allocator<char>> const&, std::__cxx11::basic_string<char, std::char_traits<char>, std::allocator<char>> const&) /home/delphi/extraClangDebug/sumo/src/libsumo/Simulation.cpp:641:28
>     #2 0x61336e06dc07 in TraCIServerAPI_Simulation::processGet(TraCIServer&, tcpip::Storage&, tcpip::Storage&) /home/delphi/extraClangDebug/sumo/src/traci-server/TraCIServerAPI_Simulation.cpp:279:66
>     #3 0x61336df82a1c in TraCIServer::dispatchCommand() /home/delphi/extraClangDebug/sumo/src/traci-server/TraCIServer.cpp:764:19
>     #4 0x61336df8d48f in TraCIServer::processCommands(long long, bool) /home/delphi/extraClangDebug/sumo/src/traci-server/TraCIServer.cpp:656:41
>     #5 0x61336d4348e9 in MSNet::simulationStep(bool) /home/delphi/extraClangDebug/sumo/src/microsim/MSNet.cpp:730:27
>     #6 0x61336d433368 in MSNet::simulate(long long, long long) /home/delphi/extraClangDebug/sumo/src/microsim/MSNet.cpp:412:9
>     #7 0x61336d41f865 in main /home/delphi/extraClangDebug/sumo/src/sumo_main.cpp:100:30
>     #8 0x78809162a1c9 in __libc_start_call_main csu/../sysdeps/nptl/libc_start_call_main.h:58:16
<truncated after showing first 30 lines>

TEST FAILED on ts-sim-build-ba : traci trafficlight constraints addConstraint ( Last six runs Oct2024 )

---------- Differences in errors ----------
0a1,200
>   warnings.warn("Could not import libsumo, falling back to pure python traci (%s)." % e)
> /home/delphi/extraClangDebug/sumo/src/utils/common/SUMOTime.cpp:75:15: runtime error: negation of -9223372036854775808 cannot be represented in type 'long long'; cast to an unsigned type to negate this value to itself
> SUMMARY: UndefinedBehaviorSanitizer: undefined-behavior /home/delphi/extraClangDebug/sumo/src/utils/common/SUMOTime.cpp:75:15 
> 
> =================================================================
> ==4136523==ERROR: LeakSanitizer: detected memory leaks
> 
> Indirect leak of 1584 byte(s) in 2 object(s) allocated from:
>     #0 0x65397d2b48b1 in operator new(unsigned long) (/home/delphi/extraClangDebug/sumo/bin/sumoD+0x255c8b1) (BuildId: 2def77f78b0d3ed8747c35d0286147d2dede0b5f)
>     #1 0x65397f49f6ce in MSDriveWay::buildDriveWay(std::__cxx11::basic_string<char, std::char_traits<char>, std::allocator<char>> const&, MSLink const*, __gnu_cxx::__normal_iterator<MSEdge const* const*, std::vector<MSEdge const*, std::allocator<MSEdge const*>>>, __gnu_cxx::__normal_iterator<MSEdge const* const*, std::vector<MSEdge const*, std::allocator<MSEdge const*>>>) /home/delphi/extraClangDebug/sumo/src/microsim/traffic_lights/MSDriveWay.cpp:1196:22
>     #2 0x65397f4bab7c in MSDriveWay::getDepartureDriveway(SUMOVehicle const*) /home/delphi/extraClangDebug/sumo/src/microsim/traffic_lights/MSDriveWay.cpp:1865:22
>     #3 0x65397f3e8b3b in MSRailSignal::initDriveWays(SUMOVehicle const*, bool) /home/delphi/extraClangDebug/sumo/src/microsim/traffic_lights/MSRailSignal.cpp:374:48
>     #4 0x65397f430bbf in MSRailSignalControl::vehicleStateChanged(SUMOVehicle const*, MSNet::VehicleState, std::__cxx11::basic_string<char, std::char_traits<char>, std::allocator<char>> const&) /home/delphi/extraClangDebug/sumo/src/microsim/traffic_lights/MSRailSignalControl.cpp:87:17
>     #5 0x65397d311a64 in MSNet::informVehicleStateListener(SUMOVehicle const*, MSNet::VehicleState, std::__cxx11::basic_string<char, std::char_traits<char>, std::allocator<char>> const&) /home/delphi/extraClangDebug/sumo/src/microsim/MSNet.cpp:1277:19
>     #6 0x65397d9895b5 in MSBaseVehicle::replaceRoute(std::shared_ptr<MSRoute const>, std::__cxx11::basic_string<char, std::char_traits<char>, std::allocator<char>> const&, bool, int, bool, bool, std::__cxx11::basic_string<char, std::char_traits<char>, std::allocator<char>>*) /home/delphi/extraClangDebug/sumo/src/microsim/MSBaseVehicle.cpp:543:27
>     #7 0x65397d6ba3b0 in MSVehicle::replaceRoute(std::shared_ptr<MSRoute const>, std::__cxx11::basic_string<char, std::char_traits<char>, std::allocator<char>> const&, bool, int, bool, bool, std::__cxx11::basic_string<char, std::char_traits<char>, std::allocator<char>>*) /home/delphi/extraClangDebug/sumo/src/microsim/MSVehicle.cpp:1121:24
>     #8 0x65397d981395 in MSBaseVehicle::replaceRouteEdges(std::vector<MSEdge const*, std::allocator<MSEdge const*>>&, double, double, std::__cxx11::basic_string<char, std::char_traits<char>, std::allocator<char>> const&, bool, bool, bool, std::__cxx11::basic_string<char, std::char_traits<char>, std::allocator<char>>*) /home/delphi/extraClangDebug/sumo/src/microsim/MSBaseVehicle.cpp:479:10
>     #9 0x65397d97ba96 in MSBaseVehicle::reroute(long long, std::__cxx11::basic_string<char, std::char_traits<char>, std::allocator<char>> const&, SUMOAbstractRouter<MSEdge, SUMOVehicle>&, bool, bool, bool, MSEdge const*) /home/delphi/extraClangDebug/sumo/src/microsim/MSBaseVehicle.cpp:404:5
>     #10 0x65397ebe2401 in MSRoutingEngine::reroute(SUMOVehicle&, long long, std::__cxx11::basic_string<char, std::char_traits<char>, std::allocator<char>> const&, bool, bool, std::vector<MSEdge*, std::allocator<MSEdge*>> const&) /home/delphi/extraClangDebug/sumo/src/microsim/devices/MSRoutingEngine.cpp:464:17
>     #11 0x65397e9b6979 in MSDevice_Routing::reroute(long long, bool) /home/delphi/extraClangDebug/sumo/src/microsim/devices/MSDevice_Routing.cpp:298:5
>     #12 0x65397e9b2370 in MSDevice_Routing::preInsertionReroute(long long) /home/delphi/extraClangDebug/sumo/src/microsim/devices/MSDevice_Routing.cpp:263:13
>     #13 0x65397e9bbc18 in WrappingCommand<MSDevice_Routing>::execute(long long) /home/delphi/extraClangDebug/sumo/src/utils/common/WrappingCommand.h:104:16
>     #14 0x65397db231ad in MSEventControl::execute(long long) /home/delphi/extraClangDebug/sumo/src/microsim/MSEventControl.cpp:69:33
>     #15 0x65397d2d2300 in MSNet::simulationStep(bool) /home/delphi/extraClangDebug/sumo/src/microsim/MSNet.cpp:824:24
>     #16 0x65397d2cc368 in MSNet::simulate(long long, long long) /home/delphi/extraClangDebug/sumo/src/microsim/MSNet.cpp:412:9
>     #17 0x65397d2b8865 in main /home/delphi/extraClangDebug/sumo/src/sumo_main.cpp:100:30
>     #18 0x7357c422a1c9 in __libc_start_call_main csu/../sysdeps/nptl/libc_start_call_main.h:58:16
>     #19 0x7357c422a28a in __libc_start_main csu/../csu/libc-start.c:360:3
>     #20 0x65397d1db444 in _start (/home/delphi/extraClangDebug/sumo/bin/sumoD+0x2483444) (BuildId: 2def77f78b0d3ed8747c35d0286147d2dede0b5f)
<truncated after showing first 30 lines>

TEST FAILED on ts-sim-build-ba : traci trafficlight constraints getConstraints ( Last six runs Oct2024 )

---------- Differences in errors ----------
0a1,200
>   warnings.warn("Could not import libsumo, falling back to pure python traci (%s)." % e)
> /home/delphi/extraClangDebug/sumo/src/utils/common/SUMOTime.cpp:75:15: runtime error: negation of -9223372036854775808 cannot be represented in type 'long long'; cast to an unsigned type to negate this value to itself
> SUMMARY: UndefinedBehaviorSanitizer: undefined-behavior /home/delphi/extraClangDebug/sumo/src/utils/common/SUMOTime.cpp:75:15 
> 
> =================================================================
> ==4136399==ERROR: LeakSanitizer: detected memory leaks
> 
> Indirect leak of 1584 byte(s) in 2 object(s) allocated from:
>     #0 0x617cde5048b1 in operator new(unsigned long) (/home/delphi/extraClangDebug/sumo/bin/sumoD+0x255c8b1) (BuildId: 2def77f78b0d3ed8747c35d0286147d2dede0b5f)
>     #1 0x617ce06ef6ce in MSDriveWay::buildDriveWay(std::__cxx11::basic_string<char, std::char_traits<char>, std::allocator<char>> const&, MSLink const*, __gnu_cxx::__normal_iterator<MSEdge const* const*, std::vector<MSEdge const*, std::allocator<MSEdge const*>>>, __gnu_cxx::__normal_iterator<MSEdge const* const*, std::vector<MSEdge const*, std::allocator<MSEdge const*>>>) /home/delphi/extraClangDebug/sumo/src/microsim/traffic_lights/MSDriveWay.cpp:1196:22
>     #2 0x617ce070ab7c in MSDriveWay::getDepartureDriveway(SUMOVehicle const*) /home/delphi/extraClangDebug/sumo/src/microsim/traffic_lights/MSDriveWay.cpp:1865:22
>     #3 0x617ce0638b3b in MSRailSignal::initDriveWays(SUMOVehicle const*, bool) /home/delphi/extraClangDebug/sumo/src/microsim/traffic_lights/MSRailSignal.cpp:374:48
>     #4 0x617ce0680bbf in MSRailSignalControl::vehicleStateChanged(SUMOVehicle const*, MSNet::VehicleState, std::__cxx11::basic_string<char, std::char_traits<char>, std::allocator<char>> const&) /home/delphi/extraClangDebug/sumo/src/microsim/traffic_lights/MSRailSignalControl.cpp:87:17
>     #5 0x617cde561a64 in MSNet::informVehicleStateListener(SUMOVehicle const*, MSNet::VehicleState, std::__cxx11::basic_string<char, std::char_traits<char>, std::allocator<char>> const&) /home/delphi/extraClangDebug/sumo/src/microsim/MSNet.cpp:1277:19
>     #6 0x617cdebd95b5 in MSBaseVehicle::replaceRoute(std::shared_ptr<MSRoute const>, std::__cxx11::basic_string<char, std::char_traits<char>, std::allocator<char>> const&, bool, int, bool, bool, std::__cxx11::basic_string<char, std::char_traits<char>, std::allocator<char>>*) /home/delphi/extraClangDebug/sumo/src/microsim/MSBaseVehicle.cpp:543:27
>     #7 0x617cde90a3b0 in MSVehicle::replaceRoute(std::shared_ptr<MSRoute const>, std::__cxx11::basic_string<char, std::char_traits<char>, std::allocator<char>> const&, bool, int, bool, bool, std::__cxx11::basic_string<char, std::char_traits<char>, std::allocator<char>>*) /home/delphi/extraClangDebug/sumo/src/microsim/MSVehicle.cpp:1121:24
>     #8 0x617cdebd1395 in MSBaseVehicle::replaceRouteEdges(std::vector<MSEdge const*, std::allocator<MSEdge const*>>&, double, double, std::__cxx11::basic_string<char, std::char_traits<char>, std::allocator<char>> const&, bool, bool, bool, std::__cxx11::basic_string<char, std::char_traits<char>, std::allocator<char>>*) /home/delphi/extraClangDebug/sumo/src/microsim/MSBaseVehicle.cpp:479:10
>     #9 0x617cdebcba96 in MSBaseVehicle::reroute(long long, std::__cxx11::basic_string<char, std::char_traits<char>, std::allocator<char>> const&, SUMOAbstractRouter<MSEdge, SUMOVehicle>&, bool, bool, bool, MSEdge const*) /home/delphi/extraClangDebug/sumo/src/microsim/MSBaseVehicle.cpp:404:5
>     #10 0x617cdfe32401 in MSRoutingEngine::reroute(SUMOVehicle&, long long, std::__cxx11::basic_string<char, std::char_traits<char>, std::allocator<char>> const&, bool, bool, std::vector<MSEdge*, std::allocator<MSEdge*>> const&) /home/delphi/extraClangDebug/sumo/src/microsim/devices/MSRoutingEngine.cpp:464:17
>     #11 0x617cdfc06979 in MSDevice_Routing::reroute(long long, bool) /home/delphi/extraClangDebug/sumo/src/microsim/devices/MSDevice_Routing.cpp:298:5
>     #12 0x617cdfc02370 in MSDevice_Routing::preInsertionReroute(long long) /home/delphi/extraClangDebug/sumo/src/microsim/devices/MSDevice_Routing.cpp:263:13
>     #13 0x617cdfc0bc18 in WrappingCommand<MSDevice_Routing>::execute(long long) /home/delphi/extraClangDebug/sumo/src/utils/common/WrappingCommand.h:104:16
>     #14 0x617cded731ad in MSEventControl::execute(long long) /home/delphi/extraClangDebug/sumo/src/microsim/MSEventControl.cpp:69:33
>     #15 0x617cde522300 in MSNet::simulationStep(bool) /home/delphi/extraClangDebug/sumo/src/microsim/MSNet.cpp:824:24
>     #16 0x617cde51c368 in MSNet::simulate(long long, long long) /home/delphi/extraClangDebug/sumo/src/microsim/MSNet.cpp:412:9
>     #17 0x617cde508865 in main /home/delphi/extraClangDebug/sumo/src/sumo_main.cpp:100:30
>     #18 0x740251e2a1c9 in __libc_start_call_main csu/../sysdeps/nptl/libc_start_call_main.h:58:16
>     #19 0x740251e2a28a in __libc_start_main csu/../csu/libc-start.c:360:3
>     #20 0x617cde42b444 in _start (/home/delphi/extraClangDebug/sumo/bin/sumoD+0x2483444) (BuildId: 2def77f78b0d3ed8747c35d0286147d2dede0b5f)
<truncated after showing first 30 lines>

TEST FAILED on ts-sim-build-ba : traci trafficlight constraints swap 1 ( Last six runs Oct2024 )

---------- Differences in errors ----------
0a1,174
>   warnings.warn("Could not import libsumo, falling back to pure python traci (%s)." % e)
> /home/delphi/extraClangDebug/sumo/src/utils/common/SUMOTime.cpp:75:15: runtime error: negation of -9223372036854775808 cannot be represented in type 'long long'; cast to an unsigned type to negate this value to itself
> SUMMARY: UndefinedBehaviorSanitizer: undefined-behavior /home/delphi/extraClangDebug/sumo/src/utils/common/SUMOTime.cpp:75:15 
> 
> =================================================================
> ==4136543==ERROR: LeakSanitizer: detected memory leaks
> 
> Indirect leak of 2376 byte(s) in 3 object(s) allocated from:
>     #0 0x55ca9136c8b1 in operator new(unsigned long) (/home/delphi/extraClangDebug/sumo/bin/sumoD+0x255c8b1) (BuildId: 2def77f78b0d3ed8747c35d0286147d2dede0b5f)
>     #1 0x55ca935576ce in MSDriveWay::buildDriveWay(std::__cxx11::basic_string<char, std::char_traits<char>, std::allocator<char>> const&, MSLink const*, __gnu_cxx::__normal_iterator<MSEdge const* const*, std::vector<MSEdge const*, std::allocator<MSEdge const*>>>, __gnu_cxx::__normal_iterator<MSEdge const* const*, std::vector<MSEdge const*, std::allocator<MSEdge const*>>>) /home/delphi/extraClangDebug/sumo/src/microsim/traffic_lights/MSDriveWay.cpp:1196:22
>     #2 0x55ca93572b7c in MSDriveWay::getDepartureDriveway(SUMOVehicle const*) /home/delphi/extraClangDebug/sumo/src/microsim/traffic_lights/MSDriveWay.cpp:1865:22
>     #3 0x55ca934a0b3b in MSRailSignal::initDriveWays(SUMOVehicle const*, bool) /home/delphi/extraClangDebug/sumo/src/microsim/traffic_lights/MSRailSignal.cpp:374:48
>     #4 0x55ca934e8bbf in MSRailSignalControl::vehicleStateChanged(SUMOVehicle const*, MSNet::VehicleState, std::__cxx11::basic_string<char, std::char_traits<char>, std::allocator<char>> const&) /home/delphi/extraClangDebug/sumo/src/microsim/traffic_lights/MSRailSignalControl.cpp:87:17
>     #5 0x55ca913c9a64 in MSNet::informVehicleStateListener(SUMOVehicle const*, MSNet::VehicleState, std::__cxx11::basic_string<char, std::char_traits<char>, std::allocator<char>> const&) /home/delphi/extraClangDebug/sumo/src/microsim/MSNet.cpp:1277:19
>     #6 0x55ca91a415b5 in MSBaseVehicle::replaceRoute(std::shared_ptr<MSRoute const>, std::__cxx11::basic_string<char, std::char_traits<char>, std::allocator<char>> const&, bool, int, bool, bool, std::__cxx11::basic_string<char, std::char_traits<char>, std::allocator<char>>*) /home/delphi/extraClangDebug/sumo/src/microsim/MSBaseVehicle.cpp:543:27
>     #7 0x55ca917723b0 in MSVehicle::replaceRoute(std::shared_ptr<MSRoute const>, std::__cxx11::basic_string<char, std::char_traits<char>, std::allocator<char>> const&, bool, int, bool, bool, std::__cxx11::basic_string<char, std::char_traits<char>, std::allocator<char>>*) /home/delphi/extraClangDebug/sumo/src/microsim/MSVehicle.cpp:1121:24
>     #8 0x55ca91a39395 in MSBaseVehicle::replaceRouteEdges(std::vector<MSEdge const*, std::allocator<MSEdge const*>>&, double, double, std::__cxx11::basic_string<char, std::char_traits<char>, std::allocator<char>> const&, bool, bool, bool, std::__cxx11::basic_string<char, std::char_traits<char>, std::allocator<char>>*) /home/delphi/extraClangDebug/sumo/src/microsim/MSBaseVehicle.cpp:479:10
>     #9 0x55ca91a33a96 in MSBaseVehicle::reroute(long long, std::__cxx11::basic_string<char, std::char_traits<char>, std::allocator<char>> const&, SUMOAbstractRouter<MSEdge, SUMOVehicle>&, bool, bool, bool, MSEdge const*) /home/delphi/extraClangDebug/sumo/src/microsim/MSBaseVehicle.cpp:404:5
>     #10 0x55ca92c9a401 in MSRoutingEngine::reroute(SUMOVehicle&, long long, std::__cxx11::basic_string<char, std::char_traits<char>, std::allocator<char>> const&, bool, bool, std::vector<MSEdge*, std::allocator<MSEdge*>> const&) /home/delphi/extraClangDebug/sumo/src/microsim/devices/MSRoutingEngine.cpp:464:17
>     #11 0x55ca92a6e979 in MSDevice_Routing::reroute(long long, bool) /home/delphi/extraClangDebug/sumo/src/microsim/devices/MSDevice_Routing.cpp:298:5
>     #12 0x55ca92a6a370 in MSDevice_Routing::preInsertionReroute(long long) /home/delphi/extraClangDebug/sumo/src/microsim/devices/MSDevice_Routing.cpp:263:13
>     #13 0x55ca92a73c18 in WrappingCommand<MSDevice_Routing>::execute(long long) /home/delphi/extraClangDebug/sumo/src/utils/common/WrappingCommand.h:104:16
>     #14 0x55ca91bdb1ad in MSEventControl::execute(long long) /home/delphi/extraClangDebug/sumo/src/microsim/MSEventControl.cpp:69:33
>     #15 0x55ca9138a300 in MSNet::simulationStep(bool) /home/delphi/extraClangDebug/sumo/src/microsim/MSNet.cpp:824:24
>     #16 0x55ca91384368 in MSNet::simulate(long long, long long) /home/delphi/extraClangDebug/sumo/src/microsim/MSNet.cpp:412:9
>     #17 0x55ca91370865 in main /home/delphi/extraClangDebug/sumo/src/sumo_main.cpp:100:30
>     #18 0x7bde6b82a1c9 in __libc_start_call_main csu/../sysdeps/nptl/libc_start_call_main.h:58:16
>     #19 0x7bde6b82a28a in __libc_start_main csu/../csu/libc-start.c:360:3
>     #20 0x55ca91293444 in _start (/home/delphi/extraClangDebug/sumo/bin/sumoD+0x2483444) (BuildId: 2def77f78b0d3ed8747c35d0286147d2dede0b5f)
<truncated after showing first 30 lines>

TEST FAILED on ts-sim-build-ba : traci trafficlight constraints swap 2 ( Last six runs Oct2024 )

---------- Differences in errors ----------
0a1,3
>   warnings.warn("Could not import libsumo, falling back to pure python traci (%s)." % e)
> /home/delphi/extraClangDebug/sumo/src/utils/common/SUMOTime.cpp:75:15: runtime error: negation of -9223372036854775808 cannot be represented in type 'long long'; cast to an unsigned type to negate this value to itself
> SUMMARY: UndefinedBehaviorSanitizer: undefined-behavior /home/delphi/extraClangDebug/sumo/src/utils/common/SUMOTime.cpp:75:15 
1a5,175
> 
> =================================================================
> ==4136546==ERROR: LeakSanitizer: detected memory leaks
> 
> Indirect leak of 2376 byte(s) in 3 object(s) allocated from:
>     #0 0x5f9cc38ae8b1 in operator new(unsigned long) (/home/delphi/extraClangDebug/sumo/bin/sumoD+0x255c8b1) (BuildId: 2def77f78b0d3ed8747c35d0286147d2dede0b5f)
>     #1 0x5f9cc5a996ce in MSDriveWay::buildDriveWay(std::__cxx11::basic_string<char, std::char_traits<char>, std::allocator<char>> const&, MSLink const*, __gnu_cxx::__normal_iterator<MSEdge const* const*, std::vector<MSEdge const*, std::allocator<MSEdge const*>>>, __gnu_cxx::__normal_iterator<MSEdge const* const*, std::vector<MSEdge const*, std::allocator<MSEdge const*>>>) /home/delphi/extraClangDebug/sumo/src/microsim/traffic_lights/MSDriveWay.cpp:1196:22
>     #2 0x5f9cc5ab4b7c in MSDriveWay::getDepartureDriveway(SUMOVehicle const*) /home/delphi/extraClangDebug/sumo/src/microsim/traffic_lights/MSDriveWay.cpp:1865:22
>     #3 0x5f9cc59e2b3b in MSRailSignal::initDriveWays(SUMOVehicle const*, bool) /home/delphi/extraClangDebug/sumo/src/microsim/traffic_lights/MSRailSignal.cpp:374:48
>     #4 0x5f9cc5a2abbf in MSRailSignalControl::vehicleStateChanged(SUMOVehicle const*, MSNet::VehicleState, std::__cxx11::basic_string<char, std::char_traits<char>, std::allocator<char>> const&) /home/delphi/extraClangDebug/sumo/src/microsim/traffic_lights/MSRailSignalControl.cpp:87:17
>     #5 0x5f9cc390ba64 in MSNet::informVehicleStateListener(SUMOVehicle const*, MSNet::VehicleState, std::__cxx11::basic_string<char, std::char_traits<char>, std::allocator<char>> const&) /home/delphi/extraClangDebug/sumo/src/microsim/MSNet.cpp:1277:19
>     #6 0x5f9cc3f835b5 in MSBaseVehicle::replaceRoute(std::shared_ptr<MSRoute const>, std::__cxx11::basic_string<char, std::char_traits<char>, std::allocator<char>> const&, bool, int, bool, bool, std::__cxx11::basic_string<char, std::char_traits<char>, std::allocator<char>>*) /home/delphi/extraClangDebug/sumo/src/microsim/MSBaseVehicle.cpp:543:27
>     #7 0x5f9cc3cb43b0 in MSVehicle::replaceRoute(std::shared_ptr<MSRoute const>, std::__cxx11::basic_string<char, std::char_traits<char>, std::allocator<char>> const&, bool, int, bool, bool, std::__cxx11::basic_string<char, std::char_traits<char>, std::allocator<char>>*) /home/delphi/extraClangDebug/sumo/src/microsim/MSVehicle.cpp:1121:24
>     #8 0x5f9cc3f7b395 in MSBaseVehicle::replaceRouteEdges(std::vector<MSEdge const*, std::allocator<MSEdge const*>>&, double, double, std::__cxx11::basic_string<char, std::char_traits<char>, std::allocator<char>> const&, bool, bool, bool, std::__cxx11::basic_string<char, std::char_traits<char>, std::allocator<char>>*) /home/delphi/extraClangDebug/sumo/src/microsim/MSBaseVehicle.cpp:479:10
>     #9 0x5f9cc3f75a96 in MSBaseVehicle::reroute(long long, std::__cxx11::basic_string<char, std::char_traits<char>, std::allocator<char>> const&, SUMOAbstractRouter<MSEdge, SUMOVehicle>&, bool, bool, bool, MSEdge const*) /home/delphi/extraClangDebug/sumo/src/microsim/MSBaseVehicle.cpp:404:5
>     #10 0x5f9cc51dc401 in MSRoutingEngine::reroute(SUMOVehicle&, long long, std::__cxx11::basic_string<char, std::char_traits<char>, std::allocator<char>> const&, bool, bool, std::vector<MSEdge*, std::allocator<MSEdge*>> const&) /home/delphi/extraClangDebug/sumo/src/microsim/devices/MSRoutingEngine.cpp:464:17
>     #11 0x5f9cc4fb0979 in MSDevice_Routing::reroute(long long, bool) /home/delphi/extraClangDebug/sumo/src/microsim/devices/MSDevice_Routing.cpp:298:5
>     #12 0x5f9cc4fac370 in MSDevice_Routing::preInsertionReroute(long long) /home/delphi/extraClangDebug/sumo/src/microsim/devices/MSDevice_Routing.cpp:263:13
>     #13 0x5f9cc4fb5c18 in WrappingCommand<MSDevice_Routing>::execute(long long) /home/delphi/extraClangDebug/sumo/src/utils/common/WrappingCommand.h:104:16
>     #14 0x5f9cc411d1ad in MSEventControl::execute(long long) /home/delphi/extraClangDebug/sumo/src/microsim/MSEventControl.cpp:69:33
>     #15 0x5f9cc38cc300 in MSNet::simulationStep(bool) /home/delphi/extraClangDebug/sumo/src/microsim/MSNet.cpp:824:24
>     #16 0x5f9cc38c6368 in MSNet::simulate(long long, long long) /home/delphi/extraClangDebug/sumo/src/microsim/MSNet.cpp:412:9
>     #17 0x5f9cc38b2865 in main /home/delphi/extraClangDebug/sumo/src/sumo_main.cpp:100:30
>     #18 0x7ba76542a1c9 in __libc_start_call_main csu/../sysdeps/nptl/libc_start_call_main.h:58:16
>     #19 0x7ba76542a28a in __libc_start_main csu/../csu/libc-start.c:360:3
<truncated after showing first 30 lines>

TEST FAILED on ts-sim-build-ba : traci trafficlight constraints swap 2_swapLater ( Last six runs Oct2024 )

---------- Differences in errors ----------
0a1,174
>   warnings.warn("Could not import libsumo, falling back to pure python traci (%s)." % e)
> /home/delphi/extraClangDebug/sumo/src/utils/common/SUMOTime.cpp:75:15: runtime error: negation of -9223372036854775808 cannot be represented in type 'long long'; cast to an unsigned type to negate this value to itself
> SUMMARY: UndefinedBehaviorSanitizer: undefined-behavior /home/delphi/extraClangDebug/sumo/src/utils/common/SUMOTime.cpp:75:15 
> 
> =================================================================
> ==4136563==ERROR: LeakSanitizer: detected memory leaks
> 
> Indirect leak of 2376 byte(s) in 3 object(s) allocated from:
>     #0 0x5a00704e68b1 in operator new(unsigned long) (/home/delphi/extraClangDebug/sumo/bin/sumoD+0x255c8b1) (BuildId: 2def77f78b0d3ed8747c35d0286147d2dede0b5f)
>     #1 0x5a00726d16ce in MSDriveWay::buildDriveWay(std::__cxx11::basic_string<char, std::char_traits<char>, std::allocator<char>> const&, MSLink const*, __gnu_cxx::__normal_iterator<MSEdge const* const*, std::vector<MSEdge const*, std::allocator<MSEdge const*>>>, __gnu_cxx::__normal_iterator<MSEdge const* const*, std::vector<MSEdge const*, std::allocator<MSEdge const*>>>) /home/delphi/extraClangDebug/sumo/src/microsim/traffic_lights/MSDriveWay.cpp:1196:22
>     #2 0x5a00726ecb7c in MSDriveWay::getDepartureDriveway(SUMOVehicle const*) /home/delphi/extraClangDebug/sumo/src/microsim/traffic_lights/MSDriveWay.cpp:1865:22
>     #3 0x5a007261ab3b in MSRailSignal::initDriveWays(SUMOVehicle const*, bool) /home/delphi/extraClangDebug/sumo/src/microsim/traffic_lights/MSRailSignal.cpp:374:48
>     #4 0x5a0072662bbf in MSRailSignalControl::vehicleStateChanged(SUMOVehicle const*, MSNet::VehicleState, std::__cxx11::basic_string<char, std::char_traits<char>, std::allocator<char>> const&) /home/delphi/extraClangDebug/sumo/src/microsim/traffic_lights/MSRailSignalControl.cpp:87:17
>     #5 0x5a0070543a64 in MSNet::informVehicleStateListener(SUMOVehicle const*, MSNet::VehicleState, std::__cxx11::basic_string<char, std::char_traits<char>, std::allocator<char>> const&) /home/delphi/extraClangDebug/sumo/src/microsim/MSNet.cpp:1277:19
>     #6 0x5a0070bbb5b5 in MSBaseVehicle::replaceRoute(std::shared_ptr<MSRoute const>, std::__cxx11::basic_string<char, std::char_traits<char>, std::allocator<char>> const&, bool, int, bool, bool, std::__cxx11::basic_string<char, std::char_traits<char>, std::allocator<char>>*) /home/delphi/extraClangDebug/sumo/src/microsim/MSBaseVehicle.cpp:543:27
>     #7 0x5a00708ec3b0 in MSVehicle::replaceRoute(std::shared_ptr<MSRoute const>, std::__cxx11::basic_string<char, std::char_traits<char>, std::allocator<char>> const&, bool, int, bool, bool, std::__cxx11::basic_string<char, std::char_traits<char>, std::allocator<char>>*) /home/delphi/extraClangDebug/sumo/src/microsim/MSVehicle.cpp:1121:24
>     #8 0x5a0070bb3395 in MSBaseVehicle::replaceRouteEdges(std::vector<MSEdge const*, std::allocator<MSEdge const*>>&, double, double, std::__cxx11::basic_string<char, std::char_traits<char>, std::allocator<char>> const&, bool, bool, bool, std::__cxx11::basic_string<char, std::char_traits<char>, std::allocator<char>>*) /home/delphi/extraClangDebug/sumo/src/microsim/MSBaseVehicle.cpp:479:10
>     #9 0x5a0070bada96 in MSBaseVehicle::reroute(long long, std::__cxx11::basic_string<char, std::char_traits<char>, std::allocator<char>> const&, SUMOAbstractRouter<MSEdge, SUMOVehicle>&, bool, bool, bool, MSEdge const*) /home/delphi/extraClangDebug/sumo/src/microsim/MSBaseVehicle.cpp:404:5
>     #10 0x5a0071e14401 in MSRoutingEngine::reroute(SUMOVehicle&, long long, std::__cxx11::basic_string<char, std::char_traits<char>, std::allocator<char>> const&, bool, bool, std::vector<MSEdge*, std::allocator<MSEdge*>> const&) /home/delphi/extraClangDebug/sumo/src/microsim/devices/MSRoutingEngine.cpp:464:17
>     #11 0x5a0071be8979 in MSDevice_Routing::reroute(long long, bool) /home/delphi/extraClangDebug/sumo/src/microsim/devices/MSDevice_Routing.cpp:298:5
>     #12 0x5a0071be4370 in MSDevice_Routing::preInsertionReroute(long long) /home/delphi/extraClangDebug/sumo/src/microsim/devices/MSDevice_Routing.cpp:263:13
>     #13 0x5a0071bedc18 in WrappingCommand<MSDevice_Routing>::execute(long long) /home/delphi/extraClangDebug/sumo/src/utils/common/WrappingCommand.h:104:16
>     #14 0x5a0070d551ad in MSEventControl::execute(long long) /home/delphi/extraClangDebug/sumo/src/microsim/MSEventControl.cpp:69:33
>     #15 0x5a0070504300 in MSNet::simulationStep(bool) /home/delphi/extraClangDebug/sumo/src/microsim/MSNet.cpp:824:24
>     #16 0x5a00704fe368 in MSNet::simulate(long long, long long) /home/delphi/extraClangDebug/sumo/src/microsim/MSNet.cpp:412:9
>     #17 0x5a00704ea865 in main /home/delphi/extraClangDebug/sumo/src/sumo_main.cpp:100:30
>     #18 0x75636c42a1c9 in __libc_start_call_main csu/../sysdeps/nptl/libc_start_call_main.h:58:16
>     #19 0x75636c42a28a in __libc_start_main csu/../csu/libc-start.c:360:3
>     #20 0x5a007040d444 in _start (/home/delphi/extraClangDebug/sumo/bin/sumoD+0x2483444) (BuildId: 2def77f78b0d3ed8747c35d0286147d2dede0b5f)
<truncated after showing first 30 lines>

TEST FAILED on ts-sim-build-ba : traci trafficlight constraints swap 3 ( Last six runs Oct2024 )

---------- Differences in errors ----------
0a1,3
>   warnings.warn("Could not import libsumo, falling back to pure python traci (%s)." % e)
> /home/delphi/extraClangDebug/sumo/src/utils/common/SUMOTime.cpp:75:15: runtime error: negation of -9223372036854775808 cannot be represented in type 'long long'; cast to an unsigned type to negate this value to itself
> SUMMARY: UndefinedBehaviorSanitizer: undefined-behavior /home/delphi/extraClangDebug/sumo/src/utils/common/SUMOTime.cpp:75:15 
1a5,175
> 
> =================================================================
> ==4136582==ERROR: LeakSanitizer: detected memory leaks
> 
> Indirect leak of 2376 byte(s) in 3 object(s) allocated from:
>     #0 0x5ad59813c8b1 in operator new(unsigned long) (/home/delphi/extraClangDebug/sumo/bin/sumoD+0x255c8b1) (BuildId: 2def77f78b0d3ed8747c35d0286147d2dede0b5f)
>     #1 0x5ad59a3276ce in MSDriveWay::buildDriveWay(std::__cxx11::basic_string<char, std::char_traits<char>, std::allocator<char>> const&, MSLink const*, __gnu_cxx::__normal_iterator<MSEdge const* const*, std::vector<MSEdge const*, std::allocator<MSEdge const*>>>, __gnu_cxx::__normal_iterator<MSEdge const* const*, std::vector<MSEdge const*, std::allocator<MSEdge const*>>>) /home/delphi/extraClangDebug/sumo/src/microsim/traffic_lights/MSDriveWay.cpp:1196:22
>     #2 0x5ad59a342b7c in MSDriveWay::getDepartureDriveway(SUMOVehicle const*) /home/delphi/extraClangDebug/sumo/src/microsim/traffic_lights/MSDriveWay.cpp:1865:22
>     #3 0x5ad59a270b3b in MSRailSignal::initDriveWays(SUMOVehicle const*, bool) /home/delphi/extraClangDebug/sumo/src/microsim/traffic_lights/MSRailSignal.cpp:374:48
>     #4 0x5ad59a2b8bbf in MSRailSignalControl::vehicleStateChanged(SUMOVehicle const*, MSNet::VehicleState, std::__cxx11::basic_string<char, std::char_traits<char>, std::allocator<char>> const&) /home/delphi/extraClangDebug/sumo/src/microsim/traffic_lights/MSRailSignalControl.cpp:87:17
>     #5 0x5ad598199a64 in MSNet::informVehicleStateListener(SUMOVehicle const*, MSNet::VehicleState, std::__cxx11::basic_string<char, std::char_traits<char>, std::allocator<char>> const&) /home/delphi/extraClangDebug/sumo/src/microsim/MSNet.cpp:1277:19
>     #6 0x5ad5988115b5 in MSBaseVehicle::replaceRoute(std::shared_ptr<MSRoute const>, std::__cxx11::basic_string<char, std::char_traits<char>, std::allocator<char>> const&, bool, int, bool, bool, std::__cxx11::basic_string<char, std::char_traits<char>, std::allocator<char>>*) /home/delphi/extraClangDebug/sumo/src/microsim/MSBaseVehicle.cpp:543:27
>     #7 0x5ad5985423b0 in MSVehicle::replaceRoute(std::shared_ptr<MSRoute const>, std::__cxx11::basic_string<char, std::char_traits<char>, std::allocator<char>> const&, bool, int, bool, bool, std::__cxx11::basic_string<char, std::char_traits<char>, std::allocator<char>>*) /home/delphi/extraClangDebug/sumo/src/microsim/MSVehicle.cpp:1121:24
>     #8 0x5ad598809395 in MSBaseVehicle::replaceRouteEdges(std::vector<MSEdge const*, std::allocator<MSEdge const*>>&, double, double, std::__cxx11::basic_string<char, std::char_traits<char>, std::allocator<char>> const&, bool, bool, bool, std::__cxx11::basic_string<char, std::char_traits<char>, std::allocator<char>>*) /home/delphi/extraClangDebug/sumo/src/microsim/MSBaseVehicle.cpp:479:10
>     #9 0x5ad598803a96 in MSBaseVehicle::reroute(long long, std::__cxx11::basic_string<char, std::char_traits<char>, std::allocator<char>> const&, SUMOAbstractRouter<MSEdge, SUMOVehicle>&, bool, bool, bool, MSEdge const*) /home/delphi/extraClangDebug/sumo/src/microsim/MSBaseVehicle.cpp:404:5
>     #10 0x5ad599a6a401 in MSRoutingEngine::reroute(SUMOVehicle&, long long, std::__cxx11::basic_string<char, std::char_traits<char>, std::allocator<char>> const&, bool, bool, std::vector<MSEdge*, std::allocator<MSEdge*>> const&) /home/delphi/extraClangDebug/sumo/src/microsim/devices/MSRoutingEngine.cpp:464:17
>     #11 0x5ad59983e979 in MSDevice_Routing::reroute(long long, bool) /home/delphi/extraClangDebug/sumo/src/microsim/devices/MSDevice_Routing.cpp:298:5
>     #12 0x5ad59983a370 in MSDevice_Routing::preInsertionReroute(long long) /home/delphi/extraClangDebug/sumo/src/microsim/devices/MSDevice_Routing.cpp:263:13
>     #13 0x5ad599843c18 in WrappingCommand<MSDevice_Routing>::execute(long long) /home/delphi/extraClangDebug/sumo/src/utils/common/WrappingCommand.h:104:16
>     #14 0x5ad5989ab1ad in MSEventControl::execute(long long) /home/delphi/extraClangDebug/sumo/src/microsim/MSEventControl.cpp:69:33
>     #15 0x5ad59815a300 in MSNet::simulationStep(bool) /home/delphi/extraClangDebug/sumo/src/microsim/MSNet.cpp:824:24
>     #16 0x5ad598154368 in MSNet::simulate(long long, long long) /home/delphi/extraClangDebug/sumo/src/microsim/MSNet.cpp:412:9
>     #17 0x5ad598140865 in main /home/delphi/extraClangDebug/sumo/src/sumo_main.cpp:100:30
>     #18 0x77b11b02a1c9 in __libc_start_call_main csu/../sysdeps/nptl/libc_start_call_main.h:58:16
>     #19 0x77b11b02a28a in __libc_start_main csu/../csu/libc-start.c:360:3
<truncated after showing first 30 lines>

TEST FAILED on ts-sim-build-ba : traci trafficlight constraints swap 4 ( Last six runs Oct2024 )

---------- Differences in errors ----------
0a1,3
>   warnings.warn("Could not import libsumo, falling back to pure python traci (%s)." % e)
> /home/delphi/extraClangDebug/sumo/src/utils/common/SUMOTime.cpp:75:15: runtime error: negation of -9223372036854775808 cannot be represented in type 'long long'; cast to an unsigned type to negate this value to itself
> SUMMARY: UndefinedBehaviorSanitizer: undefined-behavior /home/delphi/extraClangDebug/sumo/src/utils/common/SUMOTime.cpp:75:15 
4a8,178
> 
> =================================================================
> ==4136577==ERROR: LeakSanitizer: detected memory leaks
> 
> Indirect leak of 3168 byte(s) in 4 object(s) allocated from:
>     #0 0x64d2cff538b1 in operator new(unsigned long) (/home/delphi/extraClangDebug/sumo/bin/sumoD+0x255c8b1) (BuildId: 2def77f78b0d3ed8747c35d0286147d2dede0b5f)
>     #1 0x64d2d213e6ce in MSDriveWay::buildDriveWay(std::__cxx11::basic_string<char, std::char_traits<char>, std::allocator<char>> const&, MSLink const*, __gnu_cxx::__normal_iterator<MSEdge const* const*, std::vector<MSEdge const*, std::allocator<MSEdge const*>>>, __gnu_cxx::__normal_iterator<MSEdge const* const*, std::vector<MSEdge const*, std::allocator<MSEdge const*>>>) /home/delphi/extraClangDebug/sumo/src/microsim/traffic_lights/MSDriveWay.cpp:1196:22
>     #2 0x64d2d2159b7c in MSDriveWay::getDepartureDriveway(SUMOVehicle const*) /home/delphi/extraClangDebug/sumo/src/microsim/traffic_lights/MSDriveWay.cpp:1865:22
>     #3 0x64d2d2087b3b in MSRailSignal::initDriveWays(SUMOVehicle const*, bool) /home/delphi/extraClangDebug/sumo/src/microsim/traffic_lights/MSRailSignal.cpp:374:48
>     #4 0x64d2d20cfbbf in MSRailSignalControl::vehicleStateChanged(SUMOVehicle const*, MSNet::VehicleState, std::__cxx11::basic_string<char, std::char_traits<char>, std::allocator<char>> const&) /home/delphi/extraClangDebug/sumo/src/microsim/traffic_lights/MSRailSignalControl.cpp:87:17
>     #5 0x64d2cffb0a64 in MSNet::informVehicleStateListener(SUMOVehicle const*, MSNet::VehicleState, std::__cxx11::basic_string<char, std::char_traits<char>, std::allocator<char>> const&) /home/delphi/extraClangDebug/sumo/src/microsim/MSNet.cpp:1277:19
>     #6 0x64d2d06285b5 in MSBaseVehicle::replaceRoute(std::shared_ptr<MSRoute const>, std::__cxx11::basic_string<char, std::char_traits<char>, std::allocator<char>> const&, bool, int, bool, bool, std::__cxx11::basic_string<char, std::char_traits<char>, std::allocator<char>>*) /home/delphi/extraClangDebug/sumo/src/microsim/MSBaseVehicle.cpp:543:27
>     #7 0x64d2d03593b0 in MSVehicle::replaceRoute(std::shared_ptr<MSRoute const>, std::__cxx11::basic_string<char, std::char_traits<char>, std::allocator<char>> const&, bool, int, bool, bool, std::__cxx11::basic_string<char, std::char_traits<char>, std::allocator<char>>*) /home/delphi/extraClangDebug/sumo/src/microsim/MSVehicle.cpp:1121:24
>     #8 0x64d2d0620395 in MSBaseVehicle::replaceRouteEdges(std::vector<MSEdge const*, std::allocator<MSEdge const*>>&, double, double, std::__cxx11::basic_string<char, std::char_traits<char>, std::allocator<char>> const&, bool, bool, bool, std::__cxx11::basic_string<char, std::char_traits<char>, std::allocator<char>>*) /home/delphi/extraClangDebug/sumo/src/microsim/MSBaseVehicle.cpp:479:10
>     #9 0x64d2d061aa96 in MSBaseVehicle::reroute(long long, std::__cxx11::basic_string<char, std::char_traits<char>, std::allocator<char>> const&, SUMOAbstractRouter<MSEdge, SUMOVehicle>&, bool, bool, bool, MSEdge const*) /home/delphi/extraClangDebug/sumo/src/microsim/MSBaseVehicle.cpp:404:5
>     #10 0x64d2d1881401 in MSRoutingEngine::reroute(SUMOVehicle&, long long, std::__cxx11::basic_string<char, std::char_traits<char>, std::allocator<char>> const&, bool, bool, std::vector<MSEdge*, std::allocator<MSEdge*>> const&) /home/delphi/extraClangDebug/sumo/src/microsim/devices/MSRoutingEngine.cpp:464:17
>     #11 0x64d2d1655979 in MSDevice_Routing::reroute(long long, bool) /home/delphi/extraClangDebug/sumo/src/microsim/devices/MSDevice_Routing.cpp:298:5
>     #12 0x64d2d1651370 in MSDevice_Routing::preInsertionReroute(long long) /home/delphi/extraClangDebug/sumo/src/microsim/devices/MSDevice_Routing.cpp:263:13
>     #13 0x64d2d165ac18 in WrappingCommand<MSDevice_Routing>::execute(long long) /home/delphi/extraClangDebug/sumo/src/utils/common/WrappingCommand.h:104:16
>     #14 0x64d2d07c21ad in MSEventControl::execute(long long) /home/delphi/extraClangDebug/sumo/src/microsim/MSEventControl.cpp:69:33
>     #15 0x64d2cff71300 in MSNet::simulationStep(bool) /home/delphi/extraClangDebug/sumo/src/microsim/MSNet.cpp:824:24
>     #16 0x64d2cff6b368 in MSNet::simulate(long long, long long) /home/delphi/extraClangDebug/sumo/src/microsim/MSNet.cpp:412:9
>     #17 0x64d2cff57865 in main /home/delphi/extraClangDebug/sumo/src/sumo_main.cpp:100:30
>     #18 0x73143e02a1c9 in __libc_start_call_main csu/../sysdeps/nptl/libc_start_call_main.h:58:16
>     #19 0x73143e02a28a in __libc_start_main csu/../csu/libc-start.c:360:3
<truncated after showing first 30 lines>

TEST FAILED on ts-sim-build-ba : traci trafficlight constraints swap 4b ( Last six runs Oct2024 )

---------- Differences in errors ----------
0a1,3
>   warnings.warn("Could not import libsumo, falling back to pure python traci (%s)." % e)
> /home/delphi/extraClangDebug/sumo/src/utils/common/SUMOTime.cpp:75:15: runtime error: negation of -9223372036854775808 cannot be represented in type 'long long'; cast to an unsigned type to negate this value to itself
> SUMMARY: UndefinedBehaviorSanitizer: undefined-behavior /home/delphi/extraClangDebug/sumo/src/utils/common/SUMOTime.cpp:75:15 
2a6,176
> 
> =================================================================
> ==4136583==ERROR: LeakSanitizer: detected memory leaks
> 
> Indirect leak of 3168 byte(s) in 4 object(s) allocated from:
>     #0 0x57f93781d8b1 in operator new(unsigned long) (/home/delphi/extraClangDebug/sumo/bin/sumoD+0x255c8b1) (BuildId: 2def77f78b0d3ed8747c35d0286147d2dede0b5f)
>     #1 0x57f939a086ce in MSDriveWay::buildDriveWay(std::__cxx11::basic_string<char, std::char_traits<char>, std::allocator<char>> const&, MSLink const*, __gnu_cxx::__normal_iterator<MSEdge const* const*, std::vector<MSEdge const*, std::allocator<MSEdge const*>>>, __gnu_cxx::__normal_iterator<MSEdge const* const*, std::vector<MSEdge const*, std::allocator<MSEdge const*>>>) /home/delphi/extraClangDebug/sumo/src/microsim/traffic_lights/MSDriveWay.cpp:1196:22
>     #2 0x57f939a23b7c in MSDriveWay::getDepartureDriveway(SUMOVehicle const*) /home/delphi/extraClangDebug/sumo/src/microsim/traffic_lights/MSDriveWay.cpp:1865:22
>     #3 0x57f939951b3b in MSRailSignal::initDriveWays(SUMOVehicle const*, bool) /home/delphi/extraClangDebug/sumo/src/microsim/traffic_lights/MSRailSignal.cpp:374:48
>     #4 0x57f939999bbf in MSRailSignalControl::vehicleStateChanged(SUMOVehicle const*, MSNet::VehicleState, std::__cxx11::basic_string<char, std::char_traits<char>, std::allocator<char>> const&) /home/delphi/extraClangDebug/sumo/src/microsim/traffic_lights/MSRailSignalControl.cpp:87:17
>     #5 0x57f93787aa64 in MSNet::informVehicleStateListener(SUMOVehicle const*, MSNet::VehicleState, std::__cxx11::basic_string<char, std::char_traits<char>, std::allocator<char>> const&) /home/delphi/extraClangDebug/sumo/src/microsim/MSNet.cpp:1277:19
>     #6 0x57f937ef25b5 in MSBaseVehicle::replaceRoute(std::shared_ptr<MSRoute const>, std::__cxx11::basic_string<char, std::char_traits<char>, std::allocator<char>> const&, bool, int, bool, bool, std::__cxx11::basic_string<char, std::char_traits<char>, std::allocator<char>>*) /home/delphi/extraClangDebug/sumo/src/microsim/MSBaseVehicle.cpp:543:27
>     #7 0x57f937c233b0 in MSVehicle::replaceRoute(std::shared_ptr<MSRoute const>, std::__cxx11::basic_string<char, std::char_traits<char>, std::allocator<char>> const&, bool, int, bool, bool, std::__cxx11::basic_string<char, std::char_traits<char>, std::allocator<char>>*) /home/delphi/extraClangDebug/sumo/src/microsim/MSVehicle.cpp:1121:24
>     #8 0x57f937eea395 in MSBaseVehicle::replaceRouteEdges(std::vector<MSEdge const*, std::allocator<MSEdge const*>>&, double, double, std::__cxx11::basic_string<char, std::char_traits<char>, std::allocator<char>> const&, bool, bool, bool, std::__cxx11::basic_string<char, std::char_traits<char>, std::allocator<char>>*) /home/delphi/extraClangDebug/sumo/src/microsim/MSBaseVehicle.cpp:479:10
>     #9 0x57f937ee4a96 in MSBaseVehicle::reroute(long long, std::__cxx11::basic_string<char, std::char_traits<char>, std::allocator<char>> const&, SUMOAbstractRouter<MSEdge, SUMOVehicle>&, bool, bool, bool, MSEdge const*) /home/delphi/extraClangDebug/sumo/src/microsim/MSBaseVehicle.cpp:404:5
>     #10 0x57f93914b401 in MSRoutingEngine::reroute(SUMOVehicle&, long long, std::__cxx11::basic_string<char, std::char_traits<char>, std::allocator<char>> const&, bool, bool, std::vector<MSEdge*, std::allocator<MSEdge*>> const&) /home/delphi/extraClangDebug/sumo/src/microsim/devices/MSRoutingEngine.cpp:464:17
>     #11 0x57f938f1f979 in MSDevice_Routing::reroute(long long, bool) /home/delphi/extraClangDebug/sumo/src/microsim/devices/MSDevice_Routing.cpp:298:5
>     #12 0x57f938f1b370 in MSDevice_Routing::preInsertionReroute(long long) /home/delphi/extraClangDebug/sumo/src/microsim/devices/MSDevice_Routing.cpp:263:13
>     #13 0x57f938f24c18 in WrappingCommand<MSDevice_Routing>::execute(long long) /home/delphi/extraClangDebug/sumo/src/utils/common/WrappingCommand.h:104:16
>     #14 0x57f93808c1ad in MSEventControl::execute(long long) /home/delphi/extraClangDebug/sumo/src/microsim/MSEventControl.cpp:69:33
>     #15 0x57f93783b300 in MSNet::simulationStep(bool) /home/delphi/extraClangDebug/sumo/src/microsim/MSNet.cpp:824:24
>     #16 0x57f937835368 in MSNet::simulate(long long, long long) /home/delphi/extraClangDebug/sumo/src/microsim/MSNet.cpp:412:9
>     #17 0x57f937821865 in main /home/delphi/extraClangDebug/sumo/src/sumo_main.cpp:100:30
>     #18 0x77798402a1c9 in __libc_start_call_main csu/../sysdeps/nptl/libc_start_call_main.h:58:16
>     #19 0x77798402a28a in __libc_start_main csu/../csu/libc-start.c:360:3
<truncated after showing first 30 lines>

TEST FAILED on ts-sim-build-ba : traci trafficlight constraints swap 5 ( Last six runs Oct2024 )

---------- Differences in errors ----------
0a1,3
>   warnings.warn("Could not import libsumo, falling back to pure python traci (%s)." % e)
> /home/delphi/extraClangDebug/sumo/src/utils/common/SUMOTime.cpp:75:15: runtime error: negation of -9223372036854775808 cannot be represented in type 'long long'; cast to an unsigned type to negate this value to itself
> SUMMARY: UndefinedBehaviorSanitizer: undefined-behavior /home/delphi/extraClangDebug/sumo/src/utils/common/SUMOTime.cpp:75:15 
1a5,175
> 
> =================================================================
> ==4136584==ERROR: LeakSanitizer: detected memory leaks
> 
> Indirect leak of 2376 byte(s) in 3 object(s) allocated from:
>     #0 0x64d2f750f8b1 in operator new(unsigned long) (/home/delphi/extraClangDebug/sumo/bin/sumoD+0x255c8b1) (BuildId: 2def77f78b0d3ed8747c35d0286147d2dede0b5f)
>     #1 0x64d2f96fa6ce in MSDriveWay::buildDriveWay(std::__cxx11::basic_string<char, std::char_traits<char>, std::allocator<char>> const&, MSLink const*, __gnu_cxx::__normal_iterator<MSEdge const* const*, std::vector<MSEdge const*, std::allocator<MSEdge const*>>>, __gnu_cxx::__normal_iterator<MSEdge const* const*, std::vector<MSEdge const*, std::allocator<MSEdge const*>>>) /home/delphi/extraClangDebug/sumo/src/microsim/traffic_lights/MSDriveWay.cpp:1196:22
>     #2 0x64d2f9715b7c in MSDriveWay::getDepartureDriveway(SUMOVehicle const*) /home/delphi/extraClangDebug/sumo/src/microsim/traffic_lights/MSDriveWay.cpp:1865:22
>     #3 0x64d2f9643b3b in MSRailSignal::initDriveWays(SUMOVehicle const*, bool) /home/delphi/extraClangDebug/sumo/src/microsim/traffic_lights/MSRailSignal.cpp:374:48
>     #4 0x64d2f968bbbf in MSRailSignalControl::vehicleStateChanged(SUMOVehicle const*, MSNet::VehicleState, std::__cxx11::basic_string<char, std::char_traits<char>, std::allocator<char>> const&) /home/delphi/extraClangDebug/sumo/src/microsim/traffic_lights/MSRailSignalControl.cpp:87:17
>     #5 0x64d2f756ca64 in MSNet::informVehicleStateListener(SUMOVehicle const*, MSNet::VehicleState, std::__cxx11::basic_string<char, std::char_traits<char>, std::allocator<char>> const&) /home/delphi/extraClangDebug/sumo/src/microsim/MSNet.cpp:1277:19
>     #6 0x64d2f7be45b5 in MSBaseVehicle::replaceRoute(std::shared_ptr<MSRoute const>, std::__cxx11::basic_string<char, std::char_traits<char>, std::allocator<char>> const&, bool, int, bool, bool, std::__cxx11::basic_string<char, std::char_traits<char>, std::allocator<char>>*) /home/delphi/extraClangDebug/sumo/src/microsim/MSBaseVehicle.cpp:543:27
>     #7 0x64d2f79153b0 in MSVehicle::replaceRoute(std::shared_ptr<MSRoute const>, std::__cxx11::basic_string<char, std::char_traits<char>, std::allocator<char>> const&, bool, int, bool, bool, std::__cxx11::basic_string<char, std::char_traits<char>, std::allocator<char>>*) /home/delphi/extraClangDebug/sumo/src/microsim/MSVehicle.cpp:1121:24
>     #8 0x64d2f7bdc395 in MSBaseVehicle::replaceRouteEdges(std::vector<MSEdge const*, std::allocator<MSEdge const*>>&, double, double, std::__cxx11::basic_string<char, std::char_traits<char>, std::allocator<char>> const&, bool, bool, bool, std::__cxx11::basic_string<char, std::char_traits<char>, std::allocator<char>>*) /home/delphi/extraClangDebug/sumo/src/microsim/MSBaseVehicle.cpp:479:10
>     #9 0x64d2f7bd6a96 in MSBaseVehicle::reroute(long long, std::__cxx11::basic_string<char, std::char_traits<char>, std::allocator<char>> const&, SUMOAbstractRouter<MSEdge, SUMOVehicle>&, bool, bool, bool, MSEdge const*) /home/delphi/extraClangDebug/sumo/src/microsim/MSBaseVehicle.cpp:404:5
>     #10 0x64d2f8e3d401 in MSRoutingEngine::reroute(SUMOVehicle&, long long, std::__cxx11::basic_string<char, std::char_traits<char>, std::allocator<char>> const&, bool, bool, std::vector<MSEdge*, std::allocator<MSEdge*>> const&) /home/delphi/extraClangDebug/sumo/src/microsim/devices/MSRoutingEngine.cpp:464:17
>     #11 0x64d2f8c11979 in MSDevice_Routing::reroute(long long, bool) /home/delphi/extraClangDebug/sumo/src/microsim/devices/MSDevice_Routing.cpp:298:5
>     #12 0x64d2f8c0d370 in MSDevice_Routing::preInsertionReroute(long long) /home/delphi/extraClangDebug/sumo/src/microsim/devices/MSDevice_Routing.cpp:263:13
>     #13 0x64d2f8c16c18 in WrappingCommand<MSDevice_Routing>::execute(long long) /home/delphi/extraClangDebug/sumo/src/utils/common/WrappingCommand.h:104:16
>     #14 0x64d2f7d7e1ad in MSEventControl::execute(long long) /home/delphi/extraClangDebug/sumo/src/microsim/MSEventControl.cpp:69:33
>     #15 0x64d2f752d300 in MSNet::simulationStep(bool) /home/delphi/extraClangDebug/sumo/src/microsim/MSNet.cpp:824:24
>     #16 0x64d2f7527368 in MSNet::simulate(long long, long long) /home/delphi/extraClangDebug/sumo/src/microsim/MSNet.cpp:412:9
>     #17 0x64d2f7513865 in main /home/delphi/extraClangDebug/sumo/src/sumo_main.cpp:100:30
>     #18 0x78b81842a1c9 in __libc_start_call_main csu/../sysdeps/nptl/libc_start_call_main.h:58:16
>     #19 0x78b81842a28a in __libc_start_main csu/../csu/libc-start.c:360:3
<truncated after showing first 30 lines>

TEST FAILED on ts-sim-build-ba : traci trafficlight constraints swap 6 ( Last six runs Oct2024 )

---------- Differences in errors ----------
0a1,3
>   warnings.warn("Could not import libsumo, falling back to pure python traci (%s)." % e)
> /home/delphi/extraClangDebug/sumo/src/utils/common/SUMOTime.cpp:75:15: runtime error: negation of -9223372036854775808 cannot be represented in type 'long long'; cast to an unsigned type to negate this value to itself
> SUMMARY: UndefinedBehaviorSanitizer: undefined-behavior /home/delphi/extraClangDebug/sumo/src/utils/common/SUMOTime.cpp:75:15 
2a6,176
> 
> =================================================================
> ==4136595==ERROR: LeakSanitizer: detected memory leaks
> 
> Indirect leak of 2376 byte(s) in 3 object(s) allocated from:
>     #0 0x5699a70048b1 in operator new(unsigned long) (/home/delphi/extraClangDebug/sumo/bin/sumoD+0x255c8b1) (BuildId: 2def77f78b0d3ed8747c35d0286147d2dede0b5f)
>     #1 0x5699a91ef6ce in MSDriveWay::buildDriveWay(std::__cxx11::basic_string<char, std::char_traits<char>, std::allocator<char>> const&, MSLink const*, __gnu_cxx::__normal_iterator<MSEdge const* const*, std::vector<MSEdge const*, std::allocator<MSEdge const*>>>, __gnu_cxx::__normal_iterator<MSEdge const* const*, std::vector<MSEdge const*, std::allocator<MSEdge const*>>>) /home/delphi/extraClangDebug/sumo/src/microsim/traffic_lights/MSDriveWay.cpp:1196:22
>     #2 0x5699a920ab7c in MSDriveWay::getDepartureDriveway(SUMOVehicle const*) /home/delphi/extraClangDebug/sumo/src/microsim/traffic_lights/MSDriveWay.cpp:1865:22
>     #3 0x5699a9138b3b in MSRailSignal::initDriveWays(SUMOVehicle const*, bool) /home/delphi/extraClangDebug/sumo/src/microsim/traffic_lights/MSRailSignal.cpp:374:48
>     #4 0x5699a9180bbf in MSRailSignalControl::vehicleStateChanged(SUMOVehicle const*, MSNet::VehicleState, std::__cxx11::basic_string<char, std::char_traits<char>, std::allocator<char>> const&) /home/delphi/extraClangDebug/sumo/src/microsim/traffic_lights/MSRailSignalControl.cpp:87:17
>     #5 0x5699a7061a64 in MSNet::informVehicleStateListener(SUMOVehicle const*, MSNet::VehicleState, std::__cxx11::basic_string<char, std::char_traits<char>, std::allocator<char>> const&) /home/delphi/extraClangDebug/sumo/src/microsim/MSNet.cpp:1277:19
>     #6 0x5699a76d95b5 in MSBaseVehicle::replaceRoute(std::shared_ptr<MSRoute const>, std::__cxx11::basic_string<char, std::char_traits<char>, std::allocator<char>> const&, bool, int, bool, bool, std::__cxx11::basic_string<char, std::char_traits<char>, std::allocator<char>>*) /home/delphi/extraClangDebug/sumo/src/microsim/MSBaseVehicle.cpp:543:27
>     #7 0x5699a740a3b0 in MSVehicle::replaceRoute(std::shared_ptr<MSRoute const>, std::__cxx11::basic_string<char, std::char_traits<char>, std::allocator<char>> const&, bool, int, bool, bool, std::__cxx11::basic_string<char, std::char_traits<char>, std::allocator<char>>*) /home/delphi/extraClangDebug/sumo/src/microsim/MSVehicle.cpp:1121:24
>     #8 0x5699a76d1395 in MSBaseVehicle::replaceRouteEdges(std::vector<MSEdge const*, std::allocator<MSEdge const*>>&, double, double, std::__cxx11::basic_string<char, std::char_traits<char>, std::allocator<char>> const&, bool, bool, bool, std::__cxx11::basic_string<char, std::char_traits<char>, std::allocator<char>>*) /home/delphi/extraClangDebug/sumo/src/microsim/MSBaseVehicle.cpp:479:10
>     #9 0x5699a76cba96 in MSBaseVehicle::reroute(long long, std::__cxx11::basic_string<char, std::char_traits<char>, std::allocator<char>> const&, SUMOAbstractRouter<MSEdge, SUMOVehicle>&, bool, bool, bool, MSEdge const*) /home/delphi/extraClangDebug/sumo/src/microsim/MSBaseVehicle.cpp:404:5
>     #10 0x5699a8932401 in MSRoutingEngine::reroute(SUMOVehicle&, long long, std::__cxx11::basic_string<char, std::char_traits<char>, std::allocator<char>> const&, bool, bool, std::vector<MSEdge*, std::allocator<MSEdge*>> const&) /home/delphi/extraClangDebug/sumo/src/microsim/devices/MSRoutingEngine.cpp:464:17
>     #11 0x5699a8706979 in MSDevice_Routing::reroute(long long, bool) /home/delphi/extraClangDebug/sumo/src/microsim/devices/MSDevice_Routing.cpp:298:5
>     #12 0x5699a8702370 in MSDevice_Routing::preInsertionReroute(long long) /home/delphi/extraClangDebug/sumo/src/microsim/devices/MSDevice_Routing.cpp:263:13
>     #13 0x5699a870bc18 in WrappingCommand<MSDevice_Routing>::execute(long long) /home/delphi/extraClangDebug/sumo/src/utils/common/WrappingCommand.h:104:16
>     #14 0x5699a78731ad in MSEventControl::execute(long long) /home/delphi/extraClangDebug/sumo/src/microsim/MSEventControl.cpp:69:33
>     #15 0x5699a7022300 in MSNet::simulationStep(bool) /home/delphi/extraClangDebug/sumo/src/microsim/MSNet.cpp:824:24
>     #16 0x5699a701c368 in MSNet::simulate(long long, long long) /home/delphi/extraClangDebug/sumo/src/microsim/MSNet.cpp:412:9
>     #17 0x5699a7008865 in main /home/delphi/extraClangDebug/sumo/src/sumo_main.cpp:100:30
>     #18 0x7e8e5fe2a1c9 in __libc_start_call_main csu/../sysdeps/nptl/libc_start_call_main.h:58:16
>     #19 0x7e8e5fe2a28a in __libc_start_main csu/../csu/libc-start.c:360:3
<truncated after showing first 30 lines>

TEST FAILED on ts-sim-build-ba : traci trafficlight constraints swap bidi ( Last six runs Oct2024 )

---------- Differences in errors ----------
0a1,524
>   warnings.warn("Could not import libsumo, falling back to pure python traci (%s)." % e)
> 
> =================================================================
> ==4136669==ERROR: LeakSanitizer: detected memory leaks
> 
> Direct leak of 792 byte(s) in 1 object(s) allocated from:
>     #0 0x6066e27558b1 in operator new(unsigned long) (/home/delphi/extraClangDebug/sumo/bin/sumoD+0x255c8b1) (BuildId: 2def77f78b0d3ed8747c35d0286147d2dede0b5f)
>     #1 0x6066e4953a6a in MSDriveWay::buildSubFoe(MSDriveWay*, bool) /home/delphi/extraClangDebug/sumo/src/microsim/traffic_lights/MSDriveWay.cpp:1675:23
>     #2 0x6066e4945838 in MSDriveWay::buildDriveWay(std::__cxx11::basic_string<char, std::char_traits<char>, std::allocator<char>> const&, MSLink const*, __gnu_cxx::__normal_iterator<MSEdge const* const*, std::vector<MSEdge const*, std::allocator<MSEdge const*>>>, __gnu_cxx::__normal_iterator<MSEdge const* const*, std::vector<MSEdge const*, std::allocator<MSEdge const*>>>) /home/delphi/extraClangDebug/sumo/src/microsim/traffic_lights/MSDriveWay.cpp:1292:22
>     #3 0x6066e488eb95 in MSRailSignal::LinkInfo::getDriveWay(__gnu_cxx::__normal_iterator<MSEdge const* const*, std::vector<MSEdge const*, std::allocator<MSEdge const*>>>, __gnu_cxx::__normal_iterator<MSEdge const* const*, std::vector<MSEdge const*, std::allocator<MSEdge const*>>>, std::__cxx11::basic_string<char, std::char_traits<char>, std::allocator<char>> const&) /home/delphi/extraClangDebug/sumo/src/microsim/traffic_lights/MSRailSignal.cpp:522:22
>     #4 0x6066e48832ca in MSRailSignal::LinkInfo::getDriveWay(SUMOVehicle const*) /home/delphi/extraClangDebug/sumo/src/microsim/traffic_lights/MSRailSignal.cpp:505:12
>     #5 0x6066e488ab76 in MSRailSignal::initDriveWays(SUMOVehicle const*, bool) /home/delphi/extraClangDebug/sumo/src/microsim/traffic_lights/MSRailSignal.cpp:386:50
>     #6 0x6066e48d1bbf in MSRailSignalControl::vehicleStateChanged(SUMOVehicle const*, MSNet::VehicleState, std::__cxx11::basic_string<char, std::char_traits<char>, std::allocator<char>> const&) /home/delphi/extraClangDebug/sumo/src/microsim/traffic_lights/MSRailSignalControl.cpp:87:17
>     #7 0x6066e27b2a64 in MSNet::informVehicleStateListener(SUMOVehicle const*, MSNet::VehicleState, std::__cxx11::basic_string<char, std::char_traits<char>, std::allocator<char>> const&) /home/delphi/extraClangDebug/sumo/src/microsim/MSNet.cpp:1277:19
>     #8 0x6066e2d1c7aa in MSVehicleControl::initVehicle(MSBaseVehicle*, bool, bool, MSVehicleControl::VehicleDefinitionSource) /home/delphi/extraClangDebug/sumo/src/microsim/MSVehicleControl.cpp:133:27
>     #9 0x6066e2d1bc9b in MSVehicleControl::buildVehicle(SUMOVehicleParameter*, std::shared_ptr<MSRoute const>, MSVehicleType*, bool, MSVehicleControl::VehicleDefinitionSource, bool) /home/delphi/extraClangDebug/sumo/src/microsim/MSVehicleControl.cpp:116:5
>     #10 0x6066e2a10cf7 in MSRouteHandler::closeVehicle() /home/delphi/extraClangDebug/sumo/src/microsim/MSRouteHandler.cpp:670:34
>     #11 0x6066e50487d7 in SUMORouteHandler::myEndElement(int) /home/delphi/extraClangDebug/sumo/src/utils/vehicle/SUMORouteHandler.cpp:267:17
>     #12 0x6066e3865290 in NLHandler::myEndElement(int) /home/delphi/extraClangDebug/sumo/src/netload/NLHandler.cpp:414:21
>     #13 0x6066e52234db in GenericSAXHandler::endElement(char16_t const*, char16_t const*, char16_t const*) /home/delphi/extraClangDebug/sumo/src/utils/xml/GenericSAXHandler.cpp:167:9
>     #14 0x7d27021e68f2 in xercesc_3_2::SAX2XMLReaderImpl::endElement(xercesc_3_2::XMLElementDecl const&, unsigned int, bool, char16_t const*) (/lib/x86_64-linux-gnu/libxerces-c-3.2.so+0x1e68f2) (BuildId: 00c66a49d1bfc9237096cfb0829bac6c9c2c8e81)
>     #15 0x7d270219aef0 in xercesc_3_2::IGXMLScanner::scanEndTag(bool&) (/lib/x86_64-linux-gnu/libxerces-c-3.2.so+0x19aef0) (BuildId: 00c66a49d1bfc9237096cfb0829bac6c9c2c8e81)
>     #16 0x7d270219badb in xercesc_3_2::IGXMLScanner::scanContent() (/lib/x86_64-linux-gnu/libxerces-c-3.2.so+0x19badb) (BuildId: 00c66a49d1bfc9237096cfb0829bac6c9c2c8e81)
>     #17 0x7d2702190c87 in xercesc_3_2::IGXMLScanner::scanDocument(xercesc_3_2::InputSource const&) (/lib/x86_64-linux-gnu/libxerces-c-3.2.so+0x190c87) (BuildId: 00c66a49d1bfc9237096cfb0829bac6c9c2c8e81)
>     #18 0x7d27021e0d42 in xercesc_3_2::SAX2XMLReaderImpl::parse(xercesc_3_2::InputSource const&) (/lib/x86_64-linux-gnu/libxerces-c-3.2.so+0x1e0d42) (BuildId: 00c66a49d1bfc9237096cfb0829bac6c9c2c8e81)
>     #19 0x6066e5252f82 in SUMOSAXReader::parse(std::__cxx11::basic_string<char, std::char_traits<char>, std::allocator<char>>) /home/delphi/extraClangDebug/sumo/src/utils/xml/SUMOSAXReader.cpp:118:18
>     #20 0x6066e5353141 in XMLSubSys::runParser(GenericSAXHandler&, std::__cxx11::basic_string<char, std::char_traits<char>, std::allocator<char>> const&, bool, bool, bool, bool) /home/delphi/extraClangDebug/sumo/src/utils/xml/XMLSubSys.cpp:170:42
>     #21 0x6066e3809d1a in NLBuilder::load(std::__cxx11::basic_string<char, std::char_traits<char>, std::allocator<char>> const&, bool) /home/delphi/extraClangDebug/sumo/src/netload/NLBuilder.cpp:431:14
>     #22 0x6066e3801795 in NLBuilder::build() /home/delphi/extraClangDebug/sumo/src/netload/NLBuilder.cpp:205:14
<truncated after showing first 30 lines>

TEST FAILED on ts-sim-build-ba : traci trafficlight constraints swap egoLeader ( Last six runs Oct2024 )

---------- Differences in errors ----------
0a1,203
>   warnings.warn("Could not import libsumo, falling back to pure python traci (%s)." % e)
> /home/delphi/extraClangDebug/sumo/src/utils/common/SUMOTime.cpp:75:15: runtime error: negation of -9223372036854775808 cannot be represented in type 'long long'; cast to an unsigned type to negate this value to itself
> SUMMARY: UndefinedBehaviorSanitizer: undefined-behavior /home/delphi/extraClangDebug/sumo/src/utils/common/SUMOTime.cpp:75:15 
> 
> =================================================================
> ==4136615==ERROR: LeakSanitizer: detected memory leaks
> 
> Indirect leak of 2376 byte(s) in 3 object(s) allocated from:
>     #0 0x596afbb238b1 in operator new(unsigned long) (/home/delphi/extraClangDebug/sumo/bin/sumoD+0x255c8b1) (BuildId: 2def77f78b0d3ed8747c35d0286147d2dede0b5f)
>     #1 0x596afdd0e6ce in MSDriveWay::buildDriveWay(std::__cxx11::basic_string<char, std::char_traits<char>, std::allocator<char>> const&, MSLink const*, __gnu_cxx::__normal_iterator<MSEdge const* const*, std::vector<MSEdge const*, std::allocator<MSEdge const*>>>, __gnu_cxx::__normal_iterator<MSEdge const* const*, std::vector<MSEdge const*, std::allocator<MSEdge const*>>>) /home/delphi/extraClangDebug/sumo/src/microsim/traffic_lights/MSDriveWay.cpp:1196:22
>     #2 0x596afdd29b7c in MSDriveWay::getDepartureDriveway(SUMOVehicle const*) /home/delphi/extraClangDebug/sumo/src/microsim/traffic_lights/MSDriveWay.cpp:1865:22
>     #3 0x596afdc57b3b in MSRailSignal::initDriveWays(SUMOVehicle const*, bool) /home/delphi/extraClangDebug/sumo/src/microsim/traffic_lights/MSRailSignal.cpp:374:48
>     #4 0x596afdc9fbbf in MSRailSignalControl::vehicleStateChanged(SUMOVehicle const*, MSNet::VehicleState, std::__cxx11::basic_string<char, std::char_traits<char>, std::allocator<char>> const&) /home/delphi/extraClangDebug/sumo/src/microsim/traffic_lights/MSRailSignalControl.cpp:87:17
>     #5 0x596afbb80a64 in MSNet::informVehicleStateListener(SUMOVehicle const*, MSNet::VehicleState, std::__cxx11::basic_string<char, std::char_traits<char>, std::allocator<char>> const&) /home/delphi/extraClangDebug/sumo/src/microsim/MSNet.cpp:1277:19
>     #6 0x596afc1f85b5 in MSBaseVehicle::replaceRoute(std::shared_ptr<MSRoute const>, std::__cxx11::basic_string<char, std::char_traits<char>, std::allocator<char>> const&, bool, int, bool, bool, std::__cxx11::basic_string<char, std::char_traits<char>, std::allocator<char>>*) /home/delphi/extraClangDebug/sumo/src/microsim/MSBaseVehicle.cpp:543:27
>     #7 0x596afbf293b0 in MSVehicle::replaceRoute(std::shared_ptr<MSRoute const>, std::__cxx11::basic_string<char, std::char_traits<char>, std::allocator<char>> const&, bool, int, bool, bool, std::__cxx11::basic_string<char, std::char_traits<char>, std::allocator<char>>*) /home/delphi/extraClangDebug/sumo/src/microsim/MSVehicle.cpp:1121:24
>     #8 0x596afc1f0395 in MSBaseVehicle::replaceRouteEdges(std::vector<MSEdge const*, std::allocator<MSEdge const*>>&, double, double, std::__cxx11::basic_string<char, std::char_traits<char>, std::allocator<char>> const&, bool, bool, bool, std::__cxx11::basic_string<char, std::char_traits<char>, std::allocator<char>>*) /home/delphi/extraClangDebug/sumo/src/microsim/MSBaseVehicle.cpp:479:10
>     #9 0x596afc1eaa96 in MSBaseVehicle::reroute(long long, std::__cxx11::basic_string<char, std::char_traits<char>, std::allocator<char>> const&, SUMOAbstractRouter<MSEdge, SUMOVehicle>&, bool, bool, bool, MSEdge const*) /home/delphi/extraClangDebug/sumo/src/microsim/MSBaseVehicle.cpp:404:5
>     #10 0x596afd451401 in MSRoutingEngine::reroute(SUMOVehicle&, long long, std::__cxx11::basic_string<char, std::char_traits<char>, std::allocator<char>> const&, bool, bool, std::vector<MSEdge*, std::allocator<MSEdge*>> const&) /home/delphi/extraClangDebug/sumo/src/microsim/devices/MSRoutingEngine.cpp:464:17
>     #11 0x596afd225979 in MSDevice_Routing::reroute(long long, bool) /home/delphi/extraClangDebug/sumo/src/microsim/devices/MSDevice_Routing.cpp:298:5
>     #12 0x596afd221370 in MSDevice_Routing::preInsertionReroute(long long) /home/delphi/extraClangDebug/sumo/src/microsim/devices/MSDevice_Routing.cpp:263:13
>     #13 0x596afd22ac18 in WrappingCommand<MSDevice_Routing>::execute(long long) /home/delphi/extraClangDebug/sumo/src/utils/common/WrappingCommand.h:104:16
>     #14 0x596afc3921ad in MSEventControl::execute(long long) /home/delphi/extraClangDebug/sumo/src/microsim/MSEventControl.cpp:69:33
>     #15 0x596afbb41300 in MSNet::simulationStep(bool) /home/delphi/extraClangDebug/sumo/src/microsim/MSNet.cpp:824:24
>     #16 0x596afbb3b368 in MSNet::simulate(long long, long long) /home/delphi/extraClangDebug/sumo/src/microsim/MSNet.cpp:412:9
>     #17 0x596afbb27865 in main /home/delphi/extraClangDebug/sumo/src/sumo_main.cpp:100:30
>     #18 0x7b292be2a1c9 in __libc_start_call_main csu/../sysdeps/nptl/libc_start_call_main.h:58:16
>     #19 0x7b292be2a28a in __libc_start_main csu/../csu/libc-start.c:360:3
>     #20 0x596afba4a444 in _start (/home/delphi/extraClangDebug/sumo/bin/sumoD+0x2483444) (BuildId: 2def77f78b0d3ed8747c35d0286147d2dede0b5f)
<truncated after showing first 30 lines>

TEST FAILED on ts-sim-build-ba : traci trafficlight constraints swap foeInsertion ( Last six runs Oct2024 )

---------- Differences in errors ----------
0a1,203
>   warnings.warn("Could not import libsumo, falling back to pure python traci (%s)." % e)
> /home/delphi/extraClangDebug/sumo/src/utils/common/SUMOTime.cpp:75:15: runtime error: negation of -9223372036854775808 cannot be represented in type 'long long'; cast to an unsigned type to negate this value to itself
> SUMMARY: UndefinedBehaviorSanitizer: undefined-behavior /home/delphi/extraClangDebug/sumo/src/utils/common/SUMOTime.cpp:75:15 
> 
> =================================================================
> ==4136598==ERROR: LeakSanitizer: detected memory leaks
> 
> Indirect leak of 2376 byte(s) in 3 object(s) allocated from:
>     #0 0x5aaf816718b1 in operator new(unsigned long) (/home/delphi/extraClangDebug/sumo/bin/sumoD+0x255c8b1) (BuildId: 2def77f78b0d3ed8747c35d0286147d2dede0b5f)
>     #1 0x5aaf8385c6ce in MSDriveWay::buildDriveWay(std::__cxx11::basic_string<char, std::char_traits<char>, std::allocator<char>> const&, MSLink const*, __gnu_cxx::__normal_iterator<MSEdge const* const*, std::vector<MSEdge const*, std::allocator<MSEdge const*>>>, __gnu_cxx::__normal_iterator<MSEdge const* const*, std::vector<MSEdge const*, std::allocator<MSEdge const*>>>) /home/delphi/extraClangDebug/sumo/src/microsim/traffic_lights/MSDriveWay.cpp:1196:22
>     #2 0x5aaf83877b7c in MSDriveWay::getDepartureDriveway(SUMOVehicle const*) /home/delphi/extraClangDebug/sumo/src/microsim/traffic_lights/MSDriveWay.cpp:1865:22
>     #3 0x5aaf837a5b3b in MSRailSignal::initDriveWays(SUMOVehicle const*, bool) /home/delphi/extraClangDebug/sumo/src/microsim/traffic_lights/MSRailSignal.cpp:374:48
>     #4 0x5aaf837edbbf in MSRailSignalControl::vehicleStateChanged(SUMOVehicle const*, MSNet::VehicleState, std::__cxx11::basic_string<char, std::char_traits<char>, std::allocator<char>> const&) /home/delphi/extraClangDebug/sumo/src/microsim/traffic_lights/MSRailSignalControl.cpp:87:17
>     #5 0x5aaf816cea64 in MSNet::informVehicleStateListener(SUMOVehicle const*, MSNet::VehicleState, std::__cxx11::basic_string<char, std::char_traits<char>, std::allocator<char>> const&) /home/delphi/extraClangDebug/sumo/src/microsim/MSNet.cpp:1277:19
>     #6 0x5aaf81d465b5 in MSBaseVehicle::replaceRoute(std::shared_ptr<MSRoute const>, std::__cxx11::basic_string<char, std::char_traits<char>, std::allocator<char>> const&, bool, int, bool, bool, std::__cxx11::basic_string<char, std::char_traits<char>, std::allocator<char>>*) /home/delphi/extraClangDebug/sumo/src/microsim/MSBaseVehicle.cpp:543:27
>     #7 0x5aaf81a773b0 in MSVehicle::replaceRoute(std::shared_ptr<MSRoute const>, std::__cxx11::basic_string<char, std::char_traits<char>, std::allocator<char>> const&, bool, int, bool, bool, std::__cxx11::basic_string<char, std::char_traits<char>, std::allocator<char>>*) /home/delphi/extraClangDebug/sumo/src/microsim/MSVehicle.cpp:1121:24
>     #8 0x5aaf81d3e395 in MSBaseVehicle::replaceRouteEdges(std::vector<MSEdge const*, std::allocator<MSEdge const*>>&, double, double, std::__cxx11::basic_string<char, std::char_traits<char>, std::allocator<char>> const&, bool, bool, bool, std::__cxx11::basic_string<char, std::char_traits<char>, std::allocator<char>>*) /home/delphi/extraClangDebug/sumo/src/microsim/MSBaseVehicle.cpp:479:10
>     #9 0x5aaf81d38a96 in MSBaseVehicle::reroute(long long, std::__cxx11::basic_string<char, std::char_traits<char>, std::allocator<char>> const&, SUMOAbstractRouter<MSEdge, SUMOVehicle>&, bool, bool, bool, MSEdge const*) /home/delphi/extraClangDebug/sumo/src/microsim/MSBaseVehicle.cpp:404:5
>     #10 0x5aaf82f9f401 in MSRoutingEngine::reroute(SUMOVehicle&, long long, std::__cxx11::basic_string<char, std::char_traits<char>, std::allocator<char>> const&, bool, bool, std::vector<MSEdge*, std::allocator<MSEdge*>> const&) /home/delphi/extraClangDebug/sumo/src/microsim/devices/MSRoutingEngine.cpp:464:17
>     #11 0x5aaf82d73979 in MSDevice_Routing::reroute(long long, bool) /home/delphi/extraClangDebug/sumo/src/microsim/devices/MSDevice_Routing.cpp:298:5
>     #12 0x5aaf82d6f370 in MSDevice_Routing::preInsertionReroute(long long) /home/delphi/extraClangDebug/sumo/src/microsim/devices/MSDevice_Routing.cpp:263:13
>     #13 0x5aaf82d78c18 in WrappingCommand<MSDevice_Routing>::execute(long long) /home/delphi/extraClangDebug/sumo/src/utils/common/WrappingCommand.h:104:16
>     #14 0x5aaf81ee01ad in MSEventControl::execute(long long) /home/delphi/extraClangDebug/sumo/src/microsim/MSEventControl.cpp:69:33
>     #15 0x5aaf8168f300 in MSNet::simulationStep(bool) /home/delphi/extraClangDebug/sumo/src/microsim/MSNet.cpp:824:24
>     #16 0x5aaf81689368 in MSNet::simulate(long long, long long) /home/delphi/extraClangDebug/sumo/src/microsim/MSNet.cpp:412:9
>     #17 0x5aaf81675865 in main /home/delphi/extraClangDebug/sumo/src/sumo_main.cpp:100:30
>     #18 0x737a9102a1c9 in __libc_start_call_main csu/../sysdeps/nptl/libc_start_call_main.h:58:16
>     #19 0x737a9102a28a in __libc_start_main csu/../csu/libc-start.c:360:3
>     #20 0x5aaf81598444 in _start (/home/delphi/extraClangDebug/sumo/bin/sumoD+0x2483444) (BuildId: 2def77f78b0d3ed8747c35d0286147d2dede0b5f)
<truncated after showing first 30 lines>

TEST FAILED on ts-sim-build-ba : traci trafficlight constraints swap insertion ( Last six runs Oct2024 )

---------- Differences in errors ----------
0a1,3
>   warnings.warn("Could not import libsumo, falling back to pure python traci (%s)." % e)
> /home/delphi/extraClangDebug/sumo/src/utils/common/SUMOTime.cpp:75:15: runtime error: negation of -9223372036854775808 cannot be represented in type 'long long'; cast to an unsigned type to negate this value to itself
> SUMMARY: UndefinedBehaviorSanitizer: undefined-behavior /home/delphi/extraClangDebug/sumo/src/utils/common/SUMOTime.cpp:75:15 
1a5,203
> 
> =================================================================
> ==4136645==ERROR: LeakSanitizer: detected memory leaks
> 
> Indirect leak of 2376 byte(s) in 3 object(s) allocated from:
>     #0 0x592fd35b38b1 in operator new(unsigned long) (/home/delphi/extraClangDebug/sumo/bin/sumoD+0x255c8b1) (BuildId: 2def77f78b0d3ed8747c35d0286147d2dede0b5f)
>     #1 0x592fd579e6ce in MSDriveWay::buildDriveWay(std::__cxx11::basic_string<char, std::char_traits<char>, std::allocator<char>> const&, MSLink const*, __gnu_cxx::__normal_iterator<MSEdge const* const*, std::vector<MSEdge const*, std::allocator<MSEdge const*>>>, __gnu_cxx::__normal_iterator<MSEdge const* const*, std::vector<MSEdge const*, std::allocator<MSEdge const*>>>) /home/delphi/extraClangDebug/sumo/src/microsim/traffic_lights/MSDriveWay.cpp:1196:22
>     #2 0x592fd57b9b7c in MSDriveWay::getDepartureDriveway(SUMOVehicle const*) /home/delphi/extraClangDebug/sumo/src/microsim/traffic_lights/MSDriveWay.cpp:1865:22
>     #3 0x592fd56e7b3b in MSRailSignal::initDriveWays(SUMOVehicle const*, bool) /home/delphi/extraClangDebug/sumo/src/microsim/traffic_lights/MSRailSignal.cpp:374:48
>     #4 0x592fd572fbbf in MSRailSignalControl::vehicleStateChanged(SUMOVehicle const*, MSNet::VehicleState, std::__cxx11::basic_string<char, std::char_traits<char>, std::allocator<char>> const&) /home/delphi/extraClangDebug/sumo/src/microsim/traffic_lights/MSRailSignalControl.cpp:87:17
>     #5 0x592fd3610a64 in MSNet::informVehicleStateListener(SUMOVehicle const*, MSNet::VehicleState, std::__cxx11::basic_string<char, std::char_traits<char>, std::allocator<char>> const&) /home/delphi/extraClangDebug/sumo/src/microsim/MSNet.cpp:1277:19
>     #6 0x592fd3c885b5 in MSBaseVehicle::replaceRoute(std::shared_ptr<MSRoute const>, std::__cxx11::basic_string<char, std::char_traits<char>, std::allocator<char>> const&, bool, int, bool, bool, std::__cxx11::basic_string<char, std::char_traits<char>, std::allocator<char>>*) /home/delphi/extraClangDebug/sumo/src/microsim/MSBaseVehicle.cpp:543:27
>     #7 0x592fd39b93b0 in MSVehicle::replaceRoute(std::shared_ptr<MSRoute const>, std::__cxx11::basic_string<char, std::char_traits<char>, std::allocator<char>> const&, bool, int, bool, bool, std::__cxx11::basic_string<char, std::char_traits<char>, std::allocator<char>>*) /home/delphi/extraClangDebug/sumo/src/microsim/MSVehicle.cpp:1121:24
>     #8 0x592fd3c80395 in MSBaseVehicle::replaceRouteEdges(std::vector<MSEdge const*, std::allocator<MSEdge const*>>&, double, double, std::__cxx11::basic_string<char, std::char_traits<char>, std::allocator<char>> const&, bool, bool, bool, std::__cxx11::basic_string<char, std::char_traits<char>, std::allocator<char>>*) /home/delphi/extraClangDebug/sumo/src/microsim/MSBaseVehicle.cpp:479:10
>     #9 0x592fd3c7aa96 in MSBaseVehicle::reroute(long long, std::__cxx11::basic_string<char, std::char_traits<char>, std::allocator<char>> const&, SUMOAbstractRouter<MSEdge, SUMOVehicle>&, bool, bool, bool, MSEdge const*) /home/delphi/extraClangDebug/sumo/src/microsim/MSBaseVehicle.cpp:404:5
>     #10 0x592fd4ee1401 in MSRoutingEngine::reroute(SUMOVehicle&, long long, std::__cxx11::basic_string<char, std::char_traits<char>, std::allocator<char>> const&, bool, bool, std::vector<MSEdge*, std::allocator<MSEdge*>> const&) /home/delphi/extraClangDebug/sumo/src/microsim/devices/MSRoutingEngine.cpp:464:17
>     #11 0x592fd4cb5979 in MSDevice_Routing::reroute(long long, bool) /home/delphi/extraClangDebug/sumo/src/microsim/devices/MSDevice_Routing.cpp:298:5
>     #12 0x592fd4cb1370 in MSDevice_Routing::preInsertionReroute(long long) /home/delphi/extraClangDebug/sumo/src/microsim/devices/MSDevice_Routing.cpp:263:13
>     #13 0x592fd4cbac18 in WrappingCommand<MSDevice_Routing>::execute(long long) /home/delphi/extraClangDebug/sumo/src/utils/common/WrappingCommand.h:104:16
>     #14 0x592fd3e221ad in MSEventControl::execute(long long) /home/delphi/extraClangDebug/sumo/src/microsim/MSEventControl.cpp:69:33
>     #15 0x592fd35d1300 in MSNet::simulationStep(bool) /home/delphi/extraClangDebug/sumo/src/microsim/MSNet.cpp:824:24
>     #16 0x592fd35cb368 in MSNet::simulate(long long, long long) /home/delphi/extraClangDebug/sumo/src/microsim/MSNet.cpp:412:9
>     #17 0x592fd35b7865 in main /home/delphi/extraClangDebug/sumo/src/sumo_main.cpp:100:30
>     #18 0x727dd062a1c9 in __libc_start_call_main csu/../sysdeps/nptl/libc_start_call_main.h:58:16
>     #19 0x727dd062a28a in __libc_start_main csu/../csu/libc-start.c:360:3
<truncated after showing first 30 lines>

TEST FAILED on ts-sim-build-ba : traci trafficlight constraints swap insertion_tripId ( Last six runs Oct2024 )

---------- Differences in errors ----------
0a1,3
>   warnings.warn("Could not import libsumo, falling back to pure python traci (%s)." % e)
> /home/delphi/extraClangDebug/sumo/src/utils/common/SUMOTime.cpp:75:15: runtime error: negation of -9223372036854775808 cannot be represented in type 'long long'; cast to an unsigned type to negate this value to itself
> SUMMARY: UndefinedBehaviorSanitizer: undefined-behavior /home/delphi/extraClangDebug/sumo/src/utils/common/SUMOTime.cpp:75:15 
1a5,203
> 
> =================================================================
> ==4136665==ERROR: LeakSanitizer: detected memory leaks
> 
> Indirect leak of 2376 byte(s) in 3 object(s) allocated from:
>     #0 0x641405aff8b1 in operator new(unsigned long) (/home/delphi/extraClangDebug/sumo/bin/sumoD+0x255c8b1) (BuildId: 2def77f78b0d3ed8747c35d0286147d2dede0b5f)
>     #1 0x641407cea6ce in MSDriveWay::buildDriveWay(std::__cxx11::basic_string<char, std::char_traits<char>, std::allocator<char>> const&, MSLink const*, __gnu_cxx::__normal_iterator<MSEdge const* const*, std::vector<MSEdge const*, std::allocator<MSEdge const*>>>, __gnu_cxx::__normal_iterator<MSEdge const* const*, std::vector<MSEdge const*, std::allocator<MSEdge const*>>>) /home/delphi/extraClangDebug/sumo/src/microsim/traffic_lights/MSDriveWay.cpp:1196:22
>     #2 0x641407d05b7c in MSDriveWay::getDepartureDriveway(SUMOVehicle const*) /home/delphi/extraClangDebug/sumo/src/microsim/traffic_lights/MSDriveWay.cpp:1865:22
>     #3 0x641407c33b3b in MSRailSignal::initDriveWays(SUMOVehicle const*, bool) /home/delphi/extraClangDebug/sumo/src/microsim/traffic_lights/MSRailSignal.cpp:374:48
>     #4 0x641407c7bbbf in MSRailSignalControl::vehicleStateChanged(SUMOVehicle const*, MSNet::VehicleState, std::__cxx11::basic_string<char, std::char_traits<char>, std::allocator<char>> const&) /home/delphi/extraClangDebug/sumo/src/microsim/traffic_lights/MSRailSignalControl.cpp:87:17
>     #5 0x641405b5ca64 in MSNet::informVehicleStateListener(SUMOVehicle const*, MSNet::VehicleState, std::__cxx11::basic_string<char, std::char_traits<char>, std::allocator<char>> const&) /home/delphi/extraClangDebug/sumo/src/microsim/MSNet.cpp:1277:19
>     #6 0x6414061d45b5 in MSBaseVehicle::replaceRoute(std::shared_ptr<MSRoute const>, std::__cxx11::basic_string<char, std::char_traits<char>, std::allocator<char>> const&, bool, int, bool, bool, std::__cxx11::basic_string<char, std::char_traits<char>, std::allocator<char>>*) /home/delphi/extraClangDebug/sumo/src/microsim/MSBaseVehicle.cpp:543:27
>     #7 0x641405f053b0 in MSVehicle::replaceRoute(std::shared_ptr<MSRoute const>, std::__cxx11::basic_string<char, std::char_traits<char>, std::allocator<char>> const&, bool, int, bool, bool, std::__cxx11::basic_string<char, std::char_traits<char>, std::allocator<char>>*) /home/delphi/extraClangDebug/sumo/src/microsim/MSVehicle.cpp:1121:24
>     #8 0x6414061cc395 in MSBaseVehicle::replaceRouteEdges(std::vector<MSEdge const*, std::allocator<MSEdge const*>>&, double, double, std::__cxx11::basic_string<char, std::char_traits<char>, std::allocator<char>> const&, bool, bool, bool, std::__cxx11::basic_string<char, std::char_traits<char>, std::allocator<char>>*) /home/delphi/extraClangDebug/sumo/src/microsim/MSBaseVehicle.cpp:479:10
>     #9 0x6414061c6a96 in MSBaseVehicle::reroute(long long, std::__cxx11::basic_string<char, std::char_traits<char>, std::allocator<char>> const&, SUMOAbstractRouter<MSEdge, SUMOVehicle>&, bool, bool, bool, MSEdge const*) /home/delphi/extraClangDebug/sumo/src/microsim/MSBaseVehicle.cpp:404:5
>     #10 0x64140742d401 in MSRoutingEngine::reroute(SUMOVehicle&, long long, std::__cxx11::basic_string<char, std::char_traits<char>, std::allocator<char>> const&, bool, bool, std::vector<MSEdge*, std::allocator<MSEdge*>> const&) /home/delphi/extraClangDebug/sumo/src/microsim/devices/MSRoutingEngine.cpp:464:17
>     #11 0x641407201979 in MSDevice_Routing::reroute(long long, bool) /home/delphi/extraClangDebug/sumo/src/microsim/devices/MSDevice_Routing.cpp:298:5
>     #12 0x6414071fd370 in MSDevice_Routing::preInsertionReroute(long long) /home/delphi/extraClangDebug/sumo/src/microsim/devices/MSDevice_Routing.cpp:263:13
>     #13 0x641407206c18 in WrappingCommand<MSDevice_Routing>::execute(long long) /home/delphi/extraClangDebug/sumo/src/utils/common/WrappingCommand.h:104:16
>     #14 0x64140636e1ad in MSEventControl::execute(long long) /home/delphi/extraClangDebug/sumo/src/microsim/MSEventControl.cpp:69:33
>     #15 0x641405b1d300 in MSNet::simulationStep(bool) /home/delphi/extraClangDebug/sumo/src/microsim/MSNet.cpp:824:24
>     #16 0x641405b17368 in MSNet::simulate(long long, long long) /home/delphi/extraClangDebug/sumo/src/microsim/MSNet.cpp:412:9
>     #17 0x641405b03865 in main /home/delphi/extraClangDebug/sumo/src/sumo_main.cpp:100:30
>     #18 0x7947f442a1c9 in __libc_start_call_main csu/../sysdeps/nptl/libc_start_call_main.h:58:16
>     #19 0x7947f442a28a in __libc_start_main csu/../csu/libc-start.c:360:3
<truncated after showing first 30 lines>

TEST FAILED on ts-sim-build-ba : traci trafficlight constraints swap looped ( Last six runs Oct2024 )

---------- Differences in errors ----------
0a1,233
>   warnings.warn("Could not import libsumo, falling back to pure python traci (%s)." % e)
> /home/delphi/extraClangDebug/sumo/src/utils/common/SUMOTime.cpp:75:15: runtime error: negation of -9223372036854775808 cannot be represented in type 'long long'; cast to an unsigned type to negate this value to itself
> SUMMARY: UndefinedBehaviorSanitizer: undefined-behavior /home/delphi/extraClangDebug/sumo/src/utils/common/SUMOTime.cpp:75:15 
> 
> =================================================================
> ==4136601==ERROR: LeakSanitizer: detected memory leaks
> 
> Indirect leak of 2376 byte(s) in 3 object(s) allocated from:
>     #0 0x56263ab8c8b1 in operator new(unsigned long) (/home/delphi/extraClangDebug/sumo/bin/sumoD+0x255c8b1) (BuildId: 2def77f78b0d3ed8747c35d0286147d2dede0b5f)
>     #1 0x56263cd776ce in MSDriveWay::buildDriveWay(std::__cxx11::basic_string<char, std::char_traits<char>, std::allocator<char>> const&, MSLink const*, __gnu_cxx::__normal_iterator<MSEdge const* const*, std::vector<MSEdge const*, std::allocator<MSEdge const*>>>, __gnu_cxx::__normal_iterator<MSEdge const* const*, std::vector<MSEdge const*, std::allocator<MSEdge const*>>>) /home/delphi/extraClangDebug/sumo/src/microsim/traffic_lights/MSDriveWay.cpp:1196:22
>     #2 0x56263cd92b7c in MSDriveWay::getDepartureDriveway(SUMOVehicle const*) /home/delphi/extraClangDebug/sumo/src/microsim/traffic_lights/MSDriveWay.cpp:1865:22
>     #3 0x56263ccc0b3b in MSRailSignal::initDriveWays(SUMOVehicle const*, bool) /home/delphi/extraClangDebug/sumo/src/microsim/traffic_lights/MSRailSignal.cpp:374:48
>     #4 0x56263cd08bbf in MSRailSignalControl::vehicleStateChanged(SUMOVehicle const*, MSNet::VehicleState, std::__cxx11::basic_string<char, std::char_traits<char>, std::allocator<char>> const&) /home/delphi/extraClangDebug/sumo/src/microsim/traffic_lights/MSRailSignalControl.cpp:87:17
>     #5 0x56263abe9a64 in MSNet::informVehicleStateListener(SUMOVehicle const*, MSNet::VehicleState, std::__cxx11::basic_string<char, std::char_traits<char>, std::allocator<char>> const&) /home/delphi/extraClangDebug/sumo/src/microsim/MSNet.cpp:1277:19
>     #6 0x56263b2615b5 in MSBaseVehicle::replaceRoute(std::shared_ptr<MSRoute const>, std::__cxx11::basic_string<char, std::char_traits<char>, std::allocator<char>> const&, bool, int, bool, bool, std::__cxx11::basic_string<char, std::char_traits<char>, std::allocator<char>>*) /home/delphi/extraClangDebug/sumo/src/microsim/MSBaseVehicle.cpp:543:27
>     #7 0x56263af923b0 in MSVehicle::replaceRoute(std::shared_ptr<MSRoute const>, std::__cxx11::basic_string<char, std::char_traits<char>, std::allocator<char>> const&, bool, int, bool, bool, std::__cxx11::basic_string<char, std::char_traits<char>, std::allocator<char>>*) /home/delphi/extraClangDebug/sumo/src/microsim/MSVehicle.cpp:1121:24
>     #8 0x56263b259395 in MSBaseVehicle::replaceRouteEdges(std::vector<MSEdge const*, std::allocator<MSEdge const*>>&, double, double, std::__cxx11::basic_string<char, std::char_traits<char>, std::allocator<char>> const&, bool, bool, bool, std::__cxx11::basic_string<char, std::char_traits<char>, std::allocator<char>>*) /home/delphi/extraClangDebug/sumo/src/microsim/MSBaseVehicle.cpp:479:10
>     #9 0x56263b253a96 in MSBaseVehicle::reroute(long long, std::__cxx11::basic_string<char, std::char_traits<char>, std::allocator<char>> const&, SUMOAbstractRouter<MSEdge, SUMOVehicle>&, bool, bool, bool, MSEdge const*) /home/delphi/extraClangDebug/sumo/src/microsim/MSBaseVehicle.cpp:404:5
>     #10 0x56263c4ba401 in MSRoutingEngine::reroute(SUMOVehicle&, long long, std::__cxx11::basic_string<char, std::char_traits<char>, std::allocator<char>> const&, bool, bool, std::vector<MSEdge*, std::allocator<MSEdge*>> const&) /home/delphi/extraClangDebug/sumo/src/microsim/devices/MSRoutingEngine.cpp:464:17
>     #11 0x56263c28e979 in MSDevice_Routing::reroute(long long, bool) /home/delphi/extraClangDebug/sumo/src/microsim/devices/MSDevice_Routing.cpp:298:5
>     #12 0x56263c28a370 in MSDevice_Routing::preInsertionReroute(long long) /home/delphi/extraClangDebug/sumo/src/microsim/devices/MSDevice_Routing.cpp:263:13
>     #13 0x56263c293c18 in WrappingCommand<MSDevice_Routing>::execute(long long) /home/delphi/extraClangDebug/sumo/src/utils/common/WrappingCommand.h:104:16
>     #14 0x56263b3fb1ad in MSEventControl::execute(long long) /home/delphi/extraClangDebug/sumo/src/microsim/MSEventControl.cpp:69:33
>     #15 0x56263abaa300 in MSNet::simulationStep(bool) /home/delphi/extraClangDebug/sumo/src/microsim/MSNet.cpp:824:24
>     #16 0x56263aba4368 in MSNet::simulate(long long, long long) /home/delphi/extraClangDebug/sumo/src/microsim/MSNet.cpp:412:9
>     #17 0x56263ab90865 in main /home/delphi/extraClangDebug/sumo/src/sumo_main.cpp:100:30
>     #18 0x7929bb82a1c9 in __libc_start_call_main csu/../sysdeps/nptl/libc_start_call_main.h:58:16
>     #19 0x7929bb82a28a in __libc_start_main csu/../csu/libc-start.c:360:3
>     #20 0x56263aab3444 in _start (/home/delphi/extraClangDebug/sumo/bin/sumoD+0x2483444) (BuildId: 2def77f78b0d3ed8747c35d0286147d2dede0b5f)
<truncated after showing first 30 lines>

TEST FAILED on ts-sim-build-ba : traci trafficlight constraints swap redundant_1 ( Last six runs Oct2024 )

---------- Differences in errors ----------
0a1,174
>   warnings.warn("Could not import libsumo, falling back to pure python traci (%s)." % e)
> /home/delphi/extraClangDebug/sumo/src/utils/common/SUMOTime.cpp:75:15: runtime error: negation of -9223372036854775808 cannot be represented in type 'long long'; cast to an unsigned type to negate this value to itself
> SUMMARY: UndefinedBehaviorSanitizer: undefined-behavior /home/delphi/extraClangDebug/sumo/src/utils/common/SUMOTime.cpp:75:15 
> 
> =================================================================
> ==4136588==ERROR: LeakSanitizer: detected memory leaks
> 
> Indirect leak of 1584 byte(s) in 2 object(s) allocated from:
>     #0 0x5d7eb413a8b1 in operator new(unsigned long) (/home/delphi/extraClangDebug/sumo/bin/sumoD+0x255c8b1) (BuildId: 2def77f78b0d3ed8747c35d0286147d2dede0b5f)
>     #1 0x5d7eb63256ce in MSDriveWay::buildDriveWay(std::__cxx11::basic_string<char, std::char_traits<char>, std::allocator<char>> const&, MSLink const*, __gnu_cxx::__normal_iterator<MSEdge const* const*, std::vector<MSEdge const*, std::allocator<MSEdge const*>>>, __gnu_cxx::__normal_iterator<MSEdge const* const*, std::vector<MSEdge const*, std::allocator<MSEdge const*>>>) /home/delphi/extraClangDebug/sumo/src/microsim/traffic_lights/MSDriveWay.cpp:1196:22
>     #2 0x5d7eb6340b7c in MSDriveWay::getDepartureDriveway(SUMOVehicle const*) /home/delphi/extraClangDebug/sumo/src/microsim/traffic_lights/MSDriveWay.cpp:1865:22
>     #3 0x5d7eb626eb3b in MSRailSignal::initDriveWays(SUMOVehicle const*, bool) /home/delphi/extraClangDebug/sumo/src/microsim/traffic_lights/MSRailSignal.cpp:374:48
>     #4 0x5d7eb62b6bbf in MSRailSignalControl::vehicleStateChanged(SUMOVehicle const*, MSNet::VehicleState, std::__cxx11::basic_string<char, std::char_traits<char>, std::allocator<char>> const&) /home/delphi/extraClangDebug/sumo/src/microsim/traffic_lights/MSRailSignalControl.cpp:87:17
>     #5 0x5d7eb4197a64 in MSNet::informVehicleStateListener(SUMOVehicle const*, MSNet::VehicleState, std::__cxx11::basic_string<char, std::char_traits<char>, std::allocator<char>> const&) /home/delphi/extraClangDebug/sumo/src/microsim/MSNet.cpp:1277:19
>     #6 0x5d7eb480f5b5 in MSBaseVehicle::replaceRoute(std::shared_ptr<MSRoute const>, std::__cxx11::basic_string<char, std::char_traits<char>, std::allocator<char>> const&, bool, int, bool, bool, std::__cxx11::basic_string<char, std::char_traits<char>, std::allocator<char>>*) /home/delphi/extraClangDebug/sumo/src/microsim/MSBaseVehicle.cpp:543:27
>     #7 0x5d7eb45403b0 in MSVehicle::replaceRoute(std::shared_ptr<MSRoute const>, std::__cxx11::basic_string<char, std::char_traits<char>, std::allocator<char>> const&, bool, int, bool, bool, std::__cxx11::basic_string<char, std::char_traits<char>, std::allocator<char>>*) /home/delphi/extraClangDebug/sumo/src/microsim/MSVehicle.cpp:1121:24
>     #8 0x5d7eb4807395 in MSBaseVehicle::replaceRouteEdges(std::vector<MSEdge const*, std::allocator<MSEdge const*>>&, double, double, std::__cxx11::basic_string<char, std::char_traits<char>, std::allocator<char>> const&, bool, bool, bool, std::__cxx11::basic_string<char, std::char_traits<char>, std::allocator<char>>*) /home/delphi/extraClangDebug/sumo/src/microsim/MSBaseVehicle.cpp:479:10
>     #9 0x5d7eb4801a96 in MSBaseVehicle::reroute(long long, std::__cxx11::basic_string<char, std::char_traits<char>, std::allocator<char>> const&, SUMOAbstractRouter<MSEdge, SUMOVehicle>&, bool, bool, bool, MSEdge const*) /home/delphi/extraClangDebug/sumo/src/microsim/MSBaseVehicle.cpp:404:5
>     #10 0x5d7eb5a68401 in MSRoutingEngine::reroute(SUMOVehicle&, long long, std::__cxx11::basic_string<char, std::char_traits<char>, std::allocator<char>> const&, bool, bool, std::vector<MSEdge*, std::allocator<MSEdge*>> const&) /home/delphi/extraClangDebug/sumo/src/microsim/devices/MSRoutingEngine.cpp:464:17
>     #11 0x5d7eb583c979 in MSDevice_Routing::reroute(long long, bool) /home/delphi/extraClangDebug/sumo/src/microsim/devices/MSDevice_Routing.cpp:298:5
>     #12 0x5d7eb5838370 in MSDevice_Routing::preInsertionReroute(long long) /home/delphi/extraClangDebug/sumo/src/microsim/devices/MSDevice_Routing.cpp:263:13
>     #13 0x5d7eb5841c18 in WrappingCommand<MSDevice_Routing>::execute(long long) /home/delphi/extraClangDebug/sumo/src/utils/common/WrappingCommand.h:104:16
>     #14 0x5d7eb49a91ad in MSEventControl::execute(long long) /home/delphi/extraClangDebug/sumo/src/microsim/MSEventControl.cpp:69:33
>     #15 0x5d7eb4158300 in MSNet::simulationStep(bool) /home/delphi/extraClangDebug/sumo/src/microsim/MSNet.cpp:824:24
>     #16 0x5d7eb4152368 in MSNet::simulate(long long, long long) /home/delphi/extraClangDebug/sumo/src/microsim/MSNet.cpp:412:9
>     #17 0x5d7eb413e865 in main /home/delphi/extraClangDebug/sumo/src/sumo_main.cpp:100:30
>     #18 0x76cba122a1c9 in __libc_start_call_main csu/../sysdeps/nptl/libc_start_call_main.h:58:16
>     #19 0x76cba122a28a in __libc_start_main csu/../csu/libc-start.c:360:3
>     #20 0x5d7eb4061444 in _start (/home/delphi/extraClangDebug/sumo/bin/sumoD+0x2483444) (BuildId: 2def77f78b0d3ed8747c35d0286147d2dede0b5f)
<truncated after showing first 30 lines>

TEST FAILED on ts-sim-build-ba : traci trafficlight constraints swap redundant_2 ( Last six runs Oct2024 )

---------- Differences in errors ----------
0a1,3
>   warnings.warn("Could not import libsumo, falling back to pure python traci (%s)." % e)
> /home/delphi/extraClangDebug/sumo/src/utils/common/SUMOTime.cpp:75:15: runtime error: negation of -9223372036854775808 cannot be represented in type 'long long'; cast to an unsigned type to negate this value to itself
> SUMMARY: UndefinedBehaviorSanitizer: undefined-behavior /home/delphi/extraClangDebug/sumo/src/utils/common/SUMOTime.cpp:75:15 
5a9,179
> 
> =================================================================
> ==4136592==ERROR: LeakSanitizer: detected memory leaks
> 
> Indirect leak of 1584 byte(s) in 2 object(s) allocated from:
>     #0 0x5ba81f8668b1 in operator new(unsigned long) (/home/delphi/extraClangDebug/sumo/bin/sumoD+0x255c8b1) (BuildId: 2def77f78b0d3ed8747c35d0286147d2dede0b5f)
>     #1 0x5ba821a516ce in MSDriveWay::buildDriveWay(std::__cxx11::basic_string<char, std::char_traits<char>, std::allocator<char>> const&, MSLink const*, __gnu_cxx::__normal_iterator<MSEdge const* const*, std::vector<MSEdge const*, std::allocator<MSEdge const*>>>, __gnu_cxx::__normal_iterator<MSEdge const* const*, std::vector<MSEdge const*, std::allocator<MSEdge const*>>>) /home/delphi/extraClangDebug/sumo/src/microsim/traffic_lights/MSDriveWay.cpp:1196:22
>     #2 0x5ba821a6cb7c in MSDriveWay::getDepartureDriveway(SUMOVehicle const*) /home/delphi/extraClangDebug/sumo/src/microsim/traffic_lights/MSDriveWay.cpp:1865:22
>     #3 0x5ba82199ab3b in MSRailSignal::initDriveWays(SUMOVehicle const*, bool) /home/delphi/extraClangDebug/sumo/src/microsim/traffic_lights/MSRailSignal.cpp:374:48
>     #4 0x5ba8219e2bbf in MSRailSignalControl::vehicleStateChanged(SUMOVehicle const*, MSNet::VehicleState, std::__cxx11::basic_string<char, std::char_traits<char>, std::allocator<char>> const&) /home/delphi/extraClangDebug/sumo/src/microsim/traffic_lights/MSRailSignalControl.cpp:87:17
>     #5 0x5ba81f8c3a64 in MSNet::informVehicleStateListener(SUMOVehicle const*, MSNet::VehicleState, std::__cxx11::basic_string<char, std::char_traits<char>, std::allocator<char>> const&) /home/delphi/extraClangDebug/sumo/src/microsim/MSNet.cpp:1277:19
>     #6 0x5ba81ff3b5b5 in MSBaseVehicle::replaceRoute(std::shared_ptr<MSRoute const>, std::__cxx11::basic_string<char, std::char_traits<char>, std::allocator<char>> const&, bool, int, bool, bool, std::__cxx11::basic_string<char, std::char_traits<char>, std::allocator<char>>*) /home/delphi/extraClangDebug/sumo/src/microsim/MSBaseVehicle.cpp:543:27
>     #7 0x5ba81fc6c3b0 in MSVehicle::replaceRoute(std::shared_ptr<MSRoute const>, std::__cxx11::basic_string<char, std::char_traits<char>, std::allocator<char>> const&, bool, int, bool, bool, std::__cxx11::basic_string<char, std::char_traits<char>, std::allocator<char>>*) /home/delphi/extraClangDebug/sumo/src/microsim/MSVehicle.cpp:1121:24
>     #8 0x5ba81ff33395 in MSBaseVehicle::replaceRouteEdges(std::vector<MSEdge const*, std::allocator<MSEdge const*>>&, double, double, std::__cxx11::basic_string<char, std::char_traits<char>, std::allocator<char>> const&, bool, bool, bool, std::__cxx11::basic_string<char, std::char_traits<char>, std::allocator<char>>*) /home/delphi/extraClangDebug/sumo/src/microsim/MSBaseVehicle.cpp:479:10
>     #9 0x5ba81ff2da96 in MSBaseVehicle::reroute(long long, std::__cxx11::basic_string<char, std::char_traits<char>, std::allocator<char>> const&, SUMOAbstractRouter<MSEdge, SUMOVehicle>&, bool, bool, bool, MSEdge const*) /home/delphi/extraClangDebug/sumo/src/microsim/MSBaseVehicle.cpp:404:5
>     #10 0x5ba821194401 in MSRoutingEngine::reroute(SUMOVehicle&, long long, std::__cxx11::basic_string<char, std::char_traits<char>, std::allocator<char>> const&, bool, bool, std::vector<MSEdge*, std::allocator<MSEdge*>> const&) /home/delphi/extraClangDebug/sumo/src/microsim/devices/MSRoutingEngine.cpp:464:17
>     #11 0x5ba820f68979 in MSDevice_Routing::reroute(long long, bool) /home/delphi/extraClangDebug/sumo/src/microsim/devices/MSDevice_Routing.cpp:298:5
>     #12 0x5ba820f64370 in MSDevice_Routing::preInsertionReroute(long long) /home/delphi/extraClangDebug/sumo/src/microsim/devices/MSDevice_Routing.cpp:263:13
>     #13 0x5ba820f6dc18 in WrappingCommand<MSDevice_Routing>::execute(long long) /home/delphi/extraClangDebug/sumo/src/utils/common/WrappingCommand.h:104:16
>     #14 0x5ba8200d51ad in MSEventControl::execute(long long) /home/delphi/extraClangDebug/sumo/src/microsim/MSEventControl.cpp:69:33
>     #15 0x5ba81f884300 in MSNet::simulationStep(bool) /home/delphi/extraClangDebug/sumo/src/microsim/MSNet.cpp:824:24
>     #16 0x5ba81f87e368 in MSNet::simulate(long long, long long) /home/delphi/extraClangDebug/sumo/src/microsim/MSNet.cpp:412:9
>     #17 0x5ba81f86a865 in main /home/delphi/extraClangDebug/sumo/src/sumo_main.cpp:100:30
>     #18 0x7a1d2322a1c9 in __libc_start_call_main csu/../sysdeps/nptl/libc_start_call_main.h:58:16
>     #19 0x7a1d2322a28a in __libc_start_main csu/../csu/libc-start.c:360:3
<truncated after showing first 30 lines>

TEST FAILED on ts-sim-build-ba : traci trafficlight constraints swap redundant_2_routes ( Last six runs Oct2024 )

---------- Differences in errors ----------
0a1
>   warnings.warn("Could not import libsumo, falling back to pure python traci (%s)." % e)
4a6,188
> 
> =================================================================
> ==4136597==ERROR: LeakSanitizer: detected memory leaks
> 
> Indirect leak of 1584 byte(s) in 2 object(s) allocated from:
>     #0 0x5de07c5488b1 in operator new(unsigned long) (/home/delphi/extraClangDebug/sumo/bin/sumoD+0x255c8b1) (BuildId: 2def77f78b0d3ed8747c35d0286147d2dede0b5f)
>     #1 0x5de07e7336ce in MSDriveWay::buildDriveWay(std::__cxx11::basic_string<char, std::char_traits<char>, std::allocator<char>> const&, MSLink const*, __gnu_cxx::__normal_iterator<MSEdge const* const*, std::vector<MSEdge const*, std::allocator<MSEdge const*>>>, __gnu_cxx::__normal_iterator<MSEdge const* const*, std::vector<MSEdge const*, std::allocator<MSEdge const*>>>) /home/delphi/extraClangDebug/sumo/src/microsim/traffic_lights/MSDriveWay.cpp:1196:22
>     #2 0x5de07e74eb7c in MSDriveWay::getDepartureDriveway(SUMOVehicle const*) /home/delphi/extraClangDebug/sumo/src/microsim/traffic_lights/MSDriveWay.cpp:1865:22
>     #3 0x5de07e67cb3b in MSRailSignal::initDriveWays(SUMOVehicle const*, bool) /home/delphi/extraClangDebug/sumo/src/microsim/traffic_lights/MSRailSignal.cpp:374:48
>     #4 0x5de07e6c4bbf in MSRailSignalControl::vehicleStateChanged(SUMOVehicle const*, MSNet::VehicleState, std::__cxx11::basic_string<char, std::char_traits<char>, std::allocator<char>> const&) /home/delphi/extraClangDebug/sumo/src/microsim/traffic_lights/MSRailSignalControl.cpp:87:17
>     #5 0x5de07c5a5a64 in MSNet::informVehicleStateListener(SUMOVehicle const*, MSNet::VehicleState, std::__cxx11::basic_string<char, std::char_traits<char>, std::allocator<char>> const&) /home/delphi/extraClangDebug/sumo/src/microsim/MSNet.cpp:1277:19
>     #6 0x5de07cb0f7aa in MSVehicleControl::initVehicle(MSBaseVehicle*, bool, bool, MSVehicleControl::VehicleDefinitionSource) /home/delphi/extraClangDebug/sumo/src/microsim/MSVehicleControl.cpp:133:27
>     #7 0x5de07cb0ec9b in MSVehicleControl::buildVehicle(SUMOVehicleParameter*, std::shared_ptr<MSRoute const>, MSVehicleType*, bool, MSVehicleControl::VehicleDefinitionSource, bool) /home/delphi/extraClangDebug/sumo/src/microsim/MSVehicleControl.cpp:116:5
>     #8 0x5de07c803cf7 in MSRouteHandler::closeVehicle() /home/delphi/extraClangDebug/sumo/src/microsim/MSRouteHandler.cpp:670:34
>     #9 0x5de07ee3b7d7 in SUMORouteHandler::myEndElement(int) /home/delphi/extraClangDebug/sumo/src/utils/vehicle/SUMORouteHandler.cpp:267:17
>     #10 0x5de07f0164db in GenericSAXHandler::endElement(char16_t const*, char16_t const*, char16_t const*) /home/delphi/extraClangDebug/sumo/src/utils/xml/GenericSAXHandler.cpp:167:9
>     #11 0x781d237e68f2 in xercesc_3_2::SAX2XMLReaderImpl::endElement(xercesc_3_2::XMLElementDecl const&, unsigned int, bool, char16_t const*) (/lib/x86_64-linux-gnu/libxerces-c-3.2.so+0x1e68f2) (BuildId: 00c66a49d1bfc9237096cfb0829bac6c9c2c8e81)
>     #12 0x781d2379aef0 in xercesc_3_2::IGXMLScanner::scanEndTag(bool&) (/lib/x86_64-linux-gnu/libxerces-c-3.2.so+0x19aef0) (BuildId: 00c66a49d1bfc9237096cfb0829bac6c9c2c8e81)
>     #13 0x781d2379b8fb in xercesc_3_2::IGXMLScanner::scanNext(xercesc_3_2::XMLPScanToken&) (/lib/x86_64-linux-gnu/libxerces-c-3.2.so+0x19b8fb) (BuildId: 00c66a49d1bfc9237096cfb0829bac6c9c2c8e81)
>     #14 0x5de07f048b53 in SUMOSAXReader::parseNext() /home/delphi/extraClangDebug/sumo/src/utils/xml/SUMOSAXReader.cpp:158:25
>     #15 0x5de07ee4c68b in SUMORouteLoader::loadUntil(long long) /home/delphi/extraClangDebug/sumo/src/utils/vehicle/SUMORouteLoader.cpp:58:24
>     #16 0x5de07ee4d7ef in SUMORouteLoaderControl::loadNext(long long) /home/delphi/extraClangDebug/sumo/src/utils/vehicle/SUMORouteLoaderControl.cpp:72:61
>     #17 0x5de07c56f322 in MSNet::loadRoutes() /home/delphi/extraClangDebug/sumo/src/microsim/MSNet.cpp:441:21
>     #18 0x5de07d604d8a in NLBuilder::init(bool) /home/delphi/extraClangDebug/sumo/src/netload/NLBuilder.cpp:354:14
>     #19 0x5de07c54c4a2 in main /home/delphi/extraClangDebug/sumo/src/sumo_main.cpp:98:19
>     #20 0x781d2242a1c9 in __libc_start_call_main csu/../sysdeps/nptl/libc_start_call_main.h:58:16
>     #21 0x781d2242a28a in __libc_start_main csu/../csu/libc-start.c:360:3
<truncated after showing first 30 lines>

TEST FAILED on ts-sim-build-ba : traci trafficlight constraints swapConstraints ( Last six runs Oct2024 )

---------- Differences in errors ----------
0a1,3
>   warnings.warn("Could not import libsumo, falling back to pure python traci (%s)." % e)
> /home/delphi/extraClangDebug/sumo/src/utils/common/SUMOTime.cpp:75:15: runtime error: negation of -9223372036854775808 cannot be represented in type 'long long'; cast to an unsigned type to negate this value to itself
> SUMMARY: UndefinedBehaviorSanitizer: undefined-behavior /home/delphi/extraClangDebug/sumo/src/utils/common/SUMOTime.cpp:75:15 
1a5,175
> 
> =================================================================
> ==4136452==ERROR: LeakSanitizer: detected memory leaks
> 
> Indirect leak of 2376 byte(s) in 3 object(s) allocated from:
>     #0 0x650a1a95a8b1 in operator new(unsigned long) (/home/delphi/extraClangDebug/sumo/bin/sumoD+0x255c8b1) (BuildId: 2def77f78b0d3ed8747c35d0286147d2dede0b5f)
>     #1 0x650a1cb456ce in MSDriveWay::buildDriveWay(std::__cxx11::basic_string<char, std::char_traits<char>, std::allocator<char>> const&, MSLink const*, __gnu_cxx::__normal_iterator<MSEdge const* const*, std::vector<MSEdge const*, std::allocator<MSEdge const*>>>, __gnu_cxx::__normal_iterator<MSEdge const* const*, std::vector<MSEdge const*, std::allocator<MSEdge const*>>>) /home/delphi/extraClangDebug/sumo/src/microsim/traffic_lights/MSDriveWay.cpp:1196:22
>     #2 0x650a1cb60b7c in MSDriveWay::getDepartureDriveway(SUMOVehicle const*) /home/delphi/extraClangDebug/sumo/src/microsim/traffic_lights/MSDriveWay.cpp:1865:22
>     #3 0x650a1ca8eb3b in MSRailSignal::initDriveWays(SUMOVehicle const*, bool) /home/delphi/extraClangDebug/sumo/src/microsim/traffic_lights/MSRailSignal.cpp:374:48
>     #4 0x650a1cad6bbf in MSRailSignalControl::vehicleStateChanged(SUMOVehicle const*, MSNet::VehicleState, std::__cxx11::basic_string<char, std::char_traits<char>, std::allocator<char>> const&) /home/delphi/extraClangDebug/sumo/src/microsim/traffic_lights/MSRailSignalControl.cpp:87:17
>     #5 0x650a1a9b7a64 in MSNet::informVehicleStateListener(SUMOVehicle const*, MSNet::VehicleState, std::__cxx11::basic_string<char, std::char_traits<char>, std::allocator<char>> const&) /home/delphi/extraClangDebug/sumo/src/microsim/MSNet.cpp:1277:19
>     #6 0x650a1b02f5b5 in MSBaseVehicle::replaceRoute(std::shared_ptr<MSRoute const>, std::__cxx11::basic_string<char, std::char_traits<char>, std::allocator<char>> const&, bool, int, bool, bool, std::__cxx11::basic_string<char, std::char_traits<char>, std::allocator<char>>*) /home/delphi/extraClangDebug/sumo/src/microsim/MSBaseVehicle.cpp:543:27
>     #7 0x650a1ad603b0 in MSVehicle::replaceRoute(std::shared_ptr<MSRoute const>, std::__cxx11::basic_string<char, std::char_traits<char>, std::allocator<char>> const&, bool, int, bool, bool, std::__cxx11::basic_string<char, std::char_traits<char>, std::allocator<char>>*) /home/delphi/extraClangDebug/sumo/src/microsim/MSVehicle.cpp:1121:24
>     #8 0x650a1b027395 in MSBaseVehicle::replaceRouteEdges(std::vector<MSEdge const*, std::allocator<MSEdge const*>>&, double, double, std::__cxx11::basic_string<char, std::char_traits<char>, std::allocator<char>> const&, bool, bool, bool, std::__cxx11::basic_string<char, std::char_traits<char>, std::allocator<char>>*) /home/delphi/extraClangDebug/sumo/src/microsim/MSBaseVehicle.cpp:479:10
>     #9 0x650a1b021a96 in MSBaseVehicle::reroute(long long, std::__cxx11::basic_string<char, std::char_traits<char>, std::allocator<char>> const&, SUMOAbstractRouter<MSEdge, SUMOVehicle>&, bool, bool, bool, MSEdge const*) /home/delphi/extraClangDebug/sumo/src/microsim/MSBaseVehicle.cpp:404:5
>     #10 0x650a1c288401 in MSRoutingEngine::reroute(SUMOVehicle&, long long, std::__cxx11::basic_string<char, std::char_traits<char>, std::allocator<char>> const&, bool, bool, std::vector<MSEdge*, std::allocator<MSEdge*>> const&) /home/delphi/extraClangDebug/sumo/src/microsim/devices/MSRoutingEngine.cpp:464:17
>     #11 0x650a1c05c979 in MSDevice_Routing::reroute(long long, bool) /home/delphi/extraClangDebug/sumo/src/microsim/devices/MSDevice_Routing.cpp:298:5
>     #12 0x650a1c058370 in MSDevice_Routing::preInsertionReroute(long long) /home/delphi/extraClangDebug/sumo/src/microsim/devices/MSDevice_Routing.cpp:263:13
>     #13 0x650a1c061c18 in WrappingCommand<MSDevice_Routing>::execute(long long) /home/delphi/extraClangDebug/sumo/src/utils/common/WrappingCommand.h:104:16
>     #14 0x650a1b1c91ad in MSEventControl::execute(long long) /home/delphi/extraClangDebug/sumo/src/microsim/MSEventControl.cpp:69:33
>     #15 0x650a1a978300 in MSNet::simulationStep(bool) /home/delphi/extraClangDebug/sumo/src/microsim/MSNet.cpp:824:24
>     #16 0x650a1a972368 in MSNet::simulate(long long, long long) /home/delphi/extraClangDebug/sumo/src/microsim/MSNet.cpp:412:9
>     #17 0x650a1a95e865 in main /home/delphi/extraClangDebug/sumo/src/sumo_main.cpp:100:30
>     #18 0x72b80ca2a1c9 in __libc_start_call_main csu/../sysdeps/nptl/libc_start_call_main.h:58:16
>     #19 0x72b80ca2a28a in __libc_start_main csu/../csu/libc-start.c:360:3
<truncated after showing first 30 lines>

TEST FAILED on ts-sim-build-ba : traci trafficlight constraints swapConstraints_loadState ( Last six runs Oct2024 )

---------- Differences in errors ----------
0a1,3
>   warnings.warn("Could not import libsumo, falling back to pure python traci (%s)." % e)
> /home/delphi/extraClangDebug/sumo/src/utils/common/SUMOTime.cpp:75:15: runtime error: negation of -9223372036854775808 cannot be represented in type 'long long'; cast to an unsigned type to negate this value to itself
> SUMMARY: UndefinedBehaviorSanitizer: undefined-behavior /home/delphi/extraClangDebug/sumo/src/utils/common/SUMOTime.cpp:75:15 
2a6,176
> 
> =================================================================
> ==4136460==ERROR: LeakSanitizer: detected memory leaks
> 
> Indirect leak of 2376 byte(s) in 3 object(s) allocated from:
>     #0 0x617dbc16f8b1 in operator new(unsigned long) (/home/delphi/extraClangDebug/sumo/bin/sumoD+0x255c8b1) (BuildId: 2def77f78b0d3ed8747c35d0286147d2dede0b5f)
>     #1 0x617dbe35a6ce in MSDriveWay::buildDriveWay(std::__cxx11::basic_string<char, std::char_traits<char>, std::allocator<char>> const&, MSLink const*, __gnu_cxx::__normal_iterator<MSEdge const* const*, std::vector<MSEdge const*, std::allocator<MSEdge const*>>>, __gnu_cxx::__normal_iterator<MSEdge const* const*, std::vector<MSEdge const*, std::allocator<MSEdge const*>>>) /home/delphi/extraClangDebug/sumo/src/microsim/traffic_lights/MSDriveWay.cpp:1196:22
>     #2 0x617dbe375b7c in MSDriveWay::getDepartureDriveway(SUMOVehicle const*) /home/delphi/extraClangDebug/sumo/src/microsim/traffic_lights/MSDriveWay.cpp:1865:22
>     #3 0x617dbe2a3b3b in MSRailSignal::initDriveWays(SUMOVehicle const*, bool) /home/delphi/extraClangDebug/sumo/src/microsim/traffic_lights/MSRailSignal.cpp:374:48
>     #4 0x617dbe2ebbbf in MSRailSignalControl::vehicleStateChanged(SUMOVehicle const*, MSNet::VehicleState, std::__cxx11::basic_string<char, std::char_traits<char>, std::allocator<char>> const&) /home/delphi/extraClangDebug/sumo/src/microsim/traffic_lights/MSRailSignalControl.cpp:87:17
>     #5 0x617dbc1cca64 in MSNet::informVehicleStateListener(SUMOVehicle const*, MSNet::VehicleState, std::__cxx11::basic_string<char, std::char_traits<char>, std::allocator<char>> const&) /home/delphi/extraClangDebug/sumo/src/microsim/MSNet.cpp:1277:19
>     #6 0x617dbc8445b5 in MSBaseVehicle::replaceRoute(std::shared_ptr<MSRoute const>, std::__cxx11::basic_string<char, std::char_traits<char>, std::allocator<char>> const&, bool, int, bool, bool, std::__cxx11::basic_string<char, std::char_traits<char>, std::allocator<char>>*) /home/delphi/extraClangDebug/sumo/src/microsim/MSBaseVehicle.cpp:543:27
>     #7 0x617dbc5753b0 in MSVehicle::replaceRoute(std::shared_ptr<MSRoute const>, std::__cxx11::basic_string<char, std::char_traits<char>, std::allocator<char>> const&, bool, int, bool, bool, std::__cxx11::basic_string<char, std::char_traits<char>, std::allocator<char>>*) /home/delphi/extraClangDebug/sumo/src/microsim/MSVehicle.cpp:1121:24
>     #8 0x617dbc83c395 in MSBaseVehicle::replaceRouteEdges(std::vector<MSEdge const*, std::allocator<MSEdge const*>>&, double, double, std::__cxx11::basic_string<char, std::char_traits<char>, std::allocator<char>> const&, bool, bool, bool, std::__cxx11::basic_string<char, std::char_traits<char>, std::allocator<char>>*) /home/delphi/extraClangDebug/sumo/src/microsim/MSBaseVehicle.cpp:479:10
>     #9 0x617dbc836a96 in MSBaseVehicle::reroute(long long, std::__cxx11::basic_string<char, std::char_traits<char>, std::allocator<char>> const&, SUMOAbstractRouter<MSEdge, SUMOVehicle>&, bool, bool, bool, MSEdge const*) /home/delphi/extraClangDebug/sumo/src/microsim/MSBaseVehicle.cpp:404:5
>     #10 0x617dbda9d401 in MSRoutingEngine::reroute(SUMOVehicle&, long long, std::__cxx11::basic_string<char, std::char_traits<char>, std::allocator<char>> const&, bool, bool, std::vector<MSEdge*, std::allocator<MSEdge*>> const&) /home/delphi/extraClangDebug/sumo/src/microsim/devices/MSRoutingEngine.cpp:464:17
>     #11 0x617dbd871979 in MSDevice_Routing::reroute(long long, bool) /home/delphi/extraClangDebug/sumo/src/microsim/devices/MSDevice_Routing.cpp:298:5
>     #12 0x617dbd86d370 in MSDevice_Routing::preInsertionReroute(long long) /home/delphi/extraClangDebug/sumo/src/microsim/devices/MSDevice_Routing.cpp:263:13
>     #13 0x617dbd876c18 in WrappingCommand<MSDevice_Routing>::execute(long long) /home/delphi/extraClangDebug/sumo/src/utils/common/WrappingCommand.h:104:16
>     #14 0x617dbc9de1ad in MSEventControl::execute(long long) /home/delphi/extraClangDebug/sumo/src/microsim/MSEventControl.cpp:69:33
>     #15 0x617dbc18d300 in MSNet::simulationStep(bool) /home/delphi/extraClangDebug/sumo/src/microsim/MSNet.cpp:824:24
>     #16 0x617dbc187368 in MSNet::simulate(long long, long long) /home/delphi/extraClangDebug/sumo/src/microsim/MSNet.cpp:412:9
>     #17 0x617dbc173865 in main /home/delphi/extraClangDebug/sumo/src/sumo_main.cpp:100:30
>     #18 0x71187282a1c9 in __libc_start_call_main csu/../sysdeps/nptl/libc_start_call_main.h:58:16
>     #19 0x71187282a28a in __libc_start_main csu/../csu/libc-start.c:360:3
<truncated after showing first 30 lines>

TEST FAILED on ts-sim-build-ba : traci trafficlight constraints updateConstraints ( Last six runs Oct2024 )

---------- Differences in errors ----------
0a1,402
>   warnings.warn("Could not import libsumo, falling back to pure python traci (%s)." % e)
> 
> =================================================================
> ==4136496==ERROR: LeakSanitizer: detected memory leaks
> 
> Direct leak of 792 byte(s) in 1 object(s) allocated from:
>     #0 0x594e9eb948b1 in operator new(unsigned long) (/home/delphi/extraClangDebug/sumo/bin/sumoD+0x255c8b1) (BuildId: 2def77f78b0d3ed8747c35d0286147d2dede0b5f)
>     #1 0x594ea0d92a6a in MSDriveWay::buildSubFoe(MSDriveWay*, bool) /home/delphi/extraClangDebug/sumo/src/microsim/traffic_lights/MSDriveWay.cpp:1675:23
>     #2 0x594ea0d84838 in MSDriveWay::buildDriveWay(std::__cxx11::basic_string<char, std::char_traits<char>, std::allocator<char>> const&, MSLink const*, __gnu_cxx::__normal_iterator<MSEdge const* const*, std::vector<MSEdge const*, std::allocator<MSEdge const*>>>, __gnu_cxx::__normal_iterator<MSEdge const* const*, std::vector<MSEdge const*, std::allocator<MSEdge const*>>>) /home/delphi/extraClangDebug/sumo/src/microsim/traffic_lights/MSDriveWay.cpp:1292:22
>     #3 0x594ea0ccdb95 in MSRailSignal::LinkInfo::getDriveWay(__gnu_cxx::__normal_iterator<MSEdge const* const*, std::vector<MSEdge const*, std::allocator<MSEdge const*>>>, __gnu_cxx::__normal_iterator<MSEdge const* const*, std::vector<MSEdge const*, std::allocator<MSEdge const*>>>, std::__cxx11::basic_string<char, std::char_traits<char>, std::allocator<char>> const&) /home/delphi/extraClangDebug/sumo/src/microsim/traffic_lights/MSRailSignal.cpp:522:22
>     #4 0x594ea0cc22ca in MSRailSignal::LinkInfo::getDriveWay(SUMOVehicle const*) /home/delphi/extraClangDebug/sumo/src/microsim/traffic_lights/MSRailSignal.cpp:505:12
>     #5 0x594ea0cc9b76 in MSRailSignal::initDriveWays(SUMOVehicle const*, bool) /home/delphi/extraClangDebug/sumo/src/microsim/traffic_lights/MSRailSignal.cpp:386:50
>     #6 0x594ea0d10bbf in MSRailSignalControl::vehicleStateChanged(SUMOVehicle const*, MSNet::VehicleState, std::__cxx11::basic_string<char, std::char_traits<char>, std::allocator<char>> const&) /home/delphi/extraClangDebug/sumo/src/microsim/traffic_lights/MSRailSignalControl.cpp:87:17
>     #7 0x594e9ebf1a64 in MSNet::informVehicleStateListener(SUMOVehicle const*, MSNet::VehicleState, std::__cxx11::basic_string<char, std::char_traits<char>, std::allocator<char>> const&) /home/delphi/extraClangDebug/sumo/src/microsim/MSNet.cpp:1277:19
>     #8 0x594e9f15b7aa in MSVehicleControl::initVehicle(MSBaseVehicle*, bool, bool, MSVehicleControl::VehicleDefinitionSource) /home/delphi/extraClangDebug/sumo/src/microsim/MSVehicleControl.cpp:133:27
>     #9 0x594e9f15ac9b in MSVehicleControl::buildVehicle(SUMOVehicleParameter*, std::shared_ptr<MSRoute const>, MSVehicleType*, bool, MSVehicleControl::VehicleDefinitionSource, bool) /home/delphi/extraClangDebug/sumo/src/microsim/MSVehicleControl.cpp:116:5
>     #10 0x594e9ee4fcf7 in MSRouteHandler::closeVehicle() /home/delphi/extraClangDebug/sumo/src/microsim/MSRouteHandler.cpp:670:34
>     #11 0x594ea14877d7 in SUMORouteHandler::myEndElement(int) /home/delphi/extraClangDebug/sumo/src/utils/vehicle/SUMORouteHandler.cpp:267:17
>     #12 0x594ea16624db in GenericSAXHandler::endElement(char16_t const*, char16_t const*, char16_t const*) /home/delphi/extraClangDebug/sumo/src/utils/xml/GenericSAXHandler.cpp:167:9
>     #13 0x7703793e68f2 in xercesc_3_2::SAX2XMLReaderImpl::endElement(xercesc_3_2::XMLElementDecl const&, unsigned int, bool, char16_t const*) (/lib/x86_64-linux-gnu/libxerces-c-3.2.so+0x1e68f2) (BuildId: 00c66a49d1bfc9237096cfb0829bac6c9c2c8e81)
>     #14 0x77037939aef0 in xercesc_3_2::IGXMLScanner::scanEndTag(bool&) (/lib/x86_64-linux-gnu/libxerces-c-3.2.so+0x19aef0) (BuildId: 00c66a49d1bfc9237096cfb0829bac6c9c2c8e81)
>     #15 0x77037939b8fb in xercesc_3_2::IGXMLScanner::scanNext(xercesc_3_2::XMLPScanToken&) (/lib/x86_64-linux-gnu/libxerces-c-3.2.so+0x19b8fb) (BuildId: 00c66a49d1bfc9237096cfb0829bac6c9c2c8e81)
>     #16 0x594ea1694b53 in SUMOSAXReader::parseNext() /home/delphi/extraClangDebug/sumo/src/utils/xml/SUMOSAXReader.cpp:158:25
>     #17 0x594ea149868b in SUMORouteLoader::loadUntil(long long) /home/delphi/extraClangDebug/sumo/src/utils/vehicle/SUMORouteLoader.cpp:58:24
>     #18 0x594ea14997ef in SUMORouteLoaderControl::loadNext(long long) /home/delphi/extraClangDebug/sumo/src/utils/vehicle/SUMORouteLoaderControl.cpp:72:61
>     #19 0x594e9ebbb322 in MSNet::loadRoutes() /home/delphi/extraClangDebug/sumo/src/microsim/MSNet.cpp:441:21
>     #20 0x594e9fc50d8a in NLBuilder::init(bool) /home/delphi/extraClangDebug/sumo/src/netload/NLBuilder.cpp:354:14
>     #21 0x594e9eb984a2 in main /home/delphi/extraClangDebug/sumo/src/sumo_main.cpp:98:19
>     #22 0x77037802a1c9 in __libc_start_call_main csu/../sysdeps/nptl/libc_start_call_main.h:58:16
<truncated after showing first 30 lines>

5 TESTS FAILED on ts-sim-build-ba :

---------- Differences in errors ----------
0a1
>   warnings.warn("Could not import libsumo, falling back to pure python traci (%s)." % e)
4a6,8
> -- Unordered text as found by filter '^UserWarning:' --
> UserWarning: Could not import libsumo, falling back to pure python traci (cannot import name '_libsumo' from partially initialized module 'libsumo' (most likely due to a circular import) (/home/delphi/extraClangDebug/sumo/tools/libsumo/__init__.py)).
> 
traci trafficlight crossings ( Last six runs Oct2024 )
traci trafficlight crossings_twoSided ( Last six runs Oct2024 )
traci vehicle lateralCollision sublaneChanging leftLane0.2 ( Last six runs Oct2024 )
traci vehicle lateralCollision sublaneChanging rightLane0.2 ( Last six runs Oct2024 )
traci vehicletype save_and_load_vtype_params ( Last six runs Oct2024 )

TEST FAILED on ts-sim-build-ba : traci trafficlight getBlocking_reroute ( Last six runs Oct2024 )

---------- Differences in errors ----------
0a1,434
>   warnings.warn("Could not import libsumo, falling back to pure python traci (%s)." % e)
> /home/delphi/extraClangDebug/sumo/src/utils/common/SUMOTime.cpp:75:15: runtime error: negation of -9223372036854775808 cannot be represented in type 'long long'; cast to an unsigned type to negate this value to itself
> SUMMARY: UndefinedBehaviorSanitizer: undefined-behavior /home/delphi/extraClangDebug/sumo/src/utils/common/SUMOTime.cpp:75:15 
> 
> =================================================================
> ==4136823==ERROR: LeakSanitizer: detected memory leaks
> 
> Direct leak of 792 byte(s) in 1 object(s) allocated from:
>     #0 0x575b4d7fb8b1 in operator new(unsigned long) (/home/delphi/extraClangDebug/sumo/bin/sumoD+0x255c8b1) (BuildId: 2def77f78b0d3ed8747c35d0286147d2dede0b5f)
>     #1 0x575b4f9f9a6a in MSDriveWay::buildSubFoe(MSDriveWay*, bool) /home/delphi/extraClangDebug/sumo/src/microsim/traffic_lights/MSDriveWay.cpp:1675:23
>     #2 0x575b4f9eb316 in MSDriveWay::buildDriveWay(std::__cxx11::basic_string<char, std::char_traits<char>, std::allocator<char>> const&, MSLink const*, __gnu_cxx::__normal_iterator<MSEdge const* const*, std::vector<MSEdge const*, std::allocator<MSEdge const*>>>, __gnu_cxx::__normal_iterator<MSEdge const* const*, std::vector<MSEdge const*, std::allocator<MSEdge const*>>>) /home/delphi/extraClangDebug/sumo/src/microsim/traffic_lights/MSDriveWay.cpp:1281:21
>     #3 0x575b4f934b95 in MSRailSignal::LinkInfo::getDriveWay(__gnu_cxx::__normal_iterator<MSEdge const* const*, std::vector<MSEdge const*, std::allocator<MSEdge const*>>>, __gnu_cxx::__normal_iterator<MSEdge const* const*, std::vector<MSEdge const*, std::allocator<MSEdge const*>>>, std::__cxx11::basic_string<char, std::char_traits<char>, std::allocator<char>> const&) /home/delphi/extraClangDebug/sumo/src/microsim/traffic_lights/MSRailSignal.cpp:522:22
>     #4 0x575b4f9292ca in MSRailSignal::LinkInfo::getDriveWay(SUMOVehicle const*) /home/delphi/extraClangDebug/sumo/src/microsim/traffic_lights/MSRailSignal.cpp:505:12
>     #5 0x575b4f9354f2 in MSRailSignal::storeTraCIVehicles(int) /home/delphi/extraClangDebug/sumo/src/microsim/traffic_lights/MSRailSignal.cpp:576:35
>     #6 0x575b4f935ea5 in MSRailSignal::getBlockingVehicles(int) /home/delphi/extraClangDebug/sumo/src/microsim/traffic_lights/MSRailSignal.cpp:591:5
>     #7 0x575b4e749b9f in libsumo::TrafficLight::getBlockingVehicles(std::__cxx11::basic_string<char, std::char_traits<char>, std::allocator<char>> const&, int) /home/delphi/extraClangDebug/sumo/src/libsumo/TrafficLight.cpp:228:43
>     #8 0x575b4e468221 in TraCIServerAPI_TrafficLight::processGet(TraCIServer&, tcpip::Storage&, tcpip::Storage&) /home/delphi/extraClangDebug/sumo/src/traci-server/TraCIServerAPI_TrafficLight.cpp:112:64
>     #9 0x575b4e362a1c in TraCIServer::dispatchCommand() /home/delphi/extraClangDebug/sumo/src/traci-server/TraCIServer.cpp:764:19
>     #10 0x575b4e36d48f in TraCIServer::processCommands(long long, bool) /home/delphi/extraClangDebug/sumo/src/traci-server/TraCIServer.cpp:656:41
>     #11 0x575b4d8148e9 in MSNet::simulationStep(bool) /home/delphi/extraClangDebug/sumo/src/microsim/MSNet.cpp:730:27
>     #12 0x575b4d813368 in MSNet::simulate(long long, long long) /home/delphi/extraClangDebug/sumo/src/microsim/MSNet.cpp:412:9
>     #13 0x575b4d7ff865 in main /home/delphi/extraClangDebug/sumo/src/sumo_main.cpp:100:30
>     #14 0x7e869b82a1c9 in __libc_start_call_main csu/../sysdeps/nptl/libc_start_call_main.h:58:16
>     #15 0x7e869b82a28a in __libc_start_main csu/../csu/libc-start.c:360:3
>     #16 0x575b4d722444 in _start (/home/delphi/extraClangDebug/sumo/bin/sumoD+0x2483444) (BuildId: 2def77f78b0d3ed8747c35d0286147d2dede0b5f)
> 
> Direct leak of 792 byte(s) in 1 object(s) allocated from:
>     #0 0x575b4d7fb8b1 in operator new(unsigned long) (/home/delphi/extraClangDebug/sumo/bin/sumoD+0x255c8b1) (BuildId: 2def77f78b0d3ed8747c35d0286147d2dede0b5f)
>     #1 0x575b4f9f9a6a in MSDriveWay::buildSubFoe(MSDriveWay*, bool) /home/delphi/extraClangDebug/sumo/src/microsim/traffic_lights/MSDriveWay.cpp:1675:23
<truncated after showing first 30 lines>

TEST FAILED on ts-sim-build-ba : traci trafficlight railsignal_state ( Last six runs Oct2024 )

---------- Differences in errors ----------
0a1,3
>   warnings.warn("Could not import libsumo, falling back to pure python traci (%s)." % e)
> /home/delphi/extraClangDebug/sumo/src/utils/common/SUMOTime.cpp:75:15: runtime error: negation of -9223372036854775808 cannot be represented in type 'long long'; cast to an unsigned type to negate this value to itself
> SUMMARY: UndefinedBehaviorSanitizer: undefined-behavior /home/delphi/extraClangDebug/sumo/src/utils/common/SUMOTime.cpp:75:15 
1a5,702
> 
> =================================================================
> ==4136824==ERROR: LeakSanitizer: detected memory leaks
> 
> Direct leak of 10296 byte(s) in 13 object(s) allocated from:
>     #0 0x64623c7268b1 in operator new(unsigned long) (/home/delphi/extraClangDebug/sumo/bin/sumoD+0x255c8b1) (BuildId: 2def77f78b0d3ed8747c35d0286147d2dede0b5f)
>     #1 0x64623e924a6a in MSDriveWay::buildSubFoe(MSDriveWay*, bool) /home/delphi/extraClangDebug/sumo/src/microsim/traffic_lights/MSDriveWay.cpp:1675:23
>     #2 0x64623e916316 in MSDriveWay::buildDriveWay(std::__cxx11::basic_string<char, std::char_traits<char>, std::allocator<char>> const&, MSLink const*, __gnu_cxx::__normal_iterator<MSEdge const* const*, std::vector<MSEdge const*, std::allocator<MSEdge const*>>>, __gnu_cxx::__normal_iterator<MSEdge const* const*, std::vector<MSEdge const*, std::allocator<MSEdge const*>>>) /home/delphi/extraClangDebug/sumo/src/microsim/traffic_lights/MSDriveWay.cpp:1281:21
>     #3 0x64623e85fb95 in MSRailSignal::LinkInfo::getDriveWay(__gnu_cxx::__normal_iterator<MSEdge const* const*, std::vector<MSEdge const*, std::allocator<MSEdge const*>>>, __gnu_cxx::__normal_iterator<MSEdge const* const*, std::vector<MSEdge const*, std::allocator<MSEdge const*>>>, std::__cxx11::basic_string<char, std::char_traits<char>, std::allocator<char>> const&) /home/delphi/extraClangDebug/sumo/src/microsim/traffic_lights/MSRailSignal.cpp:522:22
>     #4 0x64623e8542ca in MSRailSignal::LinkInfo::getDriveWay(SUMOVehicle const*) /home/delphi/extraClangDebug/sumo/src/microsim/traffic_lights/MSRailSignal.cpp:505:12
>     #5 0x64623e85bb76 in MSRailSignal::initDriveWays(SUMOVehicle const*, bool) /home/delphi/extraClangDebug/sumo/src/microsim/traffic_lights/MSRailSignal.cpp:386:50
>     #6 0x64623e8a2bbf in MSRailSignalControl::vehicleStateChanged(SUMOVehicle const*, MSNet::VehicleState, std::__cxx11::basic_string<char, std::char_traits<char>, std::allocator<char>> const&) /home/delphi/extraClangDebug/sumo/src/microsim/traffic_lights/MSRailSignalControl.cpp:87:17
>     #7 0x64623c783a64 in MSNet::informVehicleStateListener(SUMOVehicle const*, MSNet::VehicleState, std::__cxx11::basic_string<char, std::char_traits<char>, std::allocator<char>> const&) /home/delphi/extraClangDebug/sumo/src/microsim/MSNet.cpp:1277:19
>     #8 0x64623cdfb5b5 in MSBaseVehicle::replaceRoute(std::shared_ptr<MSRoute const>, std::__cxx11::basic_string<char, std::char_traits<char>, std::allocator<char>> const&, bool, int, bool, bool, std::__cxx11::basic_string<char, std::char_traits<char>, std::allocator<char>>*) /home/delphi/extraClangDebug/sumo/src/microsim/MSBaseVehicle.cpp:543:27
>     #9 0x64623cb2c3b0 in MSVehicle::replaceRoute(std::shared_ptr<MSRoute const>, std::__cxx11::basic_string<char, std::char_traits<char>, std::allocator<char>> const&, bool, int, bool, bool, std::__cxx11::basic_string<char, std::char_traits<char>, std::allocator<char>>*) /home/delphi/extraClangDebug/sumo/src/microsim/MSVehicle.cpp:1121:24
>     #10 0x64623cdf3395 in MSBaseVehicle::replaceRouteEdges(std::vector<MSEdge const*, std::allocator<MSEdge const*>>&, double, double, std::__cxx11::basic_string<char, std::char_traits<char>, std::allocator<char>> const&, bool, bool, bool, std::__cxx11::basic_string<char, std::char_traits<char>, std::allocator<char>>*) /home/delphi/extraClangDebug/sumo/src/microsim/MSBaseVehicle.cpp:479:10
>     #11 0x64623cdeda96 in MSBaseVehicle::reroute(long long, std::__cxx11::basic_string<char, std::char_traits<char>, std::allocator<char>> const&, SUMOAbstractRouter<MSEdge, SUMOVehicle>&, bool, bool, bool, MSEdge const*) /home/delphi/extraClangDebug/sumo/src/microsim/MSBaseVehicle.cpp:404:5
>     #12 0x64623e054401 in MSRoutingEngine::reroute(SUMOVehicle&, long long, std::__cxx11::basic_string<char, std::char_traits<char>, std::allocator<char>> const&, bool, bool, std::vector<MSEdge*, std::allocator<MSEdge*>> const&) /home/delphi/extraClangDebug/sumo/src/microsim/devices/MSRoutingEngine.cpp:464:17
>     #13 0x64623de28979 in MSDevice_Routing::reroute(long long, bool) /home/delphi/extraClangDebug/sumo/src/microsim/devices/MSDevice_Routing.cpp:298:5
>     #14 0x64623de24370 in MSDevice_Routing::preInsertionReroute(long long) /home/delphi/extraClangDebug/sumo/src/microsim/devices/MSDevice_Routing.cpp:263:13
>     #15 0x64623de2dc18 in WrappingCommand<MSDevice_Routing>::execute(long long) /home/delphi/extraClangDebug/sumo/src/utils/common/WrappingCommand.h:104:16
>     #16 0x64623cf951ad in MSEventControl::execute(long long) /home/delphi/extraClangDebug/sumo/src/microsim/MSEventControl.cpp:69:33
>     #17 0x64623c744300 in MSNet::simulationStep(bool) /home/delphi/extraClangDebug/sumo/src/microsim/MSNet.cpp:824:24
>     #18 0x64623c73e368 in MSNet::simulate(long long, long long) /home/delphi/extraClangDebug/sumo/src/microsim/MSNet.cpp:412:9
>     #19 0x64623c72a865 in main /home/delphi/extraClangDebug/sumo/src/sumo_main.cpp:100:30
<truncated after showing first 30 lines>

TEST FAILED on ts-sim-build-ba : traci vehicle insertStop second_teleport_oncoming ( Last six runs Oct2024 )

---------- Differences in errors ----------
0a1,3
>   warnings.warn("Could not import libsumo, falling back to pure python traci (%s)." % e)
> /home/delphi/extraClangDebug/sumo/src/utils/common/SUMOTime.cpp:75:15: runtime error: negation of -9223372036854775808 cannot be represented in type 'long long'; cast to an unsigned type to negate this value to itself
> SUMMARY: UndefinedBehaviorSanitizer: undefined-behavior /home/delphi/extraClangDebug/sumo/src/utils/common/SUMOTime.cpp:75:15 
2a6,659
> 
> =================================================================
> ==4135266==ERROR: LeakSanitizer: detected memory leaks
> 
> Indirect leak of 792 byte(s) in 1 object(s) allocated from:
>     #0 0x5c646f5a88b1 in operator new(unsigned long) (/home/delphi/extraClangDebug/sumo/bin/sumoD+0x255c8b1) (BuildId: 2def77f78b0d3ed8747c35d0286147d2dede0b5f)
>     #1 0x5c64717936ce in MSDriveWay::buildDriveWay(std::__cxx11::basic_string<char, std::char_traits<char>, std::allocator<char>> const&, MSLink const*, __gnu_cxx::__normal_iterator<MSEdge const* const*, std::vector<MSEdge const*, std::allocator<MSEdge const*>>>, __gnu_cxx::__normal_iterator<MSEdge const* const*, std::vector<MSEdge const*, std::allocator<MSEdge const*>>>) /home/delphi/extraClangDebug/sumo/src/microsim/traffic_lights/MSDriveWay.cpp:1196:22
>     #2 0x5c64717aeb7c in MSDriveWay::getDepartureDriveway(SUMOVehicle const*) /home/delphi/extraClangDebug/sumo/src/microsim/traffic_lights/MSDriveWay.cpp:1865:22
>     #3 0x5c64716dcb3b in MSRailSignal::initDriveWays(SUMOVehicle const*, bool) /home/delphi/extraClangDebug/sumo/src/microsim/traffic_lights/MSRailSignal.cpp:374:48
>     #4 0x5c6471724bbf in MSRailSignalControl::vehicleStateChanged(SUMOVehicle const*, MSNet::VehicleState, std::__cxx11::basic_string<char, std::char_traits<char>, std::allocator<char>> const&) /home/delphi/extraClangDebug/sumo/src/microsim/traffic_lights/MSRailSignalControl.cpp:87:17
>     #5 0x5c646f605a64 in MSNet::informVehicleStateListener(SUMOVehicle const*, MSNet::VehicleState, std::__cxx11::basic_string<char, std::char_traits<char>, std::allocator<char>> const&) /home/delphi/extraClangDebug/sumo/src/microsim/MSNet.cpp:1277:19
>     #6 0x5c646fc7d5b5 in MSBaseVehicle::replaceRoute(std::shared_ptr<MSRoute const>, std::__cxx11::basic_string<char, std::char_traits<char>, std::allocator<char>> const&, bool, int, bool, bool, std::__cxx11::basic_string<char, std::char_traits<char>, std::allocator<char>>*) /home/delphi/extraClangDebug/sumo/src/microsim/MSBaseVehicle.cpp:543:27
>     #7 0x5c646f9ae3b0 in MSVehicle::replaceRoute(std::shared_ptr<MSRoute const>, std::__cxx11::basic_string<char, std::char_traits<char>, std::allocator<char>> const&, bool, int, bool, bool, std::__cxx11::basic_string<char, std::char_traits<char>, std::allocator<char>>*) /home/delphi/extraClangDebug/sumo/src/microsim/MSVehicle.cpp:1121:24
>     #8 0x5c646fc75395 in MSBaseVehicle::replaceRouteEdges(std::vector<MSEdge const*, std::allocator<MSEdge const*>>&, double, double, std::__cxx11::basic_string<char, std::char_traits<char>, std::allocator<char>> const&, bool, bool, bool, std::__cxx11::basic_string<char, std::char_traits<char>, std::allocator<char>>*) /home/delphi/extraClangDebug/sumo/src/microsim/MSBaseVehicle.cpp:479:10
>     #9 0x5c646fc6fa96 in MSBaseVehicle::reroute(long long, std::__cxx11::basic_string<char, std::char_traits<char>, std::allocator<char>> const&, SUMOAbstractRouter<MSEdge, SUMOVehicle>&, bool, bool, bool, MSEdge const*) /home/delphi/extraClangDebug/sumo/src/microsim/MSBaseVehicle.cpp:404:5
>     #10 0x5c6470ed6401 in MSRoutingEngine::reroute(SUMOVehicle&, long long, std::__cxx11::basic_string<char, std::char_traits<char>, std::allocator<char>> const&, bool, bool, std::vector<MSEdge*, std::allocator<MSEdge*>> const&) /home/delphi/extraClangDebug/sumo/src/microsim/devices/MSRoutingEngine.cpp:464:17
>     #11 0x5c6470caa979 in MSDevice_Routing::reroute(long long, bool) /home/delphi/extraClangDebug/sumo/src/microsim/devices/MSDevice_Routing.cpp:298:5
>     #12 0x5c6470ca6370 in MSDevice_Routing::preInsertionReroute(long long) /home/delphi/extraClangDebug/sumo/src/microsim/devices/MSDevice_Routing.cpp:263:13
>     #13 0x5c6470cafc18 in WrappingCommand<MSDevice_Routing>::execute(long long) /home/delphi/extraClangDebug/sumo/src/utils/common/WrappingCommand.h:104:16
>     #14 0x5c646fe171ad in MSEventControl::execute(long long) /home/delphi/extraClangDebug/sumo/src/microsim/MSEventControl.cpp:69:33
>     #15 0x5c646f5c6300 in MSNet::simulationStep(bool) /home/delphi/extraClangDebug/sumo/src/microsim/MSNet.cpp:824:24
>     #16 0x5c646f5c0368 in MSNet::simulate(long long, long long) /home/delphi/extraClangDebug/sumo/src/microsim/MSNet.cpp:412:9
>     #17 0x5c646f5ac865 in main /home/delphi/extraClangDebug/sumo/src/sumo_main.cpp:100:30
>     #18 0x7c5d0782a1c9 in __libc_start_call_main csu/../sysdeps/nptl/libc_start_call_main.h:58:16
>     #19 0x7c5d0782a28a in __libc_start_main csu/../csu/libc-start.c:360:3
<truncated after showing first 30 lines>

TEST FAILED on ts-sim-build-ba : traci vehicle moveToXY keepRoute2 ( Last six runs Oct2024 )

---------- Differences in errors ----------
0a1,4
>   warnings.warn("Could not import libsumo, falling back to pure python traci (%s)." % e)
> -- Unordered text as found by filter '^UserWarning:' --
> UserWarning: Could not import libsumo, falling back to pure python traci (cannot import name '_libsumo' from partially initialized module 'libsumo' (most likely due to a circular import) (/home/delphi/extraClangDebug/sumo/tools/libsumo/__init__.py)).
> 
---------- Differences in output ----------
0a1
> internal corner (inside, segment2) failed: x=198, x2=198.0,   y=1.9, y2=1.9,   lane=middle_0, lane2=middle_0, pos=102, pos2=98.0   posLat=2.0 posLat2=1.9

TEST FAILED on ts-sim-build-ba : traci vehicle replaceStop first_parameter_only ( Last six runs Oct2024 )

---------- Differences in errors ----------
0a1,3
>   warnings.warn("Could not import libsumo, falling back to pure python traci (%s)." % e)
> /home/delphi/extraClangDebug/sumo/src/utils/common/SUMOTime.cpp:75:15: runtime error: negation of -9223372036854775808 cannot be represented in type 'long long'; cast to an unsigned type to negate this value to itself
> SUMMARY: UndefinedBehaviorSanitizer: undefined-behavior /home/delphi/extraClangDebug/sumo/src/utils/common/SUMOTime.cpp:75:15 
3a7,17
> /home/delphi/extraClangDebug/sumo/src/libsumo/Vehicle.cpp:1219:76: runtime error: implicit conversion from type 'int' of value -1 (32-bit, signed) to type 'size_type' (aka 'unsigned long') changed the value to 18446744073709551615 (64-bit, unsigned)
> SUMMARY: UndefinedBehaviorSanitizer: undefined-behavior /home/delphi/extraClangDebug/sumo/src/libsumo/Vehicle.cpp:1219:76 
> /home/delphi/extraClangDebug/sumo/src/libsumo/Vehicle.cpp:1219:74: runtime error: unsigned integer overflow: 1 + 18446744073709551615 cannot be represented in type 'size_type' (aka 'unsigned long')
> SUMMARY: UndefinedBehaviorSanitizer: undefined-behavior /home/delphi/extraClangDebug/sumo/src/libsumo/Vehicle.cpp:1219:74 
> /home/delphi/extraClangDebug/sumo/src/libsumo/Vehicle.cpp:1253:29: runtime error: implicit conversion from type 'int' of value -1 (32-bit, signed) to type 'size_type' (aka 'unsigned long') changed the value to 18446744073709551615 (64-bit, unsigned)
> SUMMARY: UndefinedBehaviorSanitizer: undefined-behavior /home/delphi/extraClangDebug/sumo/src/libsumo/Vehicle.cpp:1253:29 
> /home/delphi/extraClangDebug/sumo/src/libsumo/Vehicle.cpp:1253:43: runtime error: unsigned integer overflow: 18446744073709551615 + 1 cannot be represented in type 'size_type' (aka 'unsigned long')
> SUMMARY: UndefinedBehaviorSanitizer: undefined-behavior /home/delphi/extraClangDebug/sumo/src/libsumo/Vehicle.cpp:1253:43 
> -- Unordered text as found by filter '^UserWarning:' --
> UserWarning: Could not import libsumo, falling back to pure python traci (cannot import name '_libsumo' from partially initialized module 'libsumo' (most likely due to a circular import) (/home/delphi/extraClangDebug/sumo/tools/libsumo/__init__.py)).
> 

TEST FAILED on ts-sim-build-ba : traci vehicle replaceStop first_parameter_only_triggered ( Last six runs Oct2024 )

---------- Differences in errors ----------
0a1,14
>   warnings.warn("Could not import libsumo, falling back to pure python traci (%s)." % e)
> /home/delphi/extraClangDebug/sumo/src/utils/common/SUMOTime.cpp:75:15: runtime error: negation of -9223372036854775808 cannot be represented in type 'long long'; cast to an unsigned type to negate this value to itself
> SUMMARY: UndefinedBehaviorSanitizer: undefined-behavior /home/delphi/extraClangDebug/sumo/src/utils/common/SUMOTime.cpp:75:15 
> /home/delphi/extraClangDebug/sumo/src/libsumo/Vehicle.cpp:1219:76: runtime error: implicit conversion from type 'int' of value -1 (32-bit, signed) to type 'size_type' (aka 'unsigned long') changed the value to 18446744073709551615 (64-bit, unsigned)
> SUMMARY: UndefinedBehaviorSanitizer: undefined-behavior /home/delphi/extraClangDebug/sumo/src/libsumo/Vehicle.cpp:1219:76 
> /home/delphi/extraClangDebug/sumo/src/libsumo/Vehicle.cpp:1219:74: runtime error: unsigned integer overflow: 1 + 18446744073709551615 cannot be represented in type 'size_type' (aka 'unsigned long')
> SUMMARY: UndefinedBehaviorSanitizer: undefined-behavior /home/delphi/extraClangDebug/sumo/src/libsumo/Vehicle.cpp:1219:74 
> /home/delphi/extraClangDebug/sumo/src/libsumo/Vehicle.cpp:1253:29: runtime error: implicit conversion from type 'int' of value -1 (32-bit, signed) to type 'size_type' (aka 'unsigned long') changed the value to 18446744073709551615 (64-bit, unsigned)
> SUMMARY: UndefinedBehaviorSanitizer: undefined-behavior /home/delphi/extraClangDebug/sumo/src/libsumo/Vehicle.cpp:1253:29 
> /home/delphi/extraClangDebug/sumo/src/libsumo/Vehicle.cpp:1253:43: runtime error: unsigned integer overflow: 18446744073709551615 + 1 cannot be represented in type 'size_type' (aka 'unsigned long')
> SUMMARY: UndefinedBehaviorSanitizer: undefined-behavior /home/delphi/extraClangDebug/sumo/src/libsumo/Vehicle.cpp:1253:43 
> -- Unordered text as found by filter '^UserWarning:' --
> UserWarning: Could not import libsumo, falling back to pure python traci (cannot import name '_libsumo' from partially initialized module 'libsumo' (most likely due to a circular import) (/home/delphi/extraClangDebug/sumo/tools/libsumo/__init__.py)).
> 

TEST FAILED on ts-sim-build-ba : traci vehicle replaceStop second_teleport_oncoming ( Last six runs Oct2024 )

---------- Differences in errors ----------
0a1,3
>   warnings.warn("Could not import libsumo, falling back to pure python traci (%s)." % e)
> /home/delphi/extraClangDebug/sumo/src/utils/common/SUMOTime.cpp:75:15: runtime error: negation of -9223372036854775808 cannot be represented in type 'long long'; cast to an unsigned type to negate this value to itself
> SUMMARY: UndefinedBehaviorSanitizer: undefined-behavior /home/delphi/extraClangDebug/sumo/src/utils/common/SUMOTime.cpp:75:15 
1a5,662
> /home/delphi/extraClangDebug/sumo/src/microsim/traffic_lights/MSDriveWay.cpp:1588:36: runtime error: unsigned integer overflow: 1 - 2 cannot be represented in type 'size_type' (aka 'unsigned long')
> SUMMARY: UndefinedBehaviorSanitizer: undefined-behavior /home/delphi/extraClangDebug/sumo/src/microsim/traffic_lights/MSDriveWay.cpp:1588:36 
> /home/delphi/extraClangDebug/sumo/src/microsim/traffic_lights/MSDriveWay.cpp:1588:19: runtime error: implicit conversion from type 'size_type' (aka 'unsigned long') of value 18446744073709551615 (64-bit, unsigned) to type 'int' changed the value to -1 (32-bit, signed)
> SUMMARY: UndefinedBehaviorSanitizer: undefined-behavior /home/delphi/extraClangDebug/sumo/src/microsim/traffic_lights/MSDriveWay.cpp:1588:19 
> 
> =================================================================
> ==4134989==ERROR: LeakSanitizer: detected memory leaks
> 
> Indirect leak of 792 byte(s) in 1 object(s) allocated from:
>     #0 0x5e84d46f48b1 in operator new(unsigned long) (/home/delphi/extraClangDebug/sumo/bin/sumoD+0x255c8b1) (BuildId: 2def77f78b0d3ed8747c35d0286147d2dede0b5f)
>     #1 0x5e84d68df6ce in MSDriveWay::buildDriveWay(std::__cxx11::basic_string<char, std::char_traits<char>, std::allocator<char>> const&, MSLink const*, __gnu_cxx::__normal_iterator<MSEdge const* const*, std::vector<MSEdge const*, std::allocator<MSEdge const*>>>, __gnu_cxx::__normal_iterator<MSEdge const* const*, std::vector<MSEdge const*, std::allocator<MSEdge const*>>>) /home/delphi/extraClangDebug/sumo/src/microsim/traffic_lights/MSDriveWay.cpp:1196:22
>     #2 0x5e84d68fab7c in MSDriveWay::getDepartureDriveway(SUMOVehicle const*) /home/delphi/extraClangDebug/sumo/src/microsim/traffic_lights/MSDriveWay.cpp:1865:22
>     #3 0x5e84d6828b3b in MSRailSignal::initDriveWays(SUMOVehicle const*, bool) /home/delphi/extraClangDebug/sumo/src/microsim/traffic_lights/MSRailSignal.cpp:374:48
>     #4 0x5e84d6870bbf in MSRailSignalControl::vehicleStateChanged(SUMOVehicle const*, MSNet::VehicleState, std::__cxx11::basic_string<char, std::char_traits<char>, std::allocator<char>> const&) /home/delphi/extraClangDebug/sumo/src/microsim/traffic_lights/MSRailSignalControl.cpp:87:17
>     #5 0x5e84d4751a64 in MSNet::informVehicleStateListener(SUMOVehicle const*, MSNet::VehicleState, std::__cxx11::basic_string<char, std::char_traits<char>, std::allocator<char>> const&) /home/delphi/extraClangDebug/sumo/src/microsim/MSNet.cpp:1277:19
>     #6 0x5e84d4cbb7aa in MSVehicleControl::initVehicle(MSBaseVehicle*, bool, bool, MSVehicleControl::VehicleDefinitionSource) /home/delphi/extraClangDebug/sumo/src/microsim/MSVehicleControl.cpp:133:27
>     #7 0x5e84d4cbac9b in MSVehicleControl::buildVehicle(SUMOVehicleParameter*, std::shared_ptr<MSRoute const>, MSVehicleType*, bool, MSVehicleControl::VehicleDefinitionSource, bool) /home/delphi/extraClangDebug/sumo/src/microsim/MSVehicleControl.cpp:116:5
>     #8 0x5e84d49afcf7 in MSRouteHandler::closeVehicle() /home/delphi/extraClangDebug/sumo/src/microsim/MSRouteHandler.cpp:670:34
>     #9 0x5e84d49d10fd in MSRouteHandler::closeTrip() /home/delphi/extraClangDebug/sumo/src/microsim/MSRouteHandler.cpp:1057:5
>     #10 0x5e84d6fe8374 in SUMORouteHandler::myEndElement(int) /home/delphi/extraClangDebug/sumo/src/utils/vehicle/SUMORouteHandler.cpp:283:13
>     #11 0x5e84d71c24db in GenericSAXHandler::endElement(char16_t const*, char16_t const*, char16_t const*) /home/delphi/extraClangDebug/sumo/src/utils/xml/GenericSAXHandler.cpp:167:9
>     #12 0x72b1719e68f2 in xercesc_3_2::SAX2XMLReaderImpl::endElement(xercesc_3_2::XMLElementDecl const&, unsigned int, bool, char16_t const*) (/lib/x86_64-linux-gnu/libxerces-c-3.2.so+0x1e68f2) (BuildId: 00c66a49d1bfc9237096cfb0829bac6c9c2c8e81)
>     #13 0x72b17199985b in xercesc_3_2::IGXMLScanner::scanStartTagNS(bool&) (/lib/x86_64-linux-gnu/libxerces-c-3.2.so+0x19985b) (BuildId: 00c66a49d1bfc9237096cfb0829bac6c9c2c8e81)
>     #14 0x72b17199b8d9 in xercesc_3_2::IGXMLScanner::scanNext(xercesc_3_2::XMLPScanToken&) (/lib/x86_64-linux-gnu/libxerces-c-3.2.so+0x19b8d9) (BuildId: 00c66a49d1bfc9237096cfb0829bac6c9c2c8e81)
>     #15 0x5e84d71f4b53 in SUMOSAXReader::parseNext() /home/delphi/extraClangDebug/sumo/src/utils/xml/SUMOSAXReader.cpp:158:25
<truncated after showing first 30 lines>

TEST FAILED on ts-sim-build-ba : traci vehicle ssm repeat ( Last six runs Oct2024 )

---------- Differences in errors ----------
0a1,8
>   warnings.warn("Could not import libsumo, falling back to pure python traci (%s)." % e)
> /home/delphi/extraClangDebug/sumo/src/utils/common/SUMOTime.cpp:75:15: runtime error: negation of -9223372036854775808 cannot be represented in type 'long long'; cast to an unsigned type to negate this value to itself
> SUMMARY: UndefinedBehaviorSanitizer: undefined-behavior /home/delphi/extraClangDebug/sumo/src/utils/common/SUMOTime.cpp:75:15 
> /home/delphi/extraClangDebug/sumo/src/utils/common/SUMOTime.cpp:75:15: runtime error: negation of -9223372036854775808 cannot be represented in type 'long long'; cast to an unsigned type to negate this value to itself
> SUMMARY: UndefinedBehaviorSanitizer: undefined-behavior /home/delphi/extraClangDebug/sumo/src/utils/common/SUMOTime.cpp:75:15 
> -- Unordered text as found by filter '^UserWarning:' --
> UserWarning: Could not import libsumo, falling back to pure python traci (cannot import name '_libsumo' from partially initialized module 'libsumo' (most likely due to a circular import) (/home/delphi/extraClangDebug/sumo/tools/libsumo/__init__.py)).
> 

TEST FAILED on ts-sim-build-ba : traci vehicle taxi case3_redispatch_before_pickup ( Last six runs Oct2024 )

---------- Differences in errors ----------
0a1,3
>   warnings.warn("Could not import libsumo, falling back to pure python traci (%s)." % e)
> /home/delphi/extraClangDebug/sumo/src/utils/common/SUMOTime.cpp:75:15: runtime error: negation of -9223372036854775808 cannot be represented in type 'long long'; cast to an unsigned type to negate this value to itself
> SUMMARY: UndefinedBehaviorSanitizer: undefined-behavior /home/delphi/extraClangDebug/sumo/src/utils/common/SUMOTime.cpp:75:15 
1a5,51
> 
> =================================================================
> ==4135473==ERROR: LeakSanitizer: detected memory leaks
> 
> Indirect leak of 232 byte(s) in 1 object(s) allocated from:
>     #0 0x60467f8328b1 in operator new(unsigned long) (/home/delphi/extraClangDebug/sumo/bin/sumoD+0x255c8b1) (BuildId: 2def77f78b0d3ed8747c35d0286147d2dede0b5f)
>     #1 0x60468127a0c4 in MSDispatch::addReservation(MSTransportable*, long long, long long, long long, MSEdge const*, double, MSStoppingPlace const*, MSEdge const*, double, MSStoppingPlace const*, std::__cxx11::basic_string<char, std::char_traits<char>, std::allocator<char>>, std::__cxx11::basic_string<char, std::char_traits<char>, std::allocator<char>> const&, int, int) /home/delphi/extraClangDebug/sumo/src/microsim/devices/MSDispatch.cpp:116:31
>     #2 0x6046812cb342 in MSDispatch_TraCI::addReservation(MSTransportable*, long long, long long, long long, MSEdge const*, double, MSStoppingPlace const*, MSEdge const*, double, MSStoppingPlace const*, std::__cxx11::basic_string<char, std::char_traits<char>, std::allocator<char>>, std::__cxx11::basic_string<char, std::char_traits<char>, std::allocator<char>> const&, int, int) /home/delphi/extraClangDebug/sumo/src/microsim/devices/MSDispatch_TraCI.cpp:51:36
>     #3 0x60468108caae in MSDevice_Taxi::addReservation(MSTransportable*, std::set<std::__cxx11::basic_string<char, std::char_traits<char>, std::allocator<char>>, std::less<std::__cxx11::basic_string<char, std::char_traits<char>, std::allocator<char>>>, std::allocator<std::__cxx11::basic_string<char, std::char_traits<char>, std::allocator<char>>>> const&, long long, long long, long long, MSEdge const*, double, MSStoppingPlace const*, MSEdge const*, double, MSStoppingPlace const*, std::__cxx11::
basic_string<char, std::char_traits<char>, std::allocator<char>> const&) /home/delphi/extraClangDebug/sumo/src/microsim/devices/MSDevice_Taxi.cpp:200:19
>     #4 0x604681786c59 in MSStageDriving::registerWaiting(MSTransportable*, long long) /home/delphi/extraClangDebug/sumo/src/microsim/transportables/MSStageDriving.cpp:334:13
>     #5 0x604681783517 in MSStageDriving::proceed(MSNet*, MSTransportable*, long long, MSStage*) /home/delphi/extraClangDebug/sumo/src/microsim/transportables/MSStageDriving.cpp:298:9
>     #6 0x6046818084c5 in MSTransportable::proceed(MSNet*, long long, bool) /home/delphi/extraClangDebug/sumo/src/microsim/transportables/MSTransportable.cpp:139:20
>     #7 0x60468183d4fb in MSTransportableControl::checkWaiting(MSNet*, long long) /home/delphi/extraClangDebug/sumo/src/microsim/transportables/MSTransportableControl.cpp:212:20
>     #8 0x60467f84f7e5 in MSNet::simulationStep(bool) /home/delphi/extraClangDebug/sumo/src/microsim/MSNet.cpp:812:26
>     #9 0x60467f84a368 in MSNet::simulate(long long, long long) /home/delphi/extraClangDebug/sumo/src/microsim/MSNet.cpp:412:9
>     #10 0x60467f836865 in main /home/delphi/extraClangDebug/sumo/src/sumo_main.cpp:100:30
>     #11 0x715e1a62a1c9 in __libc_start_call_main csu/../sysdeps/nptl/libc_start_call_main.h:58:16
>     #12 0x715e1a62a28a in __libc_start_main csu/../csu/libc-start.c:360:3
>     #13 0x60467f759444 in _start (/home/delphi/extraClangDebug/sumo/bin/sumoD+0x2483444) (BuildId: 2def77f78b0d3ed8747c35d0286147d2dede0b5f)
> 
> Indirect leak of 40 byte(s) in 1 object(s) allocated from:
>     #0 0x60467f8328b1 in operator new(unsigned long) (/home/delphi/extraClangDebug/sumo/bin/sumoD+0x255c8b1) (BuildId: 2def77f78b0d3ed8747c35d0286147d2dede0b5f)
>     #1 0x6046810c7d61 in std::__new_allocator<std::_Rb_tree_node<MSTransportable const*>>::allocate(unsigned long, void const*) /usr/bin/../lib/gcc/x86_64-linux-gnu/14/../../../../include/c++/14/bits/new_allocator.h:151:27
>     #2 0x6046810c796c in std::allocator_traits<std::allocator<std::_Rb_tree_node<MSTransportable const*>>>::allocate(std::allocator<std::_Rb_tree_node<MSTransportable const*>>&, unsigned long) /usr/bin/../lib/gcc/x86_64-linux-gnu/14/../../../../include/c++/14/bits/alloc_traits.h:478:20
>     #3 0x6046810c796c in std::_Rb_tree<MSTransportable const*, MSTransportable const*, std::_Identity<MSTransportable const*>, std::less<MSTransportable const*>, std::allocator<MSTransportable const*>>::_M_get_node() /usr/bin/../lib/gcc/x86_64-linux-gnu/14/../../../../include/c++/14/bits/stl_tree.h:559:16
<truncated after showing first 30 lines>

TEST FAILED on ts-sim-build-ba : traci vehicle taxi redispatch_on_internal ( Last six runs Oct2024 )

---------- Differences in errors ----------
0a1,53
>   warnings.warn("Could not import libsumo, falling back to pure python traci (%s)." % e)
> /home/delphi/extraClangDebug/sumo/src/utils/common/SUMOTime.cpp:75:15: runtime error: negation of -9223372036854775808 cannot be represented in type 'long long'; cast to an unsigned type to negate this value to itself
> SUMMARY: UndefinedBehaviorSanitizer: undefined-behavior /home/delphi/extraClangDebug/sumo/src/utils/common/SUMOTime.cpp:75:15 
> 
> =================================================================
> ==4135561==ERROR: LeakSanitizer: detected memory leaks
> 
> Indirect leak of 928 byte(s) in 4 object(s) allocated from:
>     #0 0x5e64423bb8b1 in operator new(unsigned long) (/home/delphi/extraClangDebug/sumo/bin/sumoD+0x255c8b1) (BuildId: 2def77f78b0d3ed8747c35d0286147d2dede0b5f)
>     #1 0x5e6443e030c4 in MSDispatch::addReservation(MSTransportable*, long long, long long, long long, MSEdge const*, double, MSStoppingPlace const*, MSEdge const*, double, MSStoppingPlace const*, std::__cxx11::basic_string<char, std::char_traits<char>, std::allocator<char>>, std::__cxx11::basic_string<char, std::char_traits<char>, std::allocator<char>> const&, int, int) /home/delphi/extraClangDebug/sumo/src/microsim/devices/MSDispatch.cpp:116:31
>     #2 0x5e6443e54342 in MSDispatch_TraCI::addReservation(MSTransportable*, long long, long long, long long, MSEdge const*, double, MSStoppingPlace const*, MSEdge const*, double, MSStoppingPlace const*, std::__cxx11::basic_string<char, std::char_traits<char>, std::allocator<char>>, std::__cxx11::basic_string<char, std::char_traits<char>, std::allocator<char>> const&, int, int) /home/delphi/extraClangDebug/sumo/src/microsim/devices/MSDispatch_TraCI.cpp:51:36
>     #3 0x5e6443c15aae in MSDevice_Taxi::addReservation(MSTransportable*, std::set<std::__cxx11::basic_string<char, std::char_traits<char>, std::allocator<char>>, std::less<std::__cxx11::basic_string<char, std::char_traits<char>, std::allocator<char>>>, std::allocator<std::__cxx11::basic_string<char, std::char_traits<char>, std::allocator<char>>>> const&, long long, long long, long long, MSEdge const*, double, MSStoppingPlace const*, MSEdge const*, double, MSStoppingPlace const*, std::__cxx11::
basic_string<char, std::char_traits<char>, std::allocator<char>> const&) /home/delphi/extraClangDebug/sumo/src/microsim/devices/MSDevice_Taxi.cpp:200:19
>     #4 0x5e644430fc59 in MSStageDriving::registerWaiting(MSTransportable*, long long) /home/delphi/extraClangDebug/sumo/src/microsim/transportables/MSStageDriving.cpp:334:13
>     #5 0x5e644430c517 in MSStageDriving::proceed(MSNet*, MSTransportable*, long long, MSStage*) /home/delphi/extraClangDebug/sumo/src/microsim/transportables/MSStageDriving.cpp:298:9
>     #6 0x5e64443914c5 in MSTransportable::proceed(MSNet*, long long, bool) /home/delphi/extraClangDebug/sumo/src/microsim/transportables/MSTransportable.cpp:139:20
>     #7 0x5e64443c64fb in MSTransportableControl::checkWaiting(MSNet*, long long) /home/delphi/extraClangDebug/sumo/src/microsim/transportables/MSTransportableControl.cpp:212:20
>     #8 0x5e64423d87e5 in MSNet::simulationStep(bool) /home/delphi/extraClangDebug/sumo/src/microsim/MSNet.cpp:812:26
>     #9 0x5e64423d3368 in MSNet::simulate(long long, long long) /home/delphi/extraClangDebug/sumo/src/microsim/MSNet.cpp:412:9
>     #10 0x5e64423bf865 in main /home/delphi/extraClangDebug/sumo/src/sumo_main.cpp:100:30
>     #11 0x75dfa142a1c9 in __libc_start_call_main csu/../sysdeps/nptl/libc_start_call_main.h:58:16
>     #12 0x75dfa142a28a in __libc_start_main csu/../csu/libc-start.c:360:3
>     #13 0x5e64422e2444 in _start (/home/delphi/extraClangDebug/sumo/bin/sumoD+0x2483444) (BuildId: 2def77f78b0d3ed8747c35d0286147d2dede0b5f)
> 
> Indirect leak of 160 byte(s) in 4 object(s) allocated from:
>     #0 0x5e64423bb8b1 in operator new(unsigned long) (/home/delphi/extraClangDebug/sumo/bin/sumoD+0x255c8b1) (BuildId: 2def77f78b0d3ed8747c35d0286147d2dede0b5f)
>     #1 0x5e6443c50d61 in std::__new_allocator<std::_Rb_tree_node<MSTransportable const*>>::allocate(unsigned long, void const*) /usr/bin/../lib/gcc/x86_64-linux-gnu/14/../../../../include/c++/14/bits/new_allocator.h:151:27
>     #2 0x5e6443c5096c in std::allocator_traits<std::allocator<std::_Rb_tree_node<MSTransportable const*>>>::allocate(std::allocator<std::_Rb_tree_node<MSTransportable const*>>&, unsigned long) /usr/bin/../lib/gcc/x86_64-linux-gnu/14/../../../../include/c++/14/bits/alloc_traits.h:478:20
>     #3 0x5e6443c5096c in std::_Rb_tree<MSTransportable const*, MSTransportable const*, std::_Identity<MSTransportable const*>, std::less<MSTransportable const*>, std::allocator<MSTransportable const*>>::_M_get_node() /usr/bin/../lib/gcc/x86_64-linux-gnu/14/../../../../include/c++/14/bits/stl_tree.h:559:16
>     #4 0x5e6443c5083c in std::_Rb_tree_node<MSTransportable const*>* std::_Rb_tree<MSTransportable const*, MSTransportable const*, std::_Identity<MSTransportable const*>, std::less<MSTransportable const*>, std::allocator<MSTransportable const*>>::_M_create_node<MSTransportable const* const&>(MSTransportable const* const&) /usr/bin/../lib/gcc/x86_64-linux-gnu/14/../../../../include/c++/14/bits/stl_tree.h:609:23
<truncated after showing first 30 lines>

2 TESTS FAILED on ts-sim-build-ba :

---------- Differences in errors ----------
0a1
>   warnings.warn("Could not import libsumo, falling back to pure python traci (%s)." % e)
12a14,15
> /home/delphi/extraClangDebug/sumo/src/utils/common/SUMOTime.cpp:75:15: runtime error: negation of -9223372036854775808 cannot be represented in type 'long long'; cast to an unsigned type to negate this value to itself
> SUMMARY: UndefinedBehaviorSanitizer: undefined-behavior /home/delphi/extraClangDebug/sumo/src/utils/common/SUMOTime.cpp:75:15 
27a31,33
> -- Unordered text as found by filter '^UserWarning:' --
> UserWarning: Could not import libsumo, falling back to pure python traci (cannot import name '_libsumo' from partially initialized module 'libsumo' (most likely due to a circular import) (/home/delphi/extraClangDebug/sumo/tools/libsumo/__init__.py)).
> 
traci vehicle vehicle ( Last six runs Oct2024 )
traci vehicle vehicle_sublane ( Last six runs Oct2024 )

TEST FAILED on ts-sim-build-ba : traci vehicletype vehicletype ( Last six runs Oct2024 )

---------- Differences in errors ----------
0a1
>   warnings.warn("Could not import libsumo, falling back to pure python traci (%s)." % e)
7a9,11
> -- Unordered text as found by filter '^UserWarning:' --
> UserWarning: Could not import libsumo, falling back to pure python traci (cannot import name '_libsumo' from partially initialized module 'libsumo' (most likely due to a circular import) (/home/delphi/extraClangDebug/sumo/tests/../tests/complex/traci/vehicletype/vehicletype/../../../../../tools/libsumo/__init__.py)).
> 

TEST FAILED on ts-sim-build-ba : traci_java api ( Last six runs Oct2024 )

---------- Differences in errors ----------
1,2c1,11
< Warning: Missing yellow phase in tlLogic 'gneJ1', program '2' for tl-index 6 when switching from phase 2 to phase 0.
< Warning: Missing yellow phase in tlLogic 'gneJ1', program '2' for tl-index 6 when switching from phase 2 to phase 0.
---
> Exception in thread "main" java.lang.UnsatisfiedLinkError: /home/delphi/extraClangDebug/sumo/bin/liblibsumojni.so: /home/delphi/extraClangDebug/sumo/bin/liblibsumojni.so: undefined symbol: __ubsan_vptr_type_cache
> 	at java.base/jdk.internal.loader.NativeLibraries.load(Native Method)
> 	at java.base/jdk.internal.loader.NativeLibraries$NativeLibraryImpl.open(NativeLibraries.java:331)
> 	at java.base/jdk.internal.loader.NativeLibraries.loadLibrary(NativeLibraries.java:197)
> 	at java.base/jdk.internal.loader.NativeLibraries.loadLibrary(NativeLibraries.java:139)
> 	at java.base/jdk.internal.loader.NativeLibraries.findFromPaths(NativeLibraries.java:259)
> 	at java.base/jdk.internal.loader.NativeLibraries.loadLibrary(NativeLibraries.java:251)
> 	at java.base/java.lang.ClassLoader.loadLibrary(ClassLoader.java:2451)
> 	at java.base/java.lang.Runtime.loadLibrary0(Runtime.java:916)
> 	at java.base/java.lang.System.loadLibrary(System.java:2063)
> 	at APITest.main(APITest.java:33)
---------- Differences in output ----------
1,80d0
< deltaT:1.0
< findRoute result stage:
<   gneE0
<   -gneE2
<   gneE2
< findIntermodalRoute result stages:
<   gneE0
<   gneE2
< Step 1.0, tlsPhase 0 (North-South)
< Step 2.0, tlsPhase 0 (North-South)
< Step 3.0, tlsPhase 0 (North-South)
< Step 4.0, tlsPhase 0 (North-South)
< Step 5.0, tlsPhase 0 (North-South)
< Step 6.0, tlsPhase 0 (North-South)
< Step 7.0, tlsPhase 0 (North-South)
< Step 8.0, tlsPhase 0 (North-South)
< Step 9.0, tlsPhase 0 (North-South)
< Step 10.0, tlsPhase 0 (North-South)
< Step 11.0, tlsPhase 0 (North-South)
< Step 12.0, tlsPhase 0 (North-South)
< Step 13.0, tlsPhase 0 (North-South)
< Step 14.0, tlsPhase 0 (North-South)
< Step 15.0, tlsPhase 0 (North-South)
< Step 16.0, tlsPhase 0 (North-South)
< Step 17.0, tlsPhase 0 (North-South)
< Step 18.0, tlsPhase 0 (North-South)
< Step 19.0, tlsPhase 0 (North-South)
< Step 20.0, tlsPhase 0 (North-South)
< Step 21.0, tlsPhase 0 (North-South)
<truncated after showing first 30 lines>

TEST FAILED on ts-sim-build-ba : traci_java concurrent ( Last six runs Oct2024 )

---------- Differences in errors ----------
1c1,11
< Warning: Missing yellow phase in tlLogic 'gneJ1', program '2' for tl-index 6 when switching from phase 2 to phase 0.
---
> Exception in thread "main" java.lang.UnsatisfiedLinkError: /home/delphi/extraClangDebug/sumo/bin/liblibsumojni.so: /home/delphi/extraClangDebug/sumo/bin/liblibsumojni.so: undefined symbol: __ubsan_vptr_type_cache
> 	at java.base/jdk.internal.loader.NativeLibraries.load(Native Method)
> 	at java.base/jdk.internal.loader.NativeLibraries$NativeLibraryImpl.open(NativeLibraries.java:331)
> 	at java.base/jdk.internal.loader.NativeLibraries.loadLibrary(NativeLibraries.java:197)
> 	at java.base/jdk.internal.loader.NativeLibraries.loadLibrary(NativeLibraries.java:139)
> 	at java.base/jdk.internal.loader.NativeLibraries.findFromPaths(NativeLibraries.java:259)
> 	at java.base/jdk.internal.loader.NativeLibraries.loadLibrary(NativeLibraries.java:251)
> 	at java.base/java.lang.ClassLoader.loadLibrary(ClassLoader.java:2451)
> 	at java.base/java.lang.Runtime.loadLibrary0(Runtime.java:916)
> 	at java.base/java.lang.System.loadLibrary(System.java:2063)
> 	at Main.main(Main.java:48)
---------- Differences in output ----------
1,100d0
< Thread started
< Thread started
< Thread started
< Thread started
< Thread started
< Thread started
< Thread started
< Thread started
< Thread started
< Thread started
< Thread started
< Thread started
< Thread started
< Thread started
< Thread started
< Thread started
< Thread started
< Thread started
< Thread started
< Thread started
< Thread started
< Thread started
< Thread started
< Thread started
< Thread started
< Thread started
< Thread started
< Thread started
< Thread started
<truncated after showing first 30 lines>

TEST FAILED on ts-sim-build-ba : traci_java multiclient ( Last six runs Oct2024 )

---------- Differences in errors ----------
1c1,12
< Warning: Missing yellow phase in tlLogic 'gneJ1', program '2' for tl-index 6 when switching from phase 2 to phase 0.
---
> data/MultiClient1.java:52: error: cannot find symbol
>             Simulation.setOrder(1);
>                       ^
>   symbol:   method setOrder(int)
>   location: class Simulation
> 1 error
> Traceback (most recent call last):
>   File "/home/delphi/extraClangDebug/sumo/tests/../tests/complex/traci_java/runner.py", line 54, in <module>
>     subprocess.check_call([javac, "-cp", traciJar, fname])
>   File "/usr/lib/python3.12/subprocess.py", line 413, in check_call
>     raise CalledProcessError(retcode, cmd)
> subprocess.CalledProcessError: Command '['javac', '-cp', '/home/delphi/extraClangDebug/sumo/bin/libsumo-1.22.0-SNAPSHOT.jar', 'data/MultiClient1.java']' returned non-zero exit status 1.
---------- Differences in output ----------
1,4652d0
< Step 0.1, tlsPhase 0 (North-South)
< Step 0.1
< Step 0.2
< Step 0.3
< Step 0.4
< Step 0.5
< Step 0.6
< Step 0.7
< Step 0.8
< Step 0.9
< Step 1.0
< Step 1.1
< Step 1.2
< Step 1.3
< Step 1.4
< Step 1.5
< Step 1.6
< Step 1.7
< Step 1.8
< Step 1.9
< Step 2.0
< Step 2.1
< Step 2.2
< Step 2.3
< Step 2.4
< Step 2.5
< Step 2.6
< Step 2.7
< Step 2.8
<truncated after showing first 30 lines>

TEST FAILED on ts-sim-build-ba : traci_java simple ( Last six runs Oct2024 )

---------- Differences in errors ----------
1c1,11
< Warning: Missing yellow phase in tlLogic 'gneJ1', program '2' for tl-index 6 when switching from phase 2 to phase 0.
---
> Exception in thread "main" java.lang.UnsatisfiedLinkError: /home/delphi/extraClangDebug/sumo/bin/liblibsumojni.so: /home/delphi/extraClangDebug/sumo/bin/liblibsumojni.so: undefined symbol: __ubsan_vptr_type_cache
> 	at java.base/jdk.internal.loader.NativeLibraries.load(Native Method)
> 	at java.base/jdk.internal.loader.NativeLibraries$NativeLibraryImpl.open(NativeLibraries.java:331)
> 	at java.base/jdk.internal.loader.NativeLibraries.loadLibrary(NativeLibraries.java:197)
> 	at java.base/jdk.internal.loader.NativeLibraries.loadLibrary(NativeLibraries.java:139)
> 	at java.base/jdk.internal.loader.NativeLibraries.findFromPaths(NativeLibraries.java:259)
> 	at java.base/jdk.internal.loader.NativeLibraries.loadLibrary(NativeLibraries.java:251)
> 	at java.base/java.lang.ClassLoader.loadLibrary(ClassLoader.java:2451)
> 	at java.base/java.lang.Runtime.loadLibrary0(Runtime.java:916)
> 	at java.base/java.lang.System.loadLibrary(System.java:2063)
> 	at Main.main(Main.java:32)
---------- Differences in output ----------
1,4639d0
< Step 0.1, tlsPhase 0 (North-South)
< Step 0.2, tlsPhase 0 (North-South)
< Step 0.3, tlsPhase 0 (North-South)
< Step 0.4, tlsPhase 0 (North-South)
< Step 0.5, tlsPhase 0 (North-South)
< Step 0.6, tlsPhase 0 (North-South)
< Step 0.7, tlsPhase 0 (North-South)
< Step 0.8, tlsPhase 0 (North-South)
< Step 0.9, tlsPhase 0 (North-South)
< Step 1.0, tlsPhase 0 (North-South)
< Step 1.1, tlsPhase 0 (North-South)
< Step 1.2, tlsPhase 0 (North-South)
< Step 1.3, tlsPhase 0 (North-South)
< Step 1.4, tlsPhase 0 (North-South)
< Step 1.5, tlsPhase 0 (North-South)
< Step 1.6, tlsPhase 0 (North-South)
< Step 1.7, tlsPhase 0 (North-South)
< Step 1.8, tlsPhase 0 (North-South)
< Step 1.9, tlsPhase 0 (North-South)
< Step 2.0, tlsPhase 0 (North-South)
< Step 2.1, tlsPhase 0 (North-South)
< Step 2.2, tlsPhase 0 (North-South)
< Step 2.3, tlsPhase 0 (North-South)
< Step 2.4, tlsPhase 0 (North-South)
< Step 2.5, tlsPhase 0 (North-South)
< Step 2.6, tlsPhase 0 (North-South)
< Step 2.7, tlsPhase 0 (North-South)
< Step 2.8, tlsPhase 0 (North-South)
< Step 2.9, tlsPhase 0 (North-South)
<truncated after showing first 30 lines>

TEST FAILED on ts-sim-build-ba : traci_java subscription ( Last six runs Oct2024 )

---------- Differences in errors ----------
1c1,11
< Warning: Missing yellow phase in tlLogic 'gneJ1', program '2' for tl-index 6 when switching from phase 2 to phase 0.
---
> Exception in thread "main" java.lang.UnsatisfiedLinkError: /home/delphi/extraClangDebug/sumo/bin/liblibsumojni.so: /home/delphi/extraClangDebug/sumo/bin/liblibsumojni.so: undefined symbol: __ubsan_vptr_type_cache
> 	at java.base/jdk.internal.loader.NativeLibraries.load(Native Method)
> 	at java.base/jdk.internal.loader.NativeLibraries$NativeLibraryImpl.open(NativeLibraries.java:331)
> 	at java.base/jdk.internal.loader.NativeLibraries.loadLibrary(NativeLibraries.java:197)
> 	at java.base/jdk.internal.loader.NativeLibraries.loadLibrary(NativeLibraries.java:139)
> 	at java.base/jdk.internal.loader.NativeLibraries.findFromPaths(NativeLibraries.java:259)
> 	at java.base/jdk.internal.loader.NativeLibraries.loadLibrary(NativeLibraries.java:251)
> 	at java.base/java.lang.ClassLoader.loadLibrary(ClassLoader.java:2451)
> 	at java.base/java.lang.Runtime.loadLibrary0(Runtime.java:916)
> 	at java.base/java.lang.System.loadLibrary(System.java:2063)
> 	at Subscription.main(Subscription.java:35)
---------- Differences in output ----------
1,147d0
< Step: 0
< Step: 1
< Subscription Departed vehicles: v0
< Vehicle Subscription: id=v0
<    variable id: 64  value: 14.7234
<    variable id: 66  value: TraCIPosition(0,-4.8)
< Step: 2
< Subscription Departed vehicles: v1
< Vehicle Subscription: id=v0
<    variable id: 64  value: 14.7234
<    variable id: 66  value: TraCIPosition(14.7234,-4.8)
< Vehicle Subscription: id=v1
<    variable id: 64  value: 13.033
<    variable id: 66  value: TraCIPosition(0,-4.8)
< Step: 3
< Subscription Departed vehicles: v2
< Vehicle Subscription: id=v0
<    variable id: 64  value: 14.7234
<    variable id: 66  value: TraCIPosition(29.4468,-4.8)
< Vehicle Subscription: id=v1
<    variable id: 64  value: 13.033
<    variable id: 66  value: TraCIPosition(13.033,-4.8)
< Vehicle Subscription: id=v2
<    variable id: 64  value: 11.791
<    variable id: 66  value: TraCIPosition(0,-4.8)
< Step: 4
< Subscription Departed vehicles: v3
< Vehicle Subscription: id=v0
<    variable id: 64  value: 14.7234
<truncated after showing first 30 lines>