17Oct2019 - detailed test results for NETCONVERT

To reconnect the TextTest GUI to these results, run:

texttest -a netconvert -d /home/delphi/extraClangDebug/sumo/tests -reconnect /home/delphi/extraClangDebug/texttesttmp/extra_clang3_64D.01Nov070307.9867 -g

To start TextTest for these tests, run:

texttest -a netconvert -d /home/delphi/extraClangDebug/sumo/tests


gdal: 2 tests: 1 succeeded 1 FAILED

Detailed information for the tests that FAILED:

TEST FAILED on ts-sim-build-ba : import shape handmade ( Last six runs Oct2019 )

---------- Differences in errors ----------
10a11,43
> 
> =================================================================
> ==32760==ERROR: LeakSanitizer: detected memory leaks
> 
> Direct leak of 200 byte(s) in 1 object(s) allocated from:
>     #0 0xa2e820  (/home/delphi/extraClangDebug/sumo/bin/netconvertD+0xa2e820)
>     #1 0x7f652559b6e3  (/usr/lib/libgdal.so.20+0x29e6e3)
> 
> Indirect leak of 1856 byte(s) in 58 object(s) allocated from:
>     #0 0xa2e820  (/home/delphi/extraClangDebug/sumo/bin/netconvertD+0xa2e820)
>     #1 0x7f6525593850  (/usr/lib/libgdal.so.20+0x296850)
> 
> Indirect leak of 1212 byte(s) in 12 object(s) allocated from:
>     #0 0x9f6270  (/home/delphi/extraClangDebug/sumo/bin/netconvertD+0x9f6270)
>     #1 0x7f6524941749  (/usr/lib/x86_64-linux-gnu/libproj.so.12+0x3e749)
> 
> Indirect leak of 448 byte(s) in 20 object(s) allocated from:
>     #0 0x9f66f0  (/home/delphi/extraClangDebug/sumo/bin/netconvertD+0x9f66f0)
>     #1 0x7f6525ea9a4d  (/usr/lib/libgdal.so.20+0xbaca4d)
> 
> Indirect leak of 434 byte(s) in 58 object(s) allocated from:
>     #0 0x9f6270  (/home/delphi/extraClangDebug/sumo/bin/netconvertD+0x9f6270)
>     #1 0x7f6525eaa77f  (/usr/lib/libgdal.so.20+0xbad77f)
> 
> Indirect leak of 96 byte(s) in 2 object(s) allocated from:
>     #0 0xa2e820  (/home/delphi/extraClangDebug/sumo/bin/netconvertD+0xa2e820)
>     #1 0x7f65255d31e2  (/usr/lib/libgdal.so.20+0x2d61e2)
> 
> Indirect leak of 32 byte(s) in 1 object(s) allocated from:
<truncated after showing first 30 lines>
---------- New result in exitcode ----------
1