24Aug2019 - detailed test results for TOOLS

To reconnect the TextTest GUI to these results, run:

texttest -a tools -d /home/delphi/extraClangDebug/sumo/tests -reconnect /home/delphi/extraClangDebug/texttesttmp/extra_clang3_64D.31Aug080449.5582 -g

To start TextTest for these tests, run:

texttest -a tools -d /home/delphi/extraClangDebug/sumo/tests


python3: 455 tests: 392 succeeded 56 FAILED 4 killed 3 known bugs

Detailed information for the tests that FAILED:

TEST FAILED on ts-sim-build-ba : assign calibration 2ndTestNetwork_sumoFormat ( Last six runs Aug2019 )

---------- Differences in errors ----------
0a1
> Execution of ['java', '-cp', '/home/delphi/extraClangDebug/sumo/tools/../bin/libsumojni_src.jar:/home/delphi/extraClangDebug/sumo/tools/../bin/libsumojni.jar', '-Xmx1G', 'floetteroed.cadyts.interfaces.sumo.SumoController', 'INIT', '-varscale', '1.0', '-freezeit', '85', '-measfile', 'input_weights1.xml', '-binsize', '3600', '-PREPITS', '5', '-bruteforce', 'False', '-demandscale', '2.0', '-mincountstddev', '25.0', '-overridett', 'False', '-clonepostfix', '-CLONE', '-cntfirstlink', 'False', '-cnt
lastlink', 'False'] failed. Look into cadySumo-log.txt for details.
---------- Differences in output ----------
1,100d0
< calibration step: 0
< >> Running simulation
< <<
< ------------------
< 
< calibration step: 1
< >> Running simulation
< <<
< ------------------
< 
< calibration step: 2
< >> Running simulation
< <<
< ------------------
< 
< calibration step: 3
< >> Running simulation
< <<
< ------------------
< 
< calibration step: 4
< >> Running simulation
< <<
< ------------------
< 
< calibration step: 5
< >> Running simulation
< <<
< ------------------
<truncated after showing first 30 lines>

TEST FAILED on ts-sim-build-ba : assign calibration demand_adjustment ( Last six runs Aug2019 )

---------- Differences in errors ----------
0a1
> Execution of ['java', '-cp', '/home/delphi/extraClangDebug/sumo/tools/../bin/libsumojni_src.jar:/home/delphi/extraClangDebug/sumo/tools/../bin/libsumojni.jar', '-Xmx1G', 'floetteroed.cadyts.interfaces.sumo.SumoController', 'INIT', '-varscale', '1.0', '-freezeit', '85', '-measfile', 'input_measurements.xml', '-binsize', '3600', '-PREPITS', '5', '-bruteforce', 'False', '-demandscale', '2.0', '-mincountstddev', '25.0', '-overridett', 'True', '-clonepostfix', '-CLONE', '-fmaprefix', 'matrix', '-cn
tfirstlink', 'False', '-cntlastlink', 'False'] failed. Look into cadySumo-log.txt for details.
---------- Differences in output ----------
1,100d0
< calibration step: 0
< >> Running simulation
< <<
< ------------------
< 
< calibration step: 1
< >> Running simulation
< <<
< ------------------
< 
< calibration step: 2
< >> Running simulation
< <<
< ------------------
< 
< calibration step: 3
< >> Running simulation
< <<
< ------------------
< 
< calibration step: 4
< >> Running simulation
< <<
< ------------------
< 
< calibration step: 5
< >> Running simulation
< <<
< ------------------
<truncated after showing first 30 lines>

TEST FAILED on ts-sim-build-ba : assign calibration fixed_demand ( Last six runs Aug2019 )

---------- Differences in errors ----------
0a1
> Execution of ['java', '-cp', '/home/delphi/extraClangDebug/sumo/tools/../bin/libsumojni_src.jar:/home/delphi/extraClangDebug/sumo/tools/../bin/libsumojni.jar', '-Xmx1G', 'floetteroed.cadyts.interfaces.sumo.SumoController', 'INIT', '-varscale', '1.0', '-freezeit', '85', '-measfile', 'input_measurements.xml', '-binsize', '3600', '-PREPITS', '5', '-bruteforce', 'False', '-demandscale', '2.0', '-mincountstddev', '25.0', '-overridett', 'True', '-clonepostfix', '-CLONE', '-cntfirstlink', 'False', '-
cntlastlink', 'False'] failed. Look into cadySumo-log.txt for details.
---------- Differences in output ----------
1,100d0
< calibration step: 0
< >> Running simulation
< <<
< ------------------
< 
< calibration step: 1
< >> Running simulation
< <<
< ------------------
< 
< calibration step: 2
< >> Running simulation
< <<
< ------------------
< 
< calibration step: 3
< >> Running simulation
< <<
< ------------------
< 
< calibration step: 4
< >> Running simulation
< <<
< ------------------
< 
< calibration step: 5
< >> Running simulation
< <<
< ------------------
<truncated after showing first 30 lines>

TEST FAILED on ts-sim-build-ba : assign calibration multi_route_files ( Last six runs Aug2019 )

---------- Differences in errors ----------
0a1
> Execution of ['java', '-cp', '/home/delphi/extraClangDebug/sumo/tools/../bin/libsumojni_src.jar:/home/delphi/extraClangDebug/sumo/tools/../bin/libsumojni.jar', '-Xmx1G', 'floetteroed.cadyts.interfaces.sumo.SumoController', 'INIT', '-varscale', '1.0', '-freezeit', '85', '-measfile', 'input_measurements.xml', '-binsize', '3600', '-PREPITS', '5', '-bruteforce', 'False', '-demandscale', '2.0', '-mincountstddev', '25.0', '-overridett', 'False', '-clonepostfix', '-CLONE', '-fmaprefix', 'fmaOD', '-cn
tfirstlink', 'False', '-cntlastlink', 'False'] failed. Look into cadySumo-log.txt for details.
---------- Differences in output ----------
1,100d0
< calibration step: 0
< >> Running simulation
< <<
< ------------------
< 
< calibration step: 1
< >> Running simulation
< <<
< ------------------
< 
< calibration step: 2
< >> Running simulation
< <<
< ------------------
< 
< calibration step: 3
< >> Running simulation
< <<
< ------------------
< 
< calibration step: 4
< >> Running simulation
< <<
< ------------------
< 
< calibration step: 5
< >> Running simulation
< <<
< ------------------
<truncated after showing first 30 lines>

TEST FAILED on ts-sim-build-ba : assign calibration p2p_demand_adjustment ( Last six runs Aug2019 )

---------- Differences in errors ----------
0a1
> Execution of ['java', '-cp', '/home/delphi/extraClangDebug/sumo/tools/../bin/libsumojni_src.jar:/home/delphi/extraClangDebug/sumo/tools/../bin/libsumojni.jar', '-Xmx1G', 'floetteroed.cadyts.interfaces.sumo.SumoController', 'INIT', '-varscale', '1.0', '-freezeit', '85', '-measfile', 'input_measurementsp2p.xml', '-binsize', '900', '-PREPITS', '5', '-bruteforce', 'False', '-demandscale', '2.0', '-mincountstddev', '25.0', '-overridett', 'False', '-clonepostfix', '-CLONE', '-fmaprefix', 'matrix', '
-cntfirstlink', 'False', '-cntlastlink', 'False'] failed. Look into cadySumo-log.txt for details.
---------- Differences in output ----------
1,100d0
< calibration step: 0
< >> Running simulation
< <<
< ------------------
< 
< calibration step: 1
< >> Running simulation
< <<
< ------------------
< 
< calibration step: 2
< >> Running simulation
< <<
< ------------------
< 
< calibration step: 3
< >> Running simulation
< <<
< ------------------
< 
< calibration step: 4
< >> Running simulation
< <<
< ------------------
< 
< calibration step: 5
< >> Running simulation
< <<
< ------------------
<truncated after showing first 30 lines>

TEST FAILED on ts-sim-build-ba : assign calibration p2p_simple ( Last six runs Aug2019 )

---------- Differences in errors ----------
0a1
> Execution of ['java', '-cp', '/home/delphi/extraClangDebug/sumo/tools/../bin/libsumojni_src.jar:/home/delphi/extraClangDebug/sumo/tools/../bin/libsumojni.jar', '-Xmx1G', 'floetteroed.cadyts.interfaces.sumo.SumoController', 'INIT', '-varscale', '1.0', '-freezeit', '85', '-measfile', 'input_measurementsp2p.xml', '-binsize', '900', '-PREPITS', '5', '-bruteforce', 'False', '-demandscale', '2.0', '-mincountstddev', '25.0', '-overridett', 'False', '-clonepostfix', '-CLONE', '-cntfirstlink', 'False',
 '-cntlastlink', 'False'] failed. Look into cadySumo-log.txt for details.
---------- Differences in output ----------
1,100d0
< calibration step: 0
< >> Running simulation
< <<
< ------------------
< 
< calibration step: 1
< >> Running simulation
< <<
< ------------------
< 
< calibration step: 2
< >> Running simulation
< <<
< ------------------
< 
< calibration step: 3
< >> Running simulation
< <<
< ------------------
< 
< calibration step: 4
< >> Running simulation
< <<
< ------------------
< 
< calibration step: 5
< >> Running simulation
< <<
< ------------------
<truncated after showing first 30 lines>

TEST FAILED on ts-sim-build-ba : assign dua-iterate binary ( Last six runs Aug2019 )

---------- Differences in errors ----------
0a1
> Execution of ['/home/delphi/extraClangDebug/sumo/tests/../bin/sumo', '-c', 'iteration_000.sumocfg'] failed. Look into dua.log for details.
---------- Differences in output ----------
6,40d5
< <<
< ------------------
< 
< Loading configuration... done.
< > Executing step 1
< >> Running router on input_trips_000.rou.alt.sbx
< <<
< >> Running simulation
< <<
< ------------------
< 
< Loading configuration... done.
< > Executing step 2
< >> Running router on input_trips_001.rou.alt.sbx
< <<
< >> Running simulation
< <<
< ------------------
< 
< Loading configuration... done.
< > Executing step 3
< >> Running router on input_trips_002.rou.alt.sbx
< <<
< >> Running simulation
< <<
< ------------------
< 
< Loading configuration... done.
< > Executing step 4
<truncated after showing first 30 lines>

TEST FAILED on ts-sim-build-ba : assign dua-iterate convergence ( Last six runs Aug2019 )

---------- Differences in errors ----------
0a1
> Execution of ['/home/delphi/extraClangDebug/sumo/tests/../bin/sumo', '-c', 'iteration_000.sumocfg'] failed. Look into dua.log for details.
---------- Differences in output ----------
6,99d5
< <<
< < relative travel time deviation in the last 1 steps: 0.00000
< ------------------
< 
< Loading configuration... done.
< > Executing step 1
< >> Running router on input_trips_000.rou.alt.xml
< <<
< >> Running simulation
< <<
< < relative travel time deviation in the last 2 steps: 0.00795
< ------------------
< 
< Loading configuration... done.
< > Executing step 2
< >> Running router on input_trips_001.rou.alt.xml
< <<
< >> Running simulation
< <<
< < relative travel time deviation in the last 3 steps: 0.00752
< ------------------
< 
< Loading configuration... done.
< > Executing step 3
< >> Running router on input_trips_002.rou.alt.xml
< <<
< >> Running simulation
< <<
< < relative travel time deviation in the last 4 steps: 0.00692
<truncated after showing first 30 lines>

TEST FAILED on ts-sim-build-ba : assign dua-iterate external_gawron ( Last six runs Aug2019 )

---------- Differences in errors ----------
0a1
> Execution of ['/home/delphi/extraClangDebug/sumo/tests/../bin/sumo', '-c', 'iteration_000.sumocfg'] failed. Look into dua.log for details.
---------- Differences in output ----------
8,119d7
< <<
< >> Smoothing edge weights
< >>> Updated 4 edges
< >>> Decayed 0 unseen edges
< >>> Error avg:0 mean:0
< >>> Absolute Error avg:0 mean:0
< ------------------
< 
< Loading configuration... done.
< > Executing step 1
< >> Running router on input_trips_000.rou.alt.xml
< <<
< basename input_trips
< step: 1
< get externalgawron
< run getRouteChoices
< ecoMeasure: None
< prefix: input_trips_001
< parse network file
< could not parse weights file: None
< parse dumpfile
< dump_000_900.xml
< parse routeAltfile: input_trips_001.rou.alt.xml
< parse routeAltfile from externalGawron:  input_trips_000.rou.galt.xml
< new probability for route 1 for veh 0
< new probability for route 3 for veh 1
< new probability for route 5 for veh 2
< new probability for route 7 for veh 3
< new probability for route 9 for veh 4
<truncated after showing first 30 lines>

4 TESTS FAILED on ts-sim-build-ba :

---------- Differences in errors ----------
0a1
> Execution of ['/home/delphi/extraClangDebug/sumo/tests/../bin/sumo', '-c', 'iteration_000.sumocfg'] failed. Look into dua.log for details.
---------- Differences in output ----------
6,40d5
< <<
< ------------------
< 
< Loading configuration... done.
< > Executing step 1
< >> Running router on input_trips_000.rou.alt.xml
< <<
< >> Running simulation
< <<
< ------------------
< 
< Loading configuration... done.
< > Executing step 2
< >> Running router on input_trips_001.rou.alt.xml
< <<
< >> Running simulation
< <<
< ------------------
< 
< Loading configuration... done.
< > Executing step 3
< >> Running router on input_trips_002.rou.alt.xml
< <<
< >> Running simulation
< <<
< ------------------
< 
< Loading configuration... done.
< > Executing step 4
<truncated after showing first 30 lines>
assign dua-iterate filtered_tripinfo ( Last six runs Aug2019 )
assign dua-iterate simple ( Last six runs Aug2019 )
assign dua-iterate unordered_input ( Last six runs Aug2019 )
assign dua-iterate vtypes_add ( Last six runs Aug2019 )

TEST FAILED on ts-sim-build-ba : assign dua-iterate start_with_routes ( Last six runs Aug2019 )

---------- Differences in errors ----------
0a1
> Execution of ['/home/delphi/extraClangDebug/sumo/tests/../bin/sumo', '-c', 'iteration_000.sumocfg'] failed. Look into dua.log for details.
---------- Differences in output ----------
6,40d5
< <<
< ------------------
< 
< Loading configuration... done.
< > Executing step 1
< >> Running router on input_routes_000.rou.alt.xml
< <<
< >> Running simulation
< <<
< ------------------
< 
< Loading configuration... done.
< > Executing step 2
< >> Running router on input_routes_001.rou.alt.xml
< <<
< >> Running simulation
< <<
< ------------------
< 
< Loading configuration... done.
< > Executing step 3
< >> Running router on input_routes_002.rou.alt.xml
< <<
< >> Running simulation
< <<
< ------------------
< 
< Loading configuration... done.
< > Executing step 4
<truncated after showing first 30 lines>

TEST FAILED on ts-sim-build-ba : assign dua-iterate weight_memory ( Last six runs Aug2019 )

---------- Differences in errors ----------
0a1
> Execution of ['/home/delphi/extraClangDebug/sumo/tests/../bin/sumo', '-c', 'iteration_000.sumocfg'] failed. Look into dua.log for details.
---------- Differences in output ----------
6,65d5
< <<
< >> Smoothing edge weights
< >>> Updated 4 edges
< >>> Decayed 0 unseen edges
< >>> Error avg:0 mean:0
< >>> Absolute Error avg:0 mean:0
< ------------------
< 
< Loading configuration... done.
< > Executing step 1
< >> Running router on input_trips_000.rou.alt.xml
< <<
< >> Running simulation
< <<
< >> Smoothing edge weights
< >>> Updated 7 edges
< >>> Decayed 0 unseen edges
< >>> Error avg:0.148571428571 mean:0
< >>> Absolute Error avg:0.202857142857 mean:0.02
< ------------------
< 
< Loading configuration... done.
< > Executing step 2
< >> Running router on input_trips_001.rou.alt.xml
< <<
< >> Running simulation
< <<
< >> Smoothing edge weights
< >>> Updated 7 edges
<truncated after showing first 30 lines>

TEST FAILED on ts-sim-build-ba : assign one-shot simple ( Last six runs Aug2019 )

---------- Differences in errors ----------
0a1
> Execution of ['/home/delphi/extraClangDebug/sumo/tests/../bin/sumo', '-c', 'one_shot_-1.sumocfg'] failed. Look into one_shot-log.txt for details.
---------- Differences in output ----------
2,12d1
< ------------------
< 
< > Running simulation with update frequency 1800
< ------------------
< 
< > Running simulation with update frequency 300
< ------------------
< 
< > Running simulation with update frequency 15
< ------------------
< 

TEST FAILED on ts-sim-build-ba : build checkStyle header ( Last six runs Aug2019 )

---------- Differences in output ----------
1,14d0
< src/foreign/eulerspiral/odrSpiral.cpp header does not start
< src/foreign/eulerspiral/odrSpiral.h header does not start
< src/foreign/fontstash/fontstash.h header does not start
< src/foreign/fontstash/glfontstash.h header does not start
< src/foreign/fontstash/stb_truetype.h header does not start
< src/foreign/rtree/RTree.h header does not start
< src/foreign/tcpip/socket.cpp header does not start
< src/foreign/tcpip/socket.h header does not start
< src/foreign/tcpip/storage.cpp header does not start
< src/foreign/tcpip/storage.h header does not start
< tools/webWizard/SimpleWebSocketServer.py different license:
< # Eclipse SUMO, Simulation of Urban MObility; see https://eclipse.org/sumo
< # The MIT License (MIT) Copyright (c) 2013 Dave P.
< 

TEST FAILED on ts-sim-build-ba : build checkStyle tools ( Last six runs Aug2019 )

---------- Differences in output ----------
1,4d0
< webWizard/SimpleWebSocketServer.py different license:
< # Eclipse SUMO, Simulation of Urban MObility; see https://eclipse.org/sumo
< # The MIT License (MIT) Copyright (c) 2013 Dave P.
< 

TEST FAILED on ts-sim-build-ba : detector flowFromEdgeData motorway_ramps restrict_inconsistent ( Last six runs Aug2019 )

---------- Differences in output ----------
10c10
< # 1140.8101405345824 1250.0 109.18985946541754 200.72790653387625 0.400858862201486
---
> # 1140.8101405345824 1250.0 109.18985946541754 200.72790653387625 0.4008588622014859

TEST FAILED on ts-sim-build-ba : district districts2poly ( Last six runs Aug2019 )

---------- Differences in districts ----------
2,11c2,11
< <poly id="3/2to2/2_2/2to3/2" color="168,255,0" layer="100" type="taz_edge" shape="804.75,798.35 1195.25,798.35"/>
< <poly id="3/2to2/2_3/2to2/2" color="168,255,0" layer="100" type="taz_edge" shape="1195.25,801.65 804.75,801.65"/>
< <poly id="2/1to3/1_2/1to3/1" color="107,0,255" layer="100" type="taz_edge" shape="804.75,398.35 1195.25,398.35"/>
< <poly id="2/1to3/1_3/1to2/1" color="107,0,255" layer="100" type="taz_edge" shape="1195.25,401.65 804.75,401.65"/>
< <poly id="3/1to4/1_3/1to4/1" color="15,0,255" layer="100" type="taz_edge" shape="1204.75,398.35 1595.25,398.35"/>
< <poly id="3/1to4/1_4/1to3/1" color="15,0,255" layer="100" type="taz_edge" shape="1595.25,401.65 1204.75,401.65"/>
< <poly id="3/2to4/2_3/2to4/2" color="255,0,165" layer="100" type="taz_edge" shape="1204.75,798.35 1596.75,798.35"/>
< <poly id="3/2to4/2_4/2to3/2" color="255,0,165" layer="100" type="taz_edge" shape="1596.75,801.65 1204.75,801.65"/>
< <poly id="1/1to0/1_0/1to1/1" color="255,133,0" layer="100" type="taz_edge" shape="4.75,398.35 395.25,398.35"/>
< <poly id="1/1to0/1_1/1to0/1" color="255,133,0" layer="100" type="taz_edge" shape="395.25,401.65 4.75,401.65"/>
---
> <poly id="3/2to2/2_2/2to3/2" color="135,255,0" layer="100" type="taz_edge" shape="804.75,798.35 1195.25,798.35"/>
> <poly id="3/2to2/2_3/2to2/2" color="135,255,0" layer="100" type="taz_edge" shape="1195.25,801.65 804.75,801.65"/>
> <poly id="2/1to3/1_2/1to3/1" color="255,213,0" layer="100" type="taz_edge" shape="804.75,398.35 1195.25,398.35"/>
> <poly id="2/1to3/1_3/1to2/1" color="255,213,0" layer="100" type="taz_edge" shape="1195.25,401.65 804.75,401.65"/>
> <poly id="3/1to4/1_3/1to4/1" color="255,157,0" layer="100" type="taz_edge" shape="1204.75,398.35 1595.25,398.35"/>
> <poly id="3/1to4/1_4/1to3/1" color="255,157,0" layer="100" type="taz_edge" shape="1595.25,401.65 1204.75,401.65"/>
> <poly id="3/2to4/2_3/2to4/2" color="113,0,255" layer="100" type="taz_edge" shape="1204.75,798.35 1596.75,798.35"/>
> <poly id="3/2to4/2_4/2to3/2" color="113,0,255" layer="100" type="taz_edge" shape="1596.75,801.65 1204.75,801.65"/>
> <poly id="1/1to0/1_0/1to1/1" color="0,186,255" layer="100" type="taz_edge" shape="4.75,398.35 395.25,398.35"/>
> <poly id="1/1to0/1_1/1to0/1" color="0,186,255" layer="100" type="taz_edge" shape="395.25,401.65 4.75,401.65"/>

TEST FAILED on ts-sim-build-ba : import OSM webWizard ( Last six runs Aug2019 )

---------- Differences in errors ----------
427a428,1026
> 
> =================================================================
> ==30108==ERROR: LeakSanitizer: detected memory leaks
> 
> Direct leak of 243200 byte(s) in 760 object(s) allocated from:
>     #0 0xa2b680  (/home/delphi/extraClangDebug/sumo/bin/netconvertD+0xa2b680)
>     #1 0x1354dee  (/home/delphi/extraClangDebug/sumo/bin/netconvertD+0x1354dee)
>     #2 0x1354797  (/home/delphi/extraClangDebug/sumo/bin/netconvertD+0x1354797)
>     #3 0x134c0f0  (/home/delphi/extraClangDebug/sumo/bin/netconvertD+0x134c0f0)
>     #4 0x179088d  (/home/delphi/extraClangDebug/sumo/bin/netconvertD+0x179088d)
>     #5 0xa3276e  (/home/delphi/extraClangDebug/sumo/bin/netconvertD+0xa3276e)
>     #6 0x7f1a274b5b96  (/lib/x86_64-linux-gnu/libc.so.6+0x21b96)
> 
> Direct leak of 107840 byte(s) in 337 object(s) allocated from:
>     #0 0xa2b680  (/home/delphi/extraClangDebug/sumo/bin/netconvertD+0xa2b680)
>     #1 0x1354dee  (/home/delphi/extraClangDebug/sumo/bin/netconvertD+0x1354dee)
>     #2 0x1351fa3  (/home/delphi/extraClangDebug/sumo/bin/netconvertD+0x1351fa3)
>     #3 0x134c0f0  (/home/delphi/extraClangDebug/sumo/bin/netconvertD+0x134c0f0)
>     #4 0x179088d  (/home/delphi/extraClangDebug/sumo/bin/netconvertD+0x179088d)
>     #5 0xa3276e  (/home/delphi/extraClangDebug/sumo/bin/netconvertD+0xa3276e)
>     #6 0x7f1a274b5b96  (/lib/x86_64-linux-gnu/libc.so.6+0x21b96)
> 
> Direct leak of 32320 byte(s) in 101 object(s) allocated from:
>     #0 0xa2b680  (/home/delphi/extraClangDebug/sumo/bin/netconvertD+0xa2b680)
>     #1 0x1354dee  (/home/delphi/extraClangDebug/sumo/bin/netconvertD+0x1354dee)
>     #2 0x1351fa3  (/home/delphi/extraClangDebug/sumo/bin/netconvertD+0x1351fa3)
>     #3 0x134c47c  (/home/delphi/extraClangDebug/sumo/bin/netconvertD+0x134c47c)
>     #4 0x179088d  (/home/delphi/extraClangDebug/sumo/bin/netconvertD+0x179088d)
>     #5 0xa3276e  (/home/delphi/extraClangDebug/sumo/bin/netconvertD+0xa3276e)
<truncated after showing first 30 lines>
---------- Differences in output ----------
121c121
< Simulation ended at time: 2657.00
---
> Simulation ended at time: 2856.00
128c128
< Teleports: 4 (Collisions: 3, Wrong Lane: 1)
---
> Teleports: 3 (Collisions: 3)
133,137c133,137
<  RouteLength: 1698.99
<  Duration: 320.75
<  WaitingTime: 46.49
<  TimeLoss: 97.48
<  DepartDelay: 0.17
---
>  RouteLength: 1693.83
>  Duration: 318.63
>  WaitingTime: 43.30
>  TimeLoss: 94.57
>  DepartDelay: 0.18
139,141c139,141
<  RouteLength: 283.85
<  Duration: 237.92
<  TimeLoss: 38.91
---
>  RouteLength: 283.84
>  Duration: 241.25
>  TimeLoss: 39.44
143,147c143,147
<  WaitingTime: 108.31
<truncated after showing first 30 lines>

TEST FAILED on ts-sim-build-ba : misc createVehTypeDistribution example ( Last six runs Aug2019 )

---------- Differences in additional ----------
3,12c3,12
<         <vType carFollowModel="Krauss" class="passenger" id="exampleDist0" length="4.801" sigma="0.751" tau="0.825"/>
<         <vType carFollowModel="Krauss" class="passenger" id="exampleDist1" length="4.705" sigma="0.613" tau="0.786"/>
<         <vType carFollowModel="Krauss" class="passenger" id="exampleDist2" length="5.248" sigma="0.435" tau="0.683"/>
<         <vType carFollowModel="Krauss" class="passenger" id="exampleDist3" length="5.201" sigma="0.890" tau="0.918"/>
<         <vType carFollowModel="Krauss" class="passenger" id="exampleDist4" length="4.807" sigma="0.796" tau="1.031"/>
<         <vType carFollowModel="Krauss" class="passenger" id="exampleDist5" length="4.974" sigma="0.369" tau="0.947"/>
<         <vType carFollowModel="Krauss" class="passenger" id="exampleDist6" length="4.710" sigma="0.573" tau="0.706"/>
<         <vType carFollowModel="Krauss" class="passenger" id="exampleDist7" length="5.030" sigma="0.083" tau="0.772"/>
<         <vType carFollowModel="Krauss" class="passenger" id="exampleDist8" length="4.962" sigma="0.414" tau="0.707"/>
<         <vType carFollowModel="Krauss" class="passenger" id="exampleDist9" length="4.988" sigma="0.763" tau="0.894"/>
---
>         <vType carFollowModel="Krauss" class="passenger" id="exampleDist0" length="5.151" sigma="0.401" tau="0.825"/>
>         <vType carFollowModel="Krauss" class="passenger" id="exampleDist1" length="5.013" sigma="0.305" tau="0.786"/>
>         <vType carFollowModel="Krauss" class="passenger" id="exampleDist2" length="4.835" sigma="0.848" tau="0.683"/>
>         <vType carFollowModel="Krauss" class="passenger" id="exampleDist3" length="5.290" sigma="0.801" tau="0.918"/>
>         <vType carFollowModel="Krauss" class="passenger" id="exampleDist4" length="5.196" sigma="0.407" tau="1.031"/>
>         <vType carFollowModel="Krauss" class="passenger" id="exampleDist5" length="4.769" sigma="0.574" tau="0.947"/>
>         <vType carFollowModel="Krauss" class="passenger" id="exampleDist6" length="4.973" sigma="0.310" tau="0.706"/>
>         <vType carFollowModel="Krauss" class="passenger" id="exampleDist7" length="4.483" sigma="0.630" tau="0.772"/>
>         <vType carFollowModel="Krauss" class="passenger" id="exampleDist8" length="4.814" sigma="0.562" tau="0.707"/>
>         <vType carFollowModel="Krauss" class="passenger" id="exampleDist9" length="5.163" sigma="0.588" tau="0.894"/>

TEST FAILED on ts-sim-build-ba : net netdiff crossing ( Last six runs Aug2019 )

---------- Differences in errors ----------
0a1,86
> 
> =================================================================
> ==27837==ERROR: LeakSanitizer: detected memory leaks
> 
> Direct leak of 640 byte(s) in 2 object(s) allocated from:
>     #0 0xa2b680  (/home/delphi/extraClangDebug/sumo/bin/netconvertD+0xa2b680)
>     #1 0x1354dee  (/home/delphi/extraClangDebug/sumo/bin/netconvertD+0x1354dee)
>     #2 0xedc904  (/home/delphi/extraClangDebug/sumo/bin/netconvertD+0xedc904)
>     #3 0xec9693  (/home/delphi/extraClangDebug/sumo/bin/netconvertD+0xec9693)
>     #4 0xc2f33e  (/home/delphi/extraClangDebug/sumo/bin/netconvertD+0xc2f33e)
>     #5 0xa321fa  (/home/delphi/extraClangDebug/sumo/bin/netconvertD+0xa321fa)
>     #6 0x7f3ff767db96  (/lib/x86_64-linux-gnu/libc.so.6+0x21b96)
> 
> Indirect leak of 96 byte(s) in 2 object(s) allocated from:
>     #0 0xa2b680  (/home/delphi/extraClangDebug/sumo/bin/netconvertD+0xa2b680)
>     #1 0xab712a  (/home/delphi/extraClangDebug/sumo/bin/netconvertD+0xab712a)
>     #2 0xab704d  (/home/delphi/extraClangDebug/sumo/bin/netconvertD+0xab704d)
>     #3 0xab6d1b  (/home/delphi/extraClangDebug/sumo/bin/netconvertD+0xab6d1b)
>     #4 0xae2a3b  (/home/delphi/extraClangDebug/sumo/bin/netconvertD+0xae2a3b)
>     #5 0xaab57f  (/home/delphi/extraClangDebug/sumo/bin/netconvertD+0xaab57f)
>     #6 0x135e2a7  (/home/delphi/extraClangDebug/sumo/bin/netconvertD+0x135e2a7)
>     #7 0x13560b9  (/home/delphi/extraClangDebug/sumo/bin/netconvertD+0x13560b9)
>     #8 0x1795dda  (/home/delphi/extraClangDebug/sumo/bin/netconvertD+0x1795dda)
>     #9 0xa3276e  (/home/delphi/extraClangDebug/sumo/bin/netconvertD+0xa3276e)
>     #10 0x7f3ff767db96  (/lib/x86_64-linux-gnu/libc.so.6+0x21b96)
> 
> Indirect leak of 32 byte(s) in 2 object(s) allocated from:
>     #0 0xa2b680  (/home/delphi/extraClangDebug/sumo/bin/netconvertD+0xa2b680)
>     #1 0xac2bca  (/home/delphi/extraClangDebug/sumo/bin/netconvertD+0xac2bca)
<truncated after showing first 30 lines>

2 TESTS FAILED on ts-sim-build-ba :

---------- Differences in pois ----------
2,12c2,12
<     <poi id="r1#1_10.0" type="r1#1" color="107,0,255" layer="100" lon="516.45" lat="498.35"/>
<     <poi id="r1#1_11.0" type="r1#1" color="107,0,255" layer="100" lon="527.56" lat="498.35"/>
<     <poi id="r1#1_12.0" type="r1#1" color="107,0,255" layer="100" lon="538.67" lat="498.35"/>
<     <poi id="r1#1_13.0" type="r1#1" color="107,0,255" layer="100" lon="549.78" lat="498.35"/>
<     <poi id="r1#1_14.0" type="r1#1" color="107,0,255" layer="100" lon="560.89" lat="498.35"/>
<     <poi id="r1#1_15.0" type="r1#1" color="107,0,255" layer="100" lon="572.0" lat="498.35"/>
<     <poi id="r1#1_16.0" type="r1#1" color="107,0,255" layer="100" lon="583.11" lat="498.35"/>
<     <poi id="r1#1_17.0" type="r1#1" color="107,0,255" layer="100" lon="594.22" lat="498.35"/>
<     <poi id="r1#1_18.0" type="r1#1" color="107,0,255" layer="100" lon="605.33" lat="498.35"/>
<     <poi id="r1#1_19.0" type="r1#1" color="107,0,255" layer="100" lon="616.44" lat="498.35"/>
<     <poi id="r1#1_20.0" type="r1#1" color="107,0,255" layer="100" lon="627.55" lat="498.35"/>
---
>     <poi id="r1#1_10.0" type="r1#1" color="168,255,0" layer="100" lon="516.45" lat="498.35"/>
>     <poi id="r1#1_11.0" type="r1#1" color="168,255,0" layer="100" lon="527.56" lat="498.35"/>
>     <poi id="r1#1_12.0" type="r1#1" color="168,255,0" layer="100" lon="538.67" lat="498.35"/>
>     <poi id="r1#1_13.0" type="r1#1" color="168,255,0" layer="100" lon="549.78" lat="498.35"/>
>     <poi id="r1#1_14.0" type="r1#1" color="168,255,0" layer="100" lon="560.89" lat="498.35"/>
>     <poi id="r1#1_15.0" type="r1#1" color="168,255,0" layer="100" lon="572.0" lat="498.35"/>
>     <poi id="r1#1_16.0" type="r1#1" color="168,255,0" layer="100" lon="583.11" lat="498.35"/>
>     <poi id="r1#1_17.0" type="r1#1" color="168,255,0" layer="100" lon="594.22" lat="498.35"/>
>     <poi id="r1#1_18.0" type="r1#1" color="168,255,0" layer="100" lon="605.33" lat="498.35"/>
>     <poi id="r1#1_19.0" type="r1#1" color="168,255,0" layer="100" lon="616.44" lat="498.35"/>
>     <poi id="r1#1_20.0" type="r1#1" color="168,255,0" layer="100" lon="627.55" lat="498.35"/>
14c14
<     <poi id="r1#1_21.0" type="r1#1" color="107,0,255" layer="100" lon="638.66" lat="498.35"/>
---
>     <poi id="r1#1_21.0" type="r1#1" color="168,255,0" layer="100" lon="638.66" lat="498.35"/>
16c16
<     <poi id="r1#1_22.0" type="r1#1" color="107,0,255" layer="100" lon="649.77" lat="498.35"/>
<truncated after showing first 30 lines>
output converter persons poi ( Last six runs Aug2019 )
output converter poi ( Last six runs Aug2019 )

TEST FAILED on ts-sim-build-ba : public_transport ptlines2flows basic ( Last six runs Aug2019 )

---------- Differences in errors ----------
0a1,172
> /home/delphi/extraClangDebug/sumo/src/microsim/MSEdge.cpp:285:53: runtime error: load of value 67108864, which is not a valid value for type 'SUMOVehicleClass'
> SUMMARY: UndefinedBehaviorSanitizer: undefined-behavior /home/delphi/extraClangDebug/sumo/src/microsim/MSEdge.cpp:285:53 in 
> 
> =================================================================
> ==30786==ERROR: LeakSanitizer: detected memory leaks
> 
> Direct leak of 12600 byte(s) in 525 object(s) allocated from:
>     #0 0xca5430  (/home/delphi/extraClangDebug/sumo/bin/sumoD+0xca5430)
>     #1 0x137ca8c  (/home/delphi/extraClangDebug/sumo/bin/sumoD+0x137ca8c)
>     #2 0x137948c  (/home/delphi/extraClangDebug/sumo/bin/sumoD+0x137948c)
>     #3 0x1377144  (/home/delphi/extraClangDebug/sumo/bin/sumoD+0x1377144)
>     #4 0x1ba9b4a  (/home/delphi/extraClangDebug/sumo/bin/sumoD+0x1ba9b4a)
>     #5 0x1aea3c0  (/home/delphi/extraClangDebug/sumo/bin/sumoD+0x1aea3c0)
>     #6 0x1ae2bd5  (/home/delphi/extraClangDebug/sumo/bin/sumoD+0x1ae2bd5)
>     #7 0x1aee92e  (/home/delphi/extraClangDebug/sumo/bin/sumoD+0x1aee92e)
>     #8 0xcaacf3  (/home/delphi/extraClangDebug/sumo/bin/sumoD+0xcaacf3)
>     #9 0x7f7d6eec7b96  (/lib/x86_64-linux-gnu/libc.so.6+0x21b96)
> 
> Indirect leak of 6352 byte(s) in 525 object(s) allocated from:
>     #0 0xca5430  (/home/delphi/extraClangDebug/sumo/bin/sumoD+0xca5430)
>     #1 0x110828a  (/home/delphi/extraClangDebug/sumo/bin/sumoD+0x110828a)
>     #2 0x11081ad  (/home/delphi/extraClangDebug/sumo/bin/sumoD+0x11081ad)
>     #3 0x110813b  (/home/delphi/extraClangDebug/sumo/bin/sumoD+0x110813b)
>     #4 0x11098eb  (/home/delphi/extraClangDebug/sumo/bin/sumoD+0x11098eb)
>     #5 0x10cfc1f  (/home/delphi/extraClangDebug/sumo/bin/sumoD+0x10cfc1f)
>     #6 0x137d309  (/home/delphi/extraClangDebug/sumo/bin/sumoD+0x137d309)
>     #7 0x137948c  (/home/delphi/extraClangDebug/sumo/bin/sumoD+0x137948c)
>     #8 0x1377144  (/home/delphi/extraClangDebug/sumo/bin/sumoD+0x1377144)
>     #9 0x1ba9b4a  (/home/delphi/extraClangDebug/sumo/bin/sumoD+0x1ba9b4a)
<truncated after showing first 30 lines>

TEST FAILED on ts-sim-build-ba : public_transport ptlines2flows begin_end ( Last six runs Aug2019 )

---------- Differences in errors ----------
0a1,172
> /home/delphi/extraClangDebug/sumo/src/microsim/MSEdge.cpp:285:53: runtime error: load of value 67108864, which is not a valid value for type 'SUMOVehicleClass'
> SUMMARY: UndefinedBehaviorSanitizer: undefined-behavior /home/delphi/extraClangDebug/sumo/src/microsim/MSEdge.cpp:285:53 in 
> 
> =================================================================
> ==30787==ERROR: LeakSanitizer: detected memory leaks
> 
> Direct leak of 12600 byte(s) in 525 object(s) allocated from:
>     #0 0xca5430  (/home/delphi/extraClangDebug/sumo/bin/sumoD+0xca5430)
>     #1 0x137ca8c  (/home/delphi/extraClangDebug/sumo/bin/sumoD+0x137ca8c)
>     #2 0x137948c  (/home/delphi/extraClangDebug/sumo/bin/sumoD+0x137948c)
>     #3 0x1377144  (/home/delphi/extraClangDebug/sumo/bin/sumoD+0x1377144)
>     #4 0x1ba9b4a  (/home/delphi/extraClangDebug/sumo/bin/sumoD+0x1ba9b4a)
>     #5 0x1aea3c0  (/home/delphi/extraClangDebug/sumo/bin/sumoD+0x1aea3c0)
>     #6 0x1ae2bd5  (/home/delphi/extraClangDebug/sumo/bin/sumoD+0x1ae2bd5)
>     #7 0x1aee92e  (/home/delphi/extraClangDebug/sumo/bin/sumoD+0x1aee92e)
>     #8 0xcaacf3  (/home/delphi/extraClangDebug/sumo/bin/sumoD+0xcaacf3)
>     #9 0x7f6452389b96  (/lib/x86_64-linux-gnu/libc.so.6+0x21b96)
> 
> Indirect leak of 6352 byte(s) in 525 object(s) allocated from:
>     #0 0xca5430  (/home/delphi/extraClangDebug/sumo/bin/sumoD+0xca5430)
>     #1 0x110828a  (/home/delphi/extraClangDebug/sumo/bin/sumoD+0x110828a)
>     #2 0x11081ad  (/home/delphi/extraClangDebug/sumo/bin/sumoD+0x11081ad)
>     #3 0x110813b  (/home/delphi/extraClangDebug/sumo/bin/sumoD+0x110813b)
>     #4 0x11098eb  (/home/delphi/extraClangDebug/sumo/bin/sumoD+0x11098eb)
>     #5 0x10cfc1f  (/home/delphi/extraClangDebug/sumo/bin/sumoD+0x10cfc1f)
>     #6 0x137d309  (/home/delphi/extraClangDebug/sumo/bin/sumoD+0x137d309)
>     #7 0x137948c  (/home/delphi/extraClangDebug/sumo/bin/sumoD+0x137948c)
>     #8 0x1377144  (/home/delphi/extraClangDebug/sumo/bin/sumoD+0x1377144)
>     #9 0x1ba9b4a  (/home/delphi/extraClangDebug/sumo/bin/sumoD+0x1ba9b4a)
<truncated after showing first 30 lines>

TEST FAILED on ts-sim-build-ba : public_transport ptlines2flows few_stops ( Last six runs Aug2019 )

---------- Differences in errors ----------
3a4,175
> /home/delphi/extraClangDebug/sumo/src/microsim/MSEdge.cpp:285:53: runtime error: load of value 67108864, which is not a valid value for type 'SUMOVehicleClass'
> SUMMARY: UndefinedBehaviorSanitizer: undefined-behavior /home/delphi/extraClangDebug/sumo/src/microsim/MSEdge.cpp:285:53 in 
> 
> =================================================================
> ==30844==ERROR: LeakSanitizer: detected memory leaks
> 
> Direct leak of 12600 byte(s) in 525 object(s) allocated from:
>     #0 0xca5430  (/home/delphi/extraClangDebug/sumo/bin/sumoD+0xca5430)
>     #1 0x137ca8c  (/home/delphi/extraClangDebug/sumo/bin/sumoD+0x137ca8c)
>     #2 0x137948c  (/home/delphi/extraClangDebug/sumo/bin/sumoD+0x137948c)
>     #3 0x1377144  (/home/delphi/extraClangDebug/sumo/bin/sumoD+0x1377144)
>     #4 0x1ba9b4a  (/home/delphi/extraClangDebug/sumo/bin/sumoD+0x1ba9b4a)
>     #5 0x1aea3c0  (/home/delphi/extraClangDebug/sumo/bin/sumoD+0x1aea3c0)
>     #6 0x1ae2bd5  (/home/delphi/extraClangDebug/sumo/bin/sumoD+0x1ae2bd5)
>     #7 0x1aee92e  (/home/delphi/extraClangDebug/sumo/bin/sumoD+0x1aee92e)
>     #8 0xcaacf3  (/home/delphi/extraClangDebug/sumo/bin/sumoD+0xcaacf3)
>     #9 0x7fe07059cb96  (/lib/x86_64-linux-gnu/libc.so.6+0x21b96)
> 
> Indirect leak of 6352 byte(s) in 525 object(s) allocated from:
>     #0 0xca5430  (/home/delphi/extraClangDebug/sumo/bin/sumoD+0xca5430)
>     #1 0x110828a  (/home/delphi/extraClangDebug/sumo/bin/sumoD+0x110828a)
>     #2 0x11081ad  (/home/delphi/extraClangDebug/sumo/bin/sumoD+0x11081ad)
>     #3 0x110813b  (/home/delphi/extraClangDebug/sumo/bin/sumoD+0x110813b)
>     #4 0x11098eb  (/home/delphi/extraClangDebug/sumo/bin/sumoD+0x11098eb)
>     #5 0x10cfc1f  (/home/delphi/extraClangDebug/sumo/bin/sumoD+0x10cfc1f)
>     #6 0x137d309  (/home/delphi/extraClangDebug/sumo/bin/sumoD+0x137d309)
>     #7 0x137948c  (/home/delphi/extraClangDebug/sumo/bin/sumoD+0x137948c)
>     #8 0x1377144  (/home/delphi/extraClangDebug/sumo/bin/sumoD+0x1377144)
>     #9 0x1ba9b4a  (/home/delphi/extraClangDebug/sumo/bin/sumoD+0x1ba9b4a)
<truncated after showing first 30 lines>

TEST FAILED on ts-sim-build-ba : public_transport ptlines2flows hrtime ( Last six runs Aug2019 )

---------- Differences in errors ----------
0a1,172
> /home/delphi/extraClangDebug/sumo/src/microsim/MSEdge.cpp:285:53: runtime error: load of value 67108864, which is not a valid value for type 'SUMOVehicleClass'
> SUMMARY: UndefinedBehaviorSanitizer: undefined-behavior /home/delphi/extraClangDebug/sumo/src/microsim/MSEdge.cpp:285:53 in 
> 
> =================================================================
> ==30831==ERROR: LeakSanitizer: detected memory leaks
> 
> Direct leak of 12600 byte(s) in 525 object(s) allocated from:
>     #0 0xca5430  (/home/delphi/extraClangDebug/sumo/bin/sumoD+0xca5430)
>     #1 0x137ca8c  (/home/delphi/extraClangDebug/sumo/bin/sumoD+0x137ca8c)
>     #2 0x137948c  (/home/delphi/extraClangDebug/sumo/bin/sumoD+0x137948c)
>     #3 0x1377144  (/home/delphi/extraClangDebug/sumo/bin/sumoD+0x1377144)
>     #4 0x1ba9b4a  (/home/delphi/extraClangDebug/sumo/bin/sumoD+0x1ba9b4a)
>     #5 0x1aea3c0  (/home/delphi/extraClangDebug/sumo/bin/sumoD+0x1aea3c0)
>     #6 0x1ae2bd5  (/home/delphi/extraClangDebug/sumo/bin/sumoD+0x1ae2bd5)
>     #7 0x1aee92e  (/home/delphi/extraClangDebug/sumo/bin/sumoD+0x1aee92e)
>     #8 0xcaacf3  (/home/delphi/extraClangDebug/sumo/bin/sumoD+0xcaacf3)
>     #9 0x7fe821511b96  (/lib/x86_64-linux-gnu/libc.so.6+0x21b96)
> 
> Indirect leak of 6352 byte(s) in 525 object(s) allocated from:
>     #0 0xca5430  (/home/delphi/extraClangDebug/sumo/bin/sumoD+0xca5430)
>     #1 0x110828a  (/home/delphi/extraClangDebug/sumo/bin/sumoD+0x110828a)
>     #2 0x11081ad  (/home/delphi/extraClangDebug/sumo/bin/sumoD+0x11081ad)
>     #3 0x110813b  (/home/delphi/extraClangDebug/sumo/bin/sumoD+0x110813b)
>     #4 0x11098eb  (/home/delphi/extraClangDebug/sumo/bin/sumoD+0x11098eb)
>     #5 0x10cfc1f  (/home/delphi/extraClangDebug/sumo/bin/sumoD+0x10cfc1f)
>     #6 0x137d309  (/home/delphi/extraClangDebug/sumo/bin/sumoD+0x137d309)
>     #7 0x137948c  (/home/delphi/extraClangDebug/sumo/bin/sumoD+0x137948c)
>     #8 0x1377144  (/home/delphi/extraClangDebug/sumo/bin/sumoD+0x1377144)
>     #9 0x1ba9b4a  (/home/delphi/extraClangDebug/sumo/bin/sumoD+0x1ba9b4a)
<truncated after showing first 30 lines>

TEST FAILED on ts-sim-build-ba : public_transport ptlines2flows name_missing ( Last six runs Aug2019 )

---------- Differences in errors ----------
0a1,172
> /home/delphi/extraClangDebug/sumo/src/microsim/MSEdge.cpp:285:53: runtime error: load of value 67108864, which is not a valid value for type 'SUMOVehicleClass'
> SUMMARY: UndefinedBehaviorSanitizer: undefined-behavior /home/delphi/extraClangDebug/sumo/src/microsim/MSEdge.cpp:285:53 in 
> 
> =================================================================
> ==30843==ERROR: LeakSanitizer: detected memory leaks
> 
> Direct leak of 12600 byte(s) in 525 object(s) allocated from:
>     #0 0xca5430  (/home/delphi/extraClangDebug/sumo/bin/sumoD+0xca5430)
>     #1 0x137ca8c  (/home/delphi/extraClangDebug/sumo/bin/sumoD+0x137ca8c)
>     #2 0x137948c  (/home/delphi/extraClangDebug/sumo/bin/sumoD+0x137948c)
>     #3 0x1377144  (/home/delphi/extraClangDebug/sumo/bin/sumoD+0x1377144)
>     #4 0x1ba9b4a  (/home/delphi/extraClangDebug/sumo/bin/sumoD+0x1ba9b4a)
>     #5 0x1aea3c0  (/home/delphi/extraClangDebug/sumo/bin/sumoD+0x1aea3c0)
>     #6 0x1ae2bd5  (/home/delphi/extraClangDebug/sumo/bin/sumoD+0x1ae2bd5)
>     #7 0x1aee92e  (/home/delphi/extraClangDebug/sumo/bin/sumoD+0x1aee92e)
>     #8 0xcaacf3  (/home/delphi/extraClangDebug/sumo/bin/sumoD+0xcaacf3)
>     #9 0x7f3b81abfb96  (/lib/x86_64-linux-gnu/libc.so.6+0x21b96)
> 
> Indirect leak of 6352 byte(s) in 525 object(s) allocated from:
>     #0 0xca5430  (/home/delphi/extraClangDebug/sumo/bin/sumoD+0xca5430)
>     #1 0x110828a  (/home/delphi/extraClangDebug/sumo/bin/sumoD+0x110828a)
>     #2 0x11081ad  (/home/delphi/extraClangDebug/sumo/bin/sumoD+0x11081ad)
>     #3 0x110813b  (/home/delphi/extraClangDebug/sumo/bin/sumoD+0x110813b)
>     #4 0x11098eb  (/home/delphi/extraClangDebug/sumo/bin/sumoD+0x11098eb)
>     #5 0x10cfc1f  (/home/delphi/extraClangDebug/sumo/bin/sumoD+0x10cfc1f)
>     #6 0x137d309  (/home/delphi/extraClangDebug/sumo/bin/sumoD+0x137d309)
>     #7 0x137948c  (/home/delphi/extraClangDebug/sumo/bin/sumoD+0x137948c)
>     #8 0x1377144  (/home/delphi/extraClangDebug/sumo/bin/sumoD+0x1377144)
>     #9 0x1ba9b4a  (/home/delphi/extraClangDebug/sumo/bin/sumoD+0x1ba9b4a)
<truncated after showing first 30 lines>

TEST FAILED on ts-sim-build-ba : public_transport ptlines2flows night ( Last six runs Aug2019 )

---------- Differences in errors ----------
0a1,172
> /home/delphi/extraClangDebug/sumo/src/microsim/MSEdge.cpp:285:53: runtime error: load of value 67108864, which is not a valid value for type 'SUMOVehicleClass'
> SUMMARY: UndefinedBehaviorSanitizer: undefined-behavior /home/delphi/extraClangDebug/sumo/src/microsim/MSEdge.cpp:285:53 in 
> 
> =================================================================
> ==30877==ERROR: LeakSanitizer: detected memory leaks
> 
> Direct leak of 12600 byte(s) in 525 object(s) allocated from:
>     #0 0xca5430  (/home/delphi/extraClangDebug/sumo/bin/sumoD+0xca5430)
>     #1 0x137ca8c  (/home/delphi/extraClangDebug/sumo/bin/sumoD+0x137ca8c)
>     #2 0x137948c  (/home/delphi/extraClangDebug/sumo/bin/sumoD+0x137948c)
>     #3 0x1377144  (/home/delphi/extraClangDebug/sumo/bin/sumoD+0x1377144)
>     #4 0x1ba9b4a  (/home/delphi/extraClangDebug/sumo/bin/sumoD+0x1ba9b4a)
>     #5 0x1aea3c0  (/home/delphi/extraClangDebug/sumo/bin/sumoD+0x1aea3c0)
>     #6 0x1ae2bd5  (/home/delphi/extraClangDebug/sumo/bin/sumoD+0x1ae2bd5)
>     #7 0x1aee92e  (/home/delphi/extraClangDebug/sumo/bin/sumoD+0x1aee92e)
>     #8 0xcaacf3  (/home/delphi/extraClangDebug/sumo/bin/sumoD+0xcaacf3)
>     #9 0x7f8eea2e2b96  (/lib/x86_64-linux-gnu/libc.so.6+0x21b96)
> 
> Indirect leak of 6352 byte(s) in 525 object(s) allocated from:
>     #0 0xca5430  (/home/delphi/extraClangDebug/sumo/bin/sumoD+0xca5430)
>     #1 0x110828a  (/home/delphi/extraClangDebug/sumo/bin/sumoD+0x110828a)
>     #2 0x11081ad  (/home/delphi/extraClangDebug/sumo/bin/sumoD+0x11081ad)
>     #3 0x110813b  (/home/delphi/extraClangDebug/sumo/bin/sumoD+0x110813b)
>     #4 0x11098eb  (/home/delphi/extraClangDebug/sumo/bin/sumoD+0x11098eb)
>     #5 0x10cfc1f  (/home/delphi/extraClangDebug/sumo/bin/sumoD+0x10cfc1f)
>     #6 0x137d309  (/home/delphi/extraClangDebug/sumo/bin/sumoD+0x137d309)
>     #7 0x137948c  (/home/delphi/extraClangDebug/sumo/bin/sumoD+0x137948c)
>     #8 0x1377144  (/home/delphi/extraClangDebug/sumo/bin/sumoD+0x1377144)
>     #9 0x1ba9b4a  (/home/delphi/extraClangDebug/sumo/bin/sumoD+0x1ba9b4a)
<truncated after showing first 30 lines>

TEST FAILED on ts-sim-build-ba : public_transport ptlines2flows parking ( Last six runs Aug2019 )

---------- Differences in errors ----------
0a1,172
> /home/delphi/extraClangDebug/sumo/src/microsim/MSEdge.cpp:285:53: runtime error: load of value 67108864, which is not a valid value for type 'SUMOVehicleClass'
> SUMMARY: UndefinedBehaviorSanitizer: undefined-behavior /home/delphi/extraClangDebug/sumo/src/microsim/MSEdge.cpp:285:53 in 
> 
> =================================================================
> ==30818==ERROR: LeakSanitizer: detected memory leaks
> 
> Direct leak of 12600 byte(s) in 525 object(s) allocated from:
>     #0 0xca5430  (/home/delphi/extraClangDebug/sumo/bin/sumoD+0xca5430)
>     #1 0x137ca8c  (/home/delphi/extraClangDebug/sumo/bin/sumoD+0x137ca8c)
>     #2 0x137948c  (/home/delphi/extraClangDebug/sumo/bin/sumoD+0x137948c)
>     #3 0x1377144  (/home/delphi/extraClangDebug/sumo/bin/sumoD+0x1377144)
>     #4 0x1ba9b4a  (/home/delphi/extraClangDebug/sumo/bin/sumoD+0x1ba9b4a)
>     #5 0x1aea3c0  (/home/delphi/extraClangDebug/sumo/bin/sumoD+0x1aea3c0)
>     #6 0x1ae2bd5  (/home/delphi/extraClangDebug/sumo/bin/sumoD+0x1ae2bd5)
>     #7 0x1aee92e  (/home/delphi/extraClangDebug/sumo/bin/sumoD+0x1aee92e)
>     #8 0xcaacf3  (/home/delphi/extraClangDebug/sumo/bin/sumoD+0xcaacf3)
>     #9 0x7fb4bb3a2b96  (/lib/x86_64-linux-gnu/libc.so.6+0x21b96)
> 
> Indirect leak of 6352 byte(s) in 525 object(s) allocated from:
>     #0 0xca5430  (/home/delphi/extraClangDebug/sumo/bin/sumoD+0xca5430)
>     #1 0x110828a  (/home/delphi/extraClangDebug/sumo/bin/sumoD+0x110828a)
>     #2 0x11081ad  (/home/delphi/extraClangDebug/sumo/bin/sumoD+0x11081ad)
>     #3 0x110813b  (/home/delphi/extraClangDebug/sumo/bin/sumoD+0x110813b)
>     #4 0x11098eb  (/home/delphi/extraClangDebug/sumo/bin/sumoD+0x11098eb)
>     #5 0x10cfc1f  (/home/delphi/extraClangDebug/sumo/bin/sumoD+0x10cfc1f)
>     #6 0x137d309  (/home/delphi/extraClangDebug/sumo/bin/sumoD+0x137d309)
>     #7 0x137948c  (/home/delphi/extraClangDebug/sumo/bin/sumoD+0x137948c)
>     #8 0x1377144  (/home/delphi/extraClangDebug/sumo/bin/sumoD+0x1377144)
>     #9 0x1ba9b4a  (/home/delphi/extraClangDebug/sumo/bin/sumoD+0x1ba9b4a)
<truncated after showing first 30 lines>

TEST FAILED on ts-sim-build-ba : public_transport ptlines2flows pt_routes_from_ptlines_file ( Last six runs Aug2019 )

---------- Differences in errors ----------
0a1,172
> /home/delphi/extraClangDebug/sumo/src/microsim/MSEdge.cpp:285:53: runtime error: load of value 67108864, which is not a valid value for type 'SUMOVehicleClass'
> SUMMARY: UndefinedBehaviorSanitizer: undefined-behavior /home/delphi/extraClangDebug/sumo/src/microsim/MSEdge.cpp:285:53 in 
> 
> =================================================================
> ==30799==ERROR: LeakSanitizer: detected memory leaks
> 
> Direct leak of 12600 byte(s) in 525 object(s) allocated from:
>     #0 0xca5430  (/home/delphi/extraClangDebug/sumo/bin/sumoD+0xca5430)
>     #1 0x137ca8c  (/home/delphi/extraClangDebug/sumo/bin/sumoD+0x137ca8c)
>     #2 0x137948c  (/home/delphi/extraClangDebug/sumo/bin/sumoD+0x137948c)
>     #3 0x1377144  (/home/delphi/extraClangDebug/sumo/bin/sumoD+0x1377144)
>     #4 0x1ba9b4a  (/home/delphi/extraClangDebug/sumo/bin/sumoD+0x1ba9b4a)
>     #5 0x1aea3c0  (/home/delphi/extraClangDebug/sumo/bin/sumoD+0x1aea3c0)
>     #6 0x1ae2bd5  (/home/delphi/extraClangDebug/sumo/bin/sumoD+0x1ae2bd5)
>     #7 0x1aee92e  (/home/delphi/extraClangDebug/sumo/bin/sumoD+0x1aee92e)
>     #8 0xcaacf3  (/home/delphi/extraClangDebug/sumo/bin/sumoD+0xcaacf3)
>     #9 0x7f4b833f0b96  (/lib/x86_64-linux-gnu/libc.so.6+0x21b96)
> 
> Indirect leak of 6352 byte(s) in 525 object(s) allocated from:
>     #0 0xca5430  (/home/delphi/extraClangDebug/sumo/bin/sumoD+0xca5430)
>     #1 0x110828a  (/home/delphi/extraClangDebug/sumo/bin/sumoD+0x110828a)
>     #2 0x11081ad  (/home/delphi/extraClangDebug/sumo/bin/sumoD+0x11081ad)
>     #3 0x110813b  (/home/delphi/extraClangDebug/sumo/bin/sumoD+0x110813b)
>     #4 0x11098eb  (/home/delphi/extraClangDebug/sumo/bin/sumoD+0x11098eb)
>     #5 0x10cfc1f  (/home/delphi/extraClangDebug/sumo/bin/sumoD+0x10cfc1f)
>     #6 0x137d309  (/home/delphi/extraClangDebug/sumo/bin/sumoD+0x137d309)
>     #7 0x137948c  (/home/delphi/extraClangDebug/sumo/bin/sumoD+0x137948c)
>     #8 0x1377144  (/home/delphi/extraClangDebug/sumo/bin/sumoD+0x1377144)
>     #9 0x1ba9b4a  (/home/delphi/extraClangDebug/sumo/bin/sumoD+0x1ba9b4a)
<truncated after showing first 30 lines>

TEST FAILED on ts-sim-build-ba : public_transport ptlines2flows random_begin ( Last six runs Aug2019 )

---------- Differences in errors ----------
0a1,172
> /home/delphi/extraClangDebug/sumo/src/microsim/MSEdge.cpp:285:53: runtime error: load of value 67108864, which is not a valid value for type 'SUMOVehicleClass'
> SUMMARY: UndefinedBehaviorSanitizer: undefined-behavior /home/delphi/extraClangDebug/sumo/src/microsim/MSEdge.cpp:285:53 in 
> 
> =================================================================
> ==30816==ERROR: LeakSanitizer: detected memory leaks
> 
> Direct leak of 12600 byte(s) in 525 object(s) allocated from:
>     #0 0xca5430  (/home/delphi/extraClangDebug/sumo/bin/sumoD+0xca5430)
>     #1 0x137ca8c  (/home/delphi/extraClangDebug/sumo/bin/sumoD+0x137ca8c)
>     #2 0x137948c  (/home/delphi/extraClangDebug/sumo/bin/sumoD+0x137948c)
>     #3 0x1377144  (/home/delphi/extraClangDebug/sumo/bin/sumoD+0x1377144)
>     #4 0x1ba9b4a  (/home/delphi/extraClangDebug/sumo/bin/sumoD+0x1ba9b4a)
>     #5 0x1aea3c0  (/home/delphi/extraClangDebug/sumo/bin/sumoD+0x1aea3c0)
>     #6 0x1ae2bd5  (/home/delphi/extraClangDebug/sumo/bin/sumoD+0x1ae2bd5)
>     #7 0x1aee92e  (/home/delphi/extraClangDebug/sumo/bin/sumoD+0x1aee92e)
>     #8 0xcaacf3  (/home/delphi/extraClangDebug/sumo/bin/sumoD+0xcaacf3)
>     #9 0x7fe076871b96  (/lib/x86_64-linux-gnu/libc.so.6+0x21b96)
> 
> Indirect leak of 6352 byte(s) in 525 object(s) allocated from:
>     #0 0xca5430  (/home/delphi/extraClangDebug/sumo/bin/sumoD+0xca5430)
>     #1 0x110828a  (/home/delphi/extraClangDebug/sumo/bin/sumoD+0x110828a)
>     #2 0x11081ad  (/home/delphi/extraClangDebug/sumo/bin/sumoD+0x11081ad)
>     #3 0x110813b  (/home/delphi/extraClangDebug/sumo/bin/sumoD+0x110813b)
>     #4 0x11098eb  (/home/delphi/extraClangDebug/sumo/bin/sumoD+0x11098eb)
>     #5 0x10cfc1f  (/home/delphi/extraClangDebug/sumo/bin/sumoD+0x10cfc1f)
>     #6 0x137d309  (/home/delphi/extraClangDebug/sumo/bin/sumoD+0x137d309)
>     #7 0x137948c  (/home/delphi/extraClangDebug/sumo/bin/sumoD+0x137948c)
>     #8 0x1377144  (/home/delphi/extraClangDebug/sumo/bin/sumoD+0x1377144)
>     #9 0x1ba9b4a  (/home/delphi/extraClangDebug/sumo/bin/sumoD+0x1ba9b4a)
<truncated after showing first 30 lines>

TEST FAILED on ts-sim-build-ba : public_transport ptlines2flows reverse_at_stop ( Last six runs Aug2019 )

---------- Differences in errors ----------
0a1,170
> 
> =================================================================
> ==30845==ERROR: LeakSanitizer: detected memory leaks
> 
> Direct leak of 432 byte(s) in 18 object(s) allocated from:
>     #0 0xca5430  (/home/delphi/extraClangDebug/sumo/bin/sumoD+0xca5430)
>     #1 0x137ca8c  (/home/delphi/extraClangDebug/sumo/bin/sumoD+0x137ca8c)
>     #2 0x137948c  (/home/delphi/extraClangDebug/sumo/bin/sumoD+0x137948c)
>     #3 0x1377144  (/home/delphi/extraClangDebug/sumo/bin/sumoD+0x1377144)
>     #4 0x1ba9b4a  (/home/delphi/extraClangDebug/sumo/bin/sumoD+0x1ba9b4a)
>     #5 0x1aea3c0  (/home/delphi/extraClangDebug/sumo/bin/sumoD+0x1aea3c0)
>     #6 0x1ae2bd5  (/home/delphi/extraClangDebug/sumo/bin/sumoD+0x1ae2bd5)
>     #7 0x1aee92e  (/home/delphi/extraClangDebug/sumo/bin/sumoD+0x1aee92e)
>     #8 0xcaacf3  (/home/delphi/extraClangDebug/sumo/bin/sumoD+0xcaacf3)
>     #9 0x7f699126db96  (/lib/x86_64-linux-gnu/libc.so.6+0x21b96)
> 
> Indirect leak of 5256 byte(s) in 9 object(s) allocated from:
>     #0 0xca5430  (/home/delphi/extraClangDebug/sumo/bin/sumoD+0xca5430)
>     #1 0x1242a24  (/home/delphi/extraClangDebug/sumo/bin/sumoD+0x1242a24)
>     #2 0x1701917  (/home/delphi/extraClangDebug/sumo/bin/sumoD+0x1701917)
>     #3 0x296a85f  (/home/delphi/extraClangDebug/sumo/bin/sumoD+0x296a85f)
>     #4 0x2b00ebf  (/home/delphi/extraClangDebug/sumo/bin/sumoD+0x2b00ebf)
>     #5 0x7f6994bfab9f  (/usr/lib/x86_64-linux-gnu/libxerces-c-3.2.so+0x1fab9f)
> 
> Indirect leak of 720 byte(s) in 9 object(s) allocated from:
>     #0 0xca5430  (/home/delphi/extraClangDebug/sumo/bin/sumoD+0xca5430)
>     #1 0x1246167  (/home/delphi/extraClangDebug/sumo/bin/sumoD+0x1246167)
>     #2 0x1701917  (/home/delphi/extraClangDebug/sumo/bin/sumoD+0x1701917)
>     #3 0x296a85f  (/home/delphi/extraClangDebug/sumo/bin/sumoD+0x296a85f)
<truncated after showing first 30 lines>

TEST FAILED on ts-sim-build-ba : public_transport ptlines2flows stop_duration ( Last six runs Aug2019 )

---------- Differences in errors ----------
0a1,172
> /home/delphi/extraClangDebug/sumo/src/microsim/MSEdge.cpp:285:53: runtime error: load of value 67108864, which is not a valid value for type 'SUMOVehicleClass'
> SUMMARY: UndefinedBehaviorSanitizer: undefined-behavior /home/delphi/extraClangDebug/sumo/src/microsim/MSEdge.cpp:285:53 in 
> 
> =================================================================
> ==30824==ERROR: LeakSanitizer: detected memory leaks
> 
> Direct leak of 12600 byte(s) in 525 object(s) allocated from:
>     #0 0xca5430  (/home/delphi/extraClangDebug/sumo/bin/sumoD+0xca5430)
>     #1 0x137ca8c  (/home/delphi/extraClangDebug/sumo/bin/sumoD+0x137ca8c)
>     #2 0x137948c  (/home/delphi/extraClangDebug/sumo/bin/sumoD+0x137948c)
>     #3 0x1377144  (/home/delphi/extraClangDebug/sumo/bin/sumoD+0x1377144)
>     #4 0x1ba9b4a  (/home/delphi/extraClangDebug/sumo/bin/sumoD+0x1ba9b4a)
>     #5 0x1aea3c0  (/home/delphi/extraClangDebug/sumo/bin/sumoD+0x1aea3c0)
>     #6 0x1ae2bd5  (/home/delphi/extraClangDebug/sumo/bin/sumoD+0x1ae2bd5)
>     #7 0x1aee92e  (/home/delphi/extraClangDebug/sumo/bin/sumoD+0x1aee92e)
>     #8 0xcaacf3  (/home/delphi/extraClangDebug/sumo/bin/sumoD+0xcaacf3)
>     #9 0x7fd18417bb96  (/lib/x86_64-linux-gnu/libc.so.6+0x21b96)
> 
> Indirect leak of 6352 byte(s) in 525 object(s) allocated from:
>     #0 0xca5430  (/home/delphi/extraClangDebug/sumo/bin/sumoD+0xca5430)
>     #1 0x110828a  (/home/delphi/extraClangDebug/sumo/bin/sumoD+0x110828a)
>     #2 0x11081ad  (/home/delphi/extraClangDebug/sumo/bin/sumoD+0x11081ad)
>     #3 0x110813b  (/home/delphi/extraClangDebug/sumo/bin/sumoD+0x110813b)
>     #4 0x11098eb  (/home/delphi/extraClangDebug/sumo/bin/sumoD+0x11098eb)
>     #5 0x10cfc1f  (/home/delphi/extraClangDebug/sumo/bin/sumoD+0x10cfc1f)
>     #6 0x137d309  (/home/delphi/extraClangDebug/sumo/bin/sumoD+0x137d309)
>     #7 0x137948c  (/home/delphi/extraClangDebug/sumo/bin/sumoD+0x137948c)
>     #8 0x1377144  (/home/delphi/extraClangDebug/sumo/bin/sumoD+0x1377144)
>     #9 0x1ba9b4a  (/home/delphi/extraClangDebug/sumo/bin/sumoD+0x1ba9b4a)
<truncated after showing first 30 lines>

TEST FAILED on ts-sim-build-ba : public_transport ptlines2flows types ( Last six runs Aug2019 )

---------- Differences in errors ----------
0a1,172
> /home/delphi/extraClangDebug/sumo/src/microsim/MSEdge.cpp:285:53: runtime error: load of value 67108864, which is not a valid value for type 'SUMOVehicleClass'
> SUMMARY: UndefinedBehaviorSanitizer: undefined-behavior /home/delphi/extraClangDebug/sumo/src/microsim/MSEdge.cpp:285:53 in 
> 
> =================================================================
> ==30825==ERROR: LeakSanitizer: detected memory leaks
> 
> Direct leak of 12600 byte(s) in 525 object(s) allocated from:
>     #0 0xca5430  (/home/delphi/extraClangDebug/sumo/bin/sumoD+0xca5430)
>     #1 0x137ca8c  (/home/delphi/extraClangDebug/sumo/bin/sumoD+0x137ca8c)
>     #2 0x137948c  (/home/delphi/extraClangDebug/sumo/bin/sumoD+0x137948c)
>     #3 0x1377144  (/home/delphi/extraClangDebug/sumo/bin/sumoD+0x1377144)
>     #4 0x1ba9b4a  (/home/delphi/extraClangDebug/sumo/bin/sumoD+0x1ba9b4a)
>     #5 0x1aea3c0  (/home/delphi/extraClangDebug/sumo/bin/sumoD+0x1aea3c0)
>     #6 0x1ae2bd5  (/home/delphi/extraClangDebug/sumo/bin/sumoD+0x1ae2bd5)
>     #7 0x1aee92e  (/home/delphi/extraClangDebug/sumo/bin/sumoD+0x1aee92e)
>     #8 0xcaacf3  (/home/delphi/extraClangDebug/sumo/bin/sumoD+0xcaacf3)
>     #9 0x7fb9d189eb96  (/lib/x86_64-linux-gnu/libc.so.6+0x21b96)
> 
> Indirect leak of 6352 byte(s) in 525 object(s) allocated from:
>     #0 0xca5430  (/home/delphi/extraClangDebug/sumo/bin/sumoD+0xca5430)
>     #1 0x110828a  (/home/delphi/extraClangDebug/sumo/bin/sumoD+0x110828a)
>     #2 0x11081ad  (/home/delphi/extraClangDebug/sumo/bin/sumoD+0x11081ad)
>     #3 0x110813b  (/home/delphi/extraClangDebug/sumo/bin/sumoD+0x110813b)
>     #4 0x11098eb  (/home/delphi/extraClangDebug/sumo/bin/sumoD+0x11098eb)
>     #5 0x10cfc1f  (/home/delphi/extraClangDebug/sumo/bin/sumoD+0x10cfc1f)
>     #6 0x137d309  (/home/delphi/extraClangDebug/sumo/bin/sumoD+0x137d309)
>     #7 0x137948c  (/home/delphi/extraClangDebug/sumo/bin/sumoD+0x137948c)
>     #8 0x1377144  (/home/delphi/extraClangDebug/sumo/bin/sumoD+0x1377144)
>     #9 0x1ba9b4a  (/home/delphi/extraClangDebug/sumo/bin/sumoD+0x1ba9b4a)
<truncated after showing first 30 lines>

TEST FAILED on ts-sim-build-ba : route cut_routes routeRef ( Last six runs Aug2019 )

---------- Differences in additional ----------
2,3d1
<     <busStop endPos="40" id="busstop1" lane="middle_0" lines="100 101 102" startPos="20"/>
< </additional>
---------- Differences in errors ----------
0a1,6
> Traceback (most recent call last):
>   File "/home/delphi/extraClangDebug/sumo/tests/../tools/route/cutRoutes.py", line 422, in <module>
>     main(get_options())
>   File "/home/delphi/extraClangDebug/sumo/tests/../tools/route/cutRoutes.py", line 363, in main
>     busStops.write(busStop.toXML('    ').decode('utf8'))
> AttributeError: 'str' object has no attribute 'decode'
---------- Differences in output ----------
2,6d1
< Kept 1 of 2 busStops
< Parsing routes from input_routes.rou.xml
< Parsed 4 vehicles and kept 2 routes
< Number of disconnected routes: 0. Most frequent missing edges:
< Wrote 2 standalone-routes and 4 vehicles
---------- Missing result in routes ----------
<!-- generated with cutRoutes.py for input_net.net.xml from ['input_routes.rou.xml'] -->
<routes xmlns:xsi="http://www.w3.org/2001/XMLSchema-instance" xsi:noNamespaceSchemaLocation="http://sumo.dlr.de/xsd/routes_file.xsd">
    <route edges="middle end" id="r0"/>
    <route edges="middle end" id="r1">
        <stop busStop="busstop1" duration="10" until="172.185251799"/>
    </route>
    <vehicle depart="27.81" id="v1" route="r0">
        <stop busStop="busstop1" duration="10"/>
    </vehicle>
    <vehicle depart="47.81" id="v3" route="r1"/>
    <vehicle depart="37.81" id="v2" route="r0"/>
    <vehicle depart="57.81" id="v4" route="r1"/>
</routes>

TEST FAILED on ts-sim-build-ba : route cut_routes with_access ( Last six runs Aug2019 )

---------- Differences in additional ----------
2,5d1
<     <trainStop endPos="40" id="busstop1" lane="middle_0" lines="100 101 102" startPos="20">
<         <access lane="end_0" pos="20"/>
<     </trainStop>
< </additional>
---------- Differences in errors ----------
0a1,6
> Traceback (most recent call last):
>   File "/home/delphi/extraClangDebug/sumo/tests/../tools/route/cutRoutes.py", line 422, in <module>
>     main(get_options())
>   File "/home/delphi/extraClangDebug/sumo/tests/../tools/route/cutRoutes.py", line 363, in main
>     busStops.write(busStop.toXML('    ').decode('utf8'))
> AttributeError: 'str' object has no attribute 'decode'
---------- Differences in output ----------
2,8d1
< Kept 1 of 1 busStops
< Parsing routes from input_routes.rou.xml
< Could not reconstruct new departure time for vehicle 'straight'. Using old departure time.
< Skipping bus stop 'busstop0', which could not be located.
< Parsed 1 vehicles and kept 1 routes
< Number of disconnected routes: 0. Most frequent missing edges:
< Wrote 1 routes
---------- Missing result in routes ----------
<!-- generated with cutRoutes.py for input_net.net.xml from ['input_routes.rou.xml'] -->
<routes xmlns:xsi="http://www.w3.org/2001/XMLSchema-instance" xsi:noNamespaceSchemaLocation="http://sumo.dlr.de/xsd/routes_file.xsd">
    <vehicle depart="0.00" id="straight">
        <route edges="middle end"/>
        <stop busStop="busstop1" duration="10"/>
    </vehicle>
</routes>

TEST FAILED on ts-sim-build-ba : route cut_routes with_busstops ( Last six runs Aug2019 )

---------- Differences in additional ----------
2,3d1
<     <busStop endPos="40" id="busstop1" lane="middle_0" lines="100 101 102" name="班霍夫大街" startPos="20"/>
< </additional>
---------- Differences in errors ----------
0a1,6
> Traceback (most recent call last):
>   File "/home/delphi/extraClangDebug/sumo/tests/../tools/route/cutRoutes.py", line 422, in <module>
>     main(get_options())
>   File "/home/delphi/extraClangDebug/sumo/tests/../tools/route/cutRoutes.py", line 363, in main
>     busStops.write(busStop.toXML('    ').decode('utf8'))
> AttributeError: 'str' object has no attribute 'decode'
---------- Differences in output ----------
2,7d1
< Kept 1 of 2 busStops
< Parsing routes from input_routes.rou.xml
< Could not reconstruct new departure time for vehicle 'straight'. Using old departure time.
< Parsed 1 vehicles and kept 1 routes
< Number of disconnected routes: 0. Most frequent missing edges:
< Wrote 1 routes
---------- Missing result in routes ----------
<!-- generated with cutRoutes.py for input_net.net.xml from ['input_routes.rou.xml'] -->
<routes xmlns:xsi="http://www.w3.org/2001/XMLSchema-instance" xsi:noNamespaceSchemaLocation="http://sumo.dlr.de/xsd/routes_file.xsd">
    <vehicle depart="0.00" id="straight">
        <route edges="middle end"/>
        <stop busStop="busstop1" duration="10"/>
    </vehicle>
</routes>

TEST FAILED on ts-sim-build-ba : route route2poly spread ( Last six runs Aug2019 )

---------- Differences in pois ----------
2,7c2,3
< <poly id="31" color="102,0,255" layer="100" type="route" shape="200.0,101.65 108.05,101.65 108.05,101.65 91.95,101.65 91.95,101.65 0.0,101.65" lineWidth="0.02">
<     <param key="count" value="2"/>
< </poly>
< <poly id="52" color="246,0,255" layer="100" type="route" shape="0.0,97.35 92.2537904885,97.35 94.7166853428,99.9973027081 93.9669299178,101.515100276 92.2507400911,102.65 0.0,102.65" lineWidth="0.01">
<     <param key="count" value="1"/>
<     <param key="spread" value="1"/>
---
> <poly id="0" color="24,255,0" layer="100" type="route" shape="101.65,0.0 101.65,91.95 101.65,91.95 101.65,108.05 101.65,108.05 101.65,200.0" lineWidth="0.61">
>     <param key="count" value="61"/>
9c5
< <poly id="5" color="255,0,120" layer="100" type="route" shape="200.0,104.95 108.05,104.95 108.05,104.95 106.69,105.14 105.72,105.72 105.14,106.69 104.95,108.05 104.95,108.05 104.95,200.0" lineWidth="0.03">
---
> <poly id="5" color="0,255,120" layer="100" type="route" shape="200.0,104.95 108.05,104.95 108.05,104.95 106.69,105.14 105.72,105.72 105.14,106.69 104.95,108.05 104.95,108.05 104.95,200.0" lineWidth="0.03">
12,16c8
< <poly id="12" color="255,24,0" layer="100" type="route" shape="100.65,0.0 100.65,91.8784344567 100.078635891,95.8498833441 99.0916785809,97.506885067 98.5013956394,98.4906899694 95.8487238066,100.078802711 91.8784344567,100.65 0.0,100.65" lineWidth="0.1">
<     <param key="count" value="10"/>
<     <param key="spread" value="-1"/>
< </poly>
< <poly id="9" color="255,168,0" layer="100" type="route" shape="0.0,98.35 91.95,98.35 91.95,98.35 96.19,98.96 98.02,100.05 98.02,100.05 99.22,100.77 101.04,103.81 101.65,108.05 101.65,108.05 101.65,200.0" lineWidth="0.08">
---
> <poly id="9" color="0,246,255" layer="100" type="route" shape="0.0,97.35 92.02156554334125,97.35 96.53011665590282,97.998635891194 98.53311493304078,99.19167858085541 99.94931003055412,100.0413956393634 102.00119728854722,103.46872380656066 102.65,107.97843445665875 102.65,200.0" lineWidth="0.08">
18,20d9
< </poly>
< <poly id="63" color="198,255,0" layer="100" type="route" shape="97.35,200.0 97.35,107.746209512 99.9973027081,105.283314657 101.515100276,106.033070082 102.65,107.749259909 102.65,200.0" lineWidth="0.05">
<     <param key="count" value="5"/>
23,25c12,14
< <poly id="0" color="54,255,0" layer="100" type="route" shape="103.65,0.0 103.65,91.95 103.65,108.05 103.65,200.0" lineWidth="0.61">
<     <param key="count" value="61"/>
<     <param key="spread" value="2"/>
<truncated after showing first 30 lines>

TEST FAILED on ts-sim-build-ba : sumolib net ( Last six runs Aug2019 )

---------- Differences in output ----------
14,18c14,18
< getNeighboringEdges [u':S_0', u'CS', u'SC']
< getNeighboringLanes [u':S_0_0', u'CS_0', u'CS_1', u'SC_0', u'SC_1']
< getNeighboringNodes only for incoming edges [u'C']
< getNeighboringNodes only for outgoing edges [u'C']
< getNeighboringNodes [u'E', u'N', u'S', u'W']
---
> getNeighboringEdges [':S_0', 'CS', 'SC']
> getNeighboringLanes [':S_0_0', 'CS_0', 'CS_1', 'SC_0', 'SC_1']
> getNeighboringNodes only for incoming edges ['C']
> getNeighboringNodes only for outgoing edges ['C']
> getNeighboringNodes ['E', 'N', 'S', 'W']

TEST FAILED on ts-sim-build-ba : sumolib patch_network ( Last six runs Aug2019 )

---------- Differences in net ----------
6c6
<     <location netOffset="100.00,100.00" convBoundary="-3.00,-17.00,191.00,207.00" origBoundary="-10000000000.00,-10000000000.00,10000000000.00,10000000000.00" projParameter="!"/>
---
>     <location netOffset="100.00,100.00" convBoundary="14.00,-14.00,181.00,194.00" origBoundary="-10000000000.00,-10000000000.00,10000000000.00,10000000000.00" projParameter="!"/>
9c9
<         <lane id=":C_0_0" index="0" speed="13.89" length="9.90" shape="101.56,92.41 101.12,89.52 100.01,87.45 98.24,86.21 95.80,85.80"/>
---
>         <lane id=":C_0_0" index="0" speed="13.89" length="10.65" shape="129.08,93.35 126.60,93.41 124.59,94.49 123.04,96.59 121.96,99.69"/>
12,13c12
<         <lane id=":C_1_0" index="0" speed="13.89" length="22.11" shape="101.56,92.41 101.40,86.11 101.42,81.24 101.70,76.39 102.29,70.12"/>
<         <lane id=":C_1_1" index="1" speed="13.89" length="22.11" shape="104.76,92.30 104.59,86.07 104.61,81.36 104.89,76.65 105.47,70.44"/>
---
>         <lane id=":C_1_0" index="0" speed="13.89" length="22.64" shape="129.59,90.19 123.32,89.25 118.37,88.74 113.41,88.50 107.06,88.36"/>
15,16c14,15
<     <edge id=":C_3" function="internal">
<         <lane id=":C_3_0" index="0" speed="13.89" length="7.23" shape="104.76,92.30 105.39,86.66 106.19,85.33"/>
---
>     <edge id=":C_2" function="internal">
>         <lane id=":C_2_0" index="0" speed="13.89" length="6.85" shape="129.59,90.19 124.60,88.59 123.30,87.65"/>
18,19c17,18
<     <edge id=":C_4" function="internal">
<         <lane id=":C_4_0" index="0" speed="13.89" length="2.34" shape="104.76,92.30 105.52,91.08 106.31,90.65"/>
---
>     <edge id=":C_3" function="internal">
>         <lane id=":C_3_0" index="0" speed="13.89" length="2.34" shape="129.59,90.19 128.54,89.21 128.27,88.36"/>
22c21
<         <lane id=":C_18_0" index="0" speed="13.89" length="13.10" shape="106.19,85.33 107.70,82.81 111.69,80.74 117.36,80.46"/>
---
>         <lane id=":C_18_0" index="0" speed="13.89" length="15.56" shape="123.30,87.65 120.43,85.55 117.09,81.08 114.57,75.17"/>
25c24
<truncated after showing first 30 lines>
---------- Differences in nodes ----------
3c3
<     <node id="C" x="106.0" y="81.0">
---
>     <node id="C" x="120.0" y="87.0">
7,10c7,10
<     <node id="E" x="191.0" y="89.0"/>
<     <node id="N" x="110.0" y="207.0"/>
<     <node id="S" x="116.0" y="-17.0"/>
<     <node id="W" x="-3.0" y="81.0"/>
---
>     <node id="E" x="181.0" y="97.0"/>
>     <node id="N" x="95.0" y="194.0"/>
>     <node id="S" x="88.0" y="-14.0"/>
>     <node id="W" x="14.0" y="85.0"/>

TEST FAILED on ts-sim-build-ba : sumolib tls ( Last six runs Aug2019 )

---------- Differences in errors ----------
0a1,6
> Traceback (most recent call last):
>   File "/home/delphi/extraClangDebug/sumo/tests/../tests/tools/sumolib/tls/runner.py", line 32, in <module>
>     print(program.toXML(tls.getID()))
>   File "/home/delphi/extraClangDebug/sumo/tools/sumolib/net/__init__.py", line 126, in toXML
>     next = '' if len(p.next) == 0 else ' next="%s"' % ' '.join(map(str, p.next))
> TypeError: object of type 'map' has no len()
---------- Differences in output ----------
1,12d0
<   <tlLogic id="C" type="actuated" programID="0" offset="0.0">
<     <phase duration="31" state="GGGggrrrrGGGggrrrr" minDur="5" maxDur="45"/>
<     <phase duration="4" state="yyyggrrrryyyggrrrr"/>
<     <phase duration="6" state="rrrGGrrrrrrrGGrrrr" name="leftTurnPhase2"/>
<     <phase duration="4" state="rrryyrrrrrrryyrrrr"/>
<     <phase duration="31" state="rrrrrGGggrrrrrGGgg" minDur="5" maxDur="45"/>
<     <phase duration="4" state="rrrrryyggrrrrryygg"/>
<     <phase duration="6" state="rrrrrrrGGrrrrrrrGG" name="leftTurnPhase4"/>
<     <phase duration="4" state="rrrrrrryyrrrrrrryy" next="0"/>
<     <param key="show-detectors" value="true"/>
<   </tlLogic>
< 

TEST FAILED on ts-sim-build-ba : tls tlsCoordinator 1flow ( Last six runs Aug2019 )

---------- Differences in errors ----------
0a1,137
> 
> =================================================================
> ==29590==ERROR: LeakSanitizer: detected memory leaks
> 
> Direct leak of 6432 byte(s) in 268 object(s) allocated from:
>     #0 0xca5430  (/home/delphi/extraClangDebug/sumo/bin/sumoD+0xca5430)
>     #1 0x137ca8c  (/home/delphi/extraClangDebug/sumo/bin/sumoD+0x137ca8c)
>     #2 0x137948c  (/home/delphi/extraClangDebug/sumo/bin/sumoD+0x137948c)
>     #3 0x1377144  (/home/delphi/extraClangDebug/sumo/bin/sumoD+0x1377144)
>     #4 0x1ba9b4a  (/home/delphi/extraClangDebug/sumo/bin/sumoD+0x1ba9b4a)
>     #5 0x1aea3c0  (/home/delphi/extraClangDebug/sumo/bin/sumoD+0x1aea3c0)
>     #6 0x1ae2bd5  (/home/delphi/extraClangDebug/sumo/bin/sumoD+0x1ae2bd5)
>     #7 0x1aee92e  (/home/delphi/extraClangDebug/sumo/bin/sumoD+0x1aee92e)
>     #8 0xcaacf3  (/home/delphi/extraClangDebug/sumo/bin/sumoD+0xcaacf3)
>     #9 0x7f2340638b96  (/lib/x86_64-linux-gnu/libc.so.6+0x21b96)
> 
> Indirect leak of 2144 byte(s) in 268 object(s) allocated from:
>     #0 0xca5430  (/home/delphi/extraClangDebug/sumo/bin/sumoD+0xca5430)
>     #1 0x110828a  (/home/delphi/extraClangDebug/sumo/bin/sumoD+0x110828a)
>     #2 0x11081ad  (/home/delphi/extraClangDebug/sumo/bin/sumoD+0x11081ad)
>     #3 0x110813b  (/home/delphi/extraClangDebug/sumo/bin/sumoD+0x110813b)
>     #4 0x11098eb  (/home/delphi/extraClangDebug/sumo/bin/sumoD+0x11098eb)
>     #5 0x10cfc1f  (/home/delphi/extraClangDebug/sumo/bin/sumoD+0x10cfc1f)
>     #6 0x137d309  (/home/delphi/extraClangDebug/sumo/bin/sumoD+0x137d309)
>     #7 0x137948c  (/home/delphi/extraClangDebug/sumo/bin/sumoD+0x137948c)
>     #8 0x1377144  (/home/delphi/extraClangDebug/sumo/bin/sumoD+0x1377144)
>     #9 0x1ba9b4a  (/home/delphi/extraClangDebug/sumo/bin/sumoD+0x1ba9b4a)
>     #10 0x1aea3c0  (/home/delphi/extraClangDebug/sumo/bin/sumoD+0x1aea3c0)
>     #11 0x1ae2bd5  (/home/delphi/extraClangDebug/sumo/bin/sumoD+0x1ae2bd5)
<truncated after showing first 30 lines>

TEST FAILED on ts-sim-build-ba : tls tlsCoordinator 2tls ( Last six runs Aug2019 )

---------- Differences in errors ----------
0a1,137
> 
> =================================================================
> ==29585==ERROR: LeakSanitizer: detected memory leaks
> 
> Direct leak of 1344 byte(s) in 56 object(s) allocated from:
>     #0 0xca5430  (/home/delphi/extraClangDebug/sumo/bin/sumoD+0xca5430)
>     #1 0x137ca8c  (/home/delphi/extraClangDebug/sumo/bin/sumoD+0x137ca8c)
>     #2 0x137948c  (/home/delphi/extraClangDebug/sumo/bin/sumoD+0x137948c)
>     #3 0x1377144  (/home/delphi/extraClangDebug/sumo/bin/sumoD+0x1377144)
>     #4 0x1ba9b4a  (/home/delphi/extraClangDebug/sumo/bin/sumoD+0x1ba9b4a)
>     #5 0x1aea3c0  (/home/delphi/extraClangDebug/sumo/bin/sumoD+0x1aea3c0)
>     #6 0x1ae2bd5  (/home/delphi/extraClangDebug/sumo/bin/sumoD+0x1ae2bd5)
>     #7 0x1aee92e  (/home/delphi/extraClangDebug/sumo/bin/sumoD+0x1aee92e)
>     #8 0xcaacf3  (/home/delphi/extraClangDebug/sumo/bin/sumoD+0xcaacf3)
>     #9 0x7fa4cacc4b96  (/lib/x86_64-linux-gnu/libc.so.6+0x21b96)
> 
> Indirect leak of 584 byte(s) in 1 object(s) allocated from:
>     #0 0xca5430  (/home/delphi/extraClangDebug/sumo/bin/sumoD+0xca5430)
>     #1 0x1242a24  (/home/delphi/extraClangDebug/sumo/bin/sumoD+0x1242a24)
>     #2 0x118b833  (/home/delphi/extraClangDebug/sumo/bin/sumoD+0x118b833)
>     #3 0x1aeddf9  (/home/delphi/extraClangDebug/sumo/bin/sumoD+0x1aeddf9)
>     #4 0xcaacf3  (/home/delphi/extraClangDebug/sumo/bin/sumoD+0xcaacf3)
>     #5 0x7fa4cacc4b96  (/lib/x86_64-linux-gnu/libc.so.6+0x21b96)
> 
> Indirect leak of 584 byte(s) in 1 object(s) allocated from:
>     #0 0xca5430  (/home/delphi/extraClangDebug/sumo/bin/sumoD+0xca5430)
>     #1 0x1242a24  (/home/delphi/extraClangDebug/sumo/bin/sumoD+0x1242a24)
>     #2 0x118b5fa  (/home/delphi/extraClangDebug/sumo/bin/sumoD+0x118b5fa)
>     #3 0x1aeddf9  (/home/delphi/extraClangDebug/sumo/bin/sumoD+0x1aeddf9)
<truncated after showing first 30 lines>

TEST FAILED on ts-sim-build-ba : tls tlsCoordinator 2tls_add ( Last six runs Aug2019 )

---------- Differences in errors ----------
0a1,137
> 
> =================================================================
> ==29584==ERROR: LeakSanitizer: detected memory leaks
> 
> Direct leak of 1344 byte(s) in 56 object(s) allocated from:
>     #0 0xca5430  (/home/delphi/extraClangDebug/sumo/bin/sumoD+0xca5430)
>     #1 0x137ca8c  (/home/delphi/extraClangDebug/sumo/bin/sumoD+0x137ca8c)
>     #2 0x137948c  (/home/delphi/extraClangDebug/sumo/bin/sumoD+0x137948c)
>     #3 0x1377144  (/home/delphi/extraClangDebug/sumo/bin/sumoD+0x1377144)
>     #4 0x1ba9b4a  (/home/delphi/extraClangDebug/sumo/bin/sumoD+0x1ba9b4a)
>     #5 0x1aea3c0  (/home/delphi/extraClangDebug/sumo/bin/sumoD+0x1aea3c0)
>     #6 0x1ae2bd5  (/home/delphi/extraClangDebug/sumo/bin/sumoD+0x1ae2bd5)
>     #7 0x1aee92e  (/home/delphi/extraClangDebug/sumo/bin/sumoD+0x1aee92e)
>     #8 0xcaacf3  (/home/delphi/extraClangDebug/sumo/bin/sumoD+0xcaacf3)
>     #9 0x7f9da00e6b96  (/lib/x86_64-linux-gnu/libc.so.6+0x21b96)
> 
> Indirect leak of 584 byte(s) in 1 object(s) allocated from:
>     #0 0xca5430  (/home/delphi/extraClangDebug/sumo/bin/sumoD+0xca5430)
>     #1 0x1242a24  (/home/delphi/extraClangDebug/sumo/bin/sumoD+0x1242a24)
>     #2 0x118b833  (/home/delphi/extraClangDebug/sumo/bin/sumoD+0x118b833)
>     #3 0x1aeddf9  (/home/delphi/extraClangDebug/sumo/bin/sumoD+0x1aeddf9)
>     #4 0xcaacf3  (/home/delphi/extraClangDebug/sumo/bin/sumoD+0xcaacf3)
>     #5 0x7f9da00e6b96  (/lib/x86_64-linux-gnu/libc.so.6+0x21b96)
> 
> Indirect leak of 584 byte(s) in 1 object(s) allocated from:
>     #0 0xca5430  (/home/delphi/extraClangDebug/sumo/bin/sumoD+0xca5430)
>     #1 0x1242a24  (/home/delphi/extraClangDebug/sumo/bin/sumoD+0x1242a24)
>     #2 0x118b5fa  (/home/delphi/extraClangDebug/sumo/bin/sumoD+0x118b5fa)
>     #3 0x1aeddf9  (/home/delphi/extraClangDebug/sumo/bin/sumoD+0x1aeddf9)
<truncated after showing first 30 lines>

TEST FAILED on ts-sim-build-ba : tls tlsCoordinator 2tls_intermediate_node ( Last six runs Aug2019 )

---------- Differences in errors ----------
0a1,137
> 
> =================================================================
> ==29586==ERROR: LeakSanitizer: detected memory leaks
> 
> Direct leak of 1440 byte(s) in 60 object(s) allocated from:
>     #0 0xca5430  (/home/delphi/extraClangDebug/sumo/bin/sumoD+0xca5430)
>     #1 0x137ca8c  (/home/delphi/extraClangDebug/sumo/bin/sumoD+0x137ca8c)
>     #2 0x137948c  (/home/delphi/extraClangDebug/sumo/bin/sumoD+0x137948c)
>     #3 0x1377144  (/home/delphi/extraClangDebug/sumo/bin/sumoD+0x1377144)
>     #4 0x1ba9b4a  (/home/delphi/extraClangDebug/sumo/bin/sumoD+0x1ba9b4a)
>     #5 0x1aea3c0  (/home/delphi/extraClangDebug/sumo/bin/sumoD+0x1aea3c0)
>     #6 0x1ae2bd5  (/home/delphi/extraClangDebug/sumo/bin/sumoD+0x1ae2bd5)
>     #7 0x1aee92e  (/home/delphi/extraClangDebug/sumo/bin/sumoD+0x1aee92e)
>     #8 0xcaacf3  (/home/delphi/extraClangDebug/sumo/bin/sumoD+0xcaacf3)
>     #9 0x7f5ee8cc0b96  (/lib/x86_64-linux-gnu/libc.so.6+0x21b96)
> 
> Indirect leak of 584 byte(s) in 1 object(s) allocated from:
>     #0 0xca5430  (/home/delphi/extraClangDebug/sumo/bin/sumoD+0xca5430)
>     #1 0x1242a24  (/home/delphi/extraClangDebug/sumo/bin/sumoD+0x1242a24)
>     #2 0x118b833  (/home/delphi/extraClangDebug/sumo/bin/sumoD+0x118b833)
>     #3 0x1aeddf9  (/home/delphi/extraClangDebug/sumo/bin/sumoD+0x1aeddf9)
>     #4 0xcaacf3  (/home/delphi/extraClangDebug/sumo/bin/sumoD+0xcaacf3)
>     #5 0x7f5ee8cc0b96  (/lib/x86_64-linux-gnu/libc.so.6+0x21b96)
> 
> Indirect leak of 584 byte(s) in 1 object(s) allocated from:
>     #0 0xca5430  (/home/delphi/extraClangDebug/sumo/bin/sumoD+0xca5430)
>     #1 0x1242a24  (/home/delphi/extraClangDebug/sumo/bin/sumoD+0x1242a24)
>     #2 0x118b5fa  (/home/delphi/extraClangDebug/sumo/bin/sumoD+0x118b5fa)
>     #3 0x1aeddf9  (/home/delphi/extraClangDebug/sumo/bin/sumoD+0x1aeddf9)
<truncated after showing first 30 lines>

TEST FAILED on ts-sim-build-ba : tls tlsCoordinator 3flows ( Last six runs Aug2019 )

---------- Differences in errors ----------
0a1,137
> 
> =================================================================
> ==29588==ERROR: LeakSanitizer: detected memory leaks
> 
> Direct leak of 6432 byte(s) in 268 object(s) allocated from:
>     #0 0xca5430  (/home/delphi/extraClangDebug/sumo/bin/sumoD+0xca5430)
>     #1 0x137ca8c  (/home/delphi/extraClangDebug/sumo/bin/sumoD+0x137ca8c)
>     #2 0x137948c  (/home/delphi/extraClangDebug/sumo/bin/sumoD+0x137948c)
>     #3 0x1377144  (/home/delphi/extraClangDebug/sumo/bin/sumoD+0x1377144)
>     #4 0x1ba9b4a  (/home/delphi/extraClangDebug/sumo/bin/sumoD+0x1ba9b4a)
>     #5 0x1aea3c0  (/home/delphi/extraClangDebug/sumo/bin/sumoD+0x1aea3c0)
>     #6 0x1ae2bd5  (/home/delphi/extraClangDebug/sumo/bin/sumoD+0x1ae2bd5)
>     #7 0x1aee92e  (/home/delphi/extraClangDebug/sumo/bin/sumoD+0x1aee92e)
>     #8 0xcaacf3  (/home/delphi/extraClangDebug/sumo/bin/sumoD+0xcaacf3)
>     #9 0x7fb02b943b96  (/lib/x86_64-linux-gnu/libc.so.6+0x21b96)
> 
> Indirect leak of 2144 byte(s) in 268 object(s) allocated from:
>     #0 0xca5430  (/home/delphi/extraClangDebug/sumo/bin/sumoD+0xca5430)
>     #1 0x110828a  (/home/delphi/extraClangDebug/sumo/bin/sumoD+0x110828a)
>     #2 0x11081ad  (/home/delphi/extraClangDebug/sumo/bin/sumoD+0x11081ad)
>     #3 0x110813b  (/home/delphi/extraClangDebug/sumo/bin/sumoD+0x110813b)
>     #4 0x11098eb  (/home/delphi/extraClangDebug/sumo/bin/sumoD+0x11098eb)
>     #5 0x10cfc1f  (/home/delphi/extraClangDebug/sumo/bin/sumoD+0x10cfc1f)
>     #6 0x137d309  (/home/delphi/extraClangDebug/sumo/bin/sumoD+0x137d309)
>     #7 0x137948c  (/home/delphi/extraClangDebug/sumo/bin/sumoD+0x137948c)
>     #8 0x1377144  (/home/delphi/extraClangDebug/sumo/bin/sumoD+0x1377144)
>     #9 0x1ba9b4a  (/home/delphi/extraClangDebug/sumo/bin/sumoD+0x1ba9b4a)
>     #10 0x1aea3c0  (/home/delphi/extraClangDebug/sumo/bin/sumoD+0x1aea3c0)
>     #11 0x1ae2bd5  (/home/delphi/extraClangDebug/sumo/bin/sumoD+0x1ae2bd5)
<truncated after showing first 30 lines>

TEST FAILED on ts-sim-build-ba : tls tlsCoordinator 4flows ( Last six runs Aug2019 )

---------- Differences in errors ----------
0a1,137
> 
> =================================================================
> ==29589==ERROR: LeakSanitizer: detected memory leaks
> 
> Direct leak of 6432 byte(s) in 268 object(s) allocated from:
>     #0 0xca5430  (/home/delphi/extraClangDebug/sumo/bin/sumoD+0xca5430)
>     #1 0x137ca8c  (/home/delphi/extraClangDebug/sumo/bin/sumoD+0x137ca8c)
>     #2 0x137948c  (/home/delphi/extraClangDebug/sumo/bin/sumoD+0x137948c)
>     #3 0x1377144  (/home/delphi/extraClangDebug/sumo/bin/sumoD+0x1377144)
>     #4 0x1ba9b4a  (/home/delphi/extraClangDebug/sumo/bin/sumoD+0x1ba9b4a)
>     #5 0x1aea3c0  (/home/delphi/extraClangDebug/sumo/bin/sumoD+0x1aea3c0)
>     #6 0x1ae2bd5  (/home/delphi/extraClangDebug/sumo/bin/sumoD+0x1ae2bd5)
>     #7 0x1aee92e  (/home/delphi/extraClangDebug/sumo/bin/sumoD+0x1aee92e)
>     #8 0xcaacf3  (/home/delphi/extraClangDebug/sumo/bin/sumoD+0xcaacf3)
>     #9 0x7f2876424b96  (/lib/x86_64-linux-gnu/libc.so.6+0x21b96)
> 
> Indirect leak of 2144 byte(s) in 268 object(s) allocated from:
>     #0 0xca5430  (/home/delphi/extraClangDebug/sumo/bin/sumoD+0xca5430)
>     #1 0x110828a  (/home/delphi/extraClangDebug/sumo/bin/sumoD+0x110828a)
>     #2 0x11081ad  (/home/delphi/extraClangDebug/sumo/bin/sumoD+0x11081ad)
>     #3 0x110813b  (/home/delphi/extraClangDebug/sumo/bin/sumoD+0x110813b)
>     #4 0x11098eb  (/home/delphi/extraClangDebug/sumo/bin/sumoD+0x11098eb)
>     #5 0x10cfc1f  (/home/delphi/extraClangDebug/sumo/bin/sumoD+0x10cfc1f)
>     #6 0x137d309  (/home/delphi/extraClangDebug/sumo/bin/sumoD+0x137d309)
>     #7 0x137948c  (/home/delphi/extraClangDebug/sumo/bin/sumoD+0x137948c)
>     #8 0x1377144  (/home/delphi/extraClangDebug/sumo/bin/sumoD+0x1377144)
>     #9 0x1ba9b4a  (/home/delphi/extraClangDebug/sumo/bin/sumoD+0x1ba9b4a)
>     #10 0x1aea3c0  (/home/delphi/extraClangDebug/sumo/bin/sumoD+0x1aea3c0)
>     #11 0x1ae2bd5  (/home/delphi/extraClangDebug/sumo/bin/sumoD+0x1ae2bd5)
<truncated after showing first 30 lines>

TEST FAILED on ts-sim-build-ba : tls tlsCoordinator 4flows_b ( Last six runs Aug2019 )

---------- Differences in errors ----------
0a1,137
> 
> =================================================================
> ==29587==ERROR: LeakSanitizer: detected memory leaks
> 
> Direct leak of 6432 byte(s) in 268 object(s) allocated from:
>     #0 0xca5430  (/home/delphi/extraClangDebug/sumo/bin/sumoD+0xca5430)
>     #1 0x137ca8c  (/home/delphi/extraClangDebug/sumo/bin/sumoD+0x137ca8c)
>     #2 0x137948c  (/home/delphi/extraClangDebug/sumo/bin/sumoD+0x137948c)
>     #3 0x1377144  (/home/delphi/extraClangDebug/sumo/bin/sumoD+0x1377144)
>     #4 0x1ba9b4a  (/home/delphi/extraClangDebug/sumo/bin/sumoD+0x1ba9b4a)
>     #5 0x1aea3c0  (/home/delphi/extraClangDebug/sumo/bin/sumoD+0x1aea3c0)
>     #6 0x1ae2bd5  (/home/delphi/extraClangDebug/sumo/bin/sumoD+0x1ae2bd5)
>     #7 0x1aee92e  (/home/delphi/extraClangDebug/sumo/bin/sumoD+0x1aee92e)
>     #8 0xcaacf3  (/home/delphi/extraClangDebug/sumo/bin/sumoD+0xcaacf3)
>     #9 0x7fda44edcb96  (/lib/x86_64-linux-gnu/libc.so.6+0x21b96)
> 
> Indirect leak of 2144 byte(s) in 268 object(s) allocated from:
>     #0 0xca5430  (/home/delphi/extraClangDebug/sumo/bin/sumoD+0xca5430)
>     #1 0x110828a  (/home/delphi/extraClangDebug/sumo/bin/sumoD+0x110828a)
>     #2 0x11081ad  (/home/delphi/extraClangDebug/sumo/bin/sumoD+0x11081ad)
>     #3 0x110813b  (/home/delphi/extraClangDebug/sumo/bin/sumoD+0x110813b)
>     #4 0x11098eb  (/home/delphi/extraClangDebug/sumo/bin/sumoD+0x11098eb)
>     #5 0x10cfc1f  (/home/delphi/extraClangDebug/sumo/bin/sumoD+0x10cfc1f)
>     #6 0x137d309  (/home/delphi/extraClangDebug/sumo/bin/sumoD+0x137d309)
>     #7 0x137948c  (/home/delphi/extraClangDebug/sumo/bin/sumoD+0x137948c)
>     #8 0x1377144  (/home/delphi/extraClangDebug/sumo/bin/sumoD+0x1377144)
>     #9 0x1ba9b4a  (/home/delphi/extraClangDebug/sumo/bin/sumoD+0x1ba9b4a)
>     #10 0x1aea3c0  (/home/delphi/extraClangDebug/sumo/bin/sumoD+0x1aea3c0)
>     #11 0x1ae2bd5  (/home/delphi/extraClangDebug/sumo/bin/sumoD+0x1ae2bd5)
<truncated after showing first 30 lines>

TEST FAILED on ts-sim-build-ba : tls tlsCoordinator basic ( Last six runs Aug2019 )

---------- Differences in errors ----------
0a1,170
> 
> =================================================================
> ==29591==ERROR: LeakSanitizer: detected memory leaks
> 
> Direct leak of 6600 byte(s) in 275 object(s) allocated from:
>     #0 0xca5430  (/home/delphi/extraClangDebug/sumo/bin/sumoD+0xca5430)
>     #1 0x137ca8c  (/home/delphi/extraClangDebug/sumo/bin/sumoD+0x137ca8c)
>     #2 0x137948c  (/home/delphi/extraClangDebug/sumo/bin/sumoD+0x137948c)
>     #3 0x1377144  (/home/delphi/extraClangDebug/sumo/bin/sumoD+0x1377144)
>     #4 0x1ba9b4a  (/home/delphi/extraClangDebug/sumo/bin/sumoD+0x1ba9b4a)
>     #5 0x1aea3c0  (/home/delphi/extraClangDebug/sumo/bin/sumoD+0x1aea3c0)
>     #6 0x1ae2bd5  (/home/delphi/extraClangDebug/sumo/bin/sumoD+0x1ae2bd5)
>     #7 0x1aee92e  (/home/delphi/extraClangDebug/sumo/bin/sumoD+0x1aee92e)
>     #8 0xcaacf3  (/home/delphi/extraClangDebug/sumo/bin/sumoD+0xcaacf3)
>     #9 0x7f98774aab96  (/lib/x86_64-linux-gnu/libc.so.6+0x21b96)
> 
> Indirect leak of 2584 byte(s) in 275 object(s) allocated from:
>     #0 0xca5430  (/home/delphi/extraClangDebug/sumo/bin/sumoD+0xca5430)
>     #1 0x110828a  (/home/delphi/extraClangDebug/sumo/bin/sumoD+0x110828a)
>     #2 0x11081ad  (/home/delphi/extraClangDebug/sumo/bin/sumoD+0x11081ad)
>     #3 0x110813b  (/home/delphi/extraClangDebug/sumo/bin/sumoD+0x110813b)
>     #4 0x11098eb  (/home/delphi/extraClangDebug/sumo/bin/sumoD+0x11098eb)
>     #5 0x10cfc1f  (/home/delphi/extraClangDebug/sumo/bin/sumoD+0x10cfc1f)
>     #6 0x137d309  (/home/delphi/extraClangDebug/sumo/bin/sumoD+0x137d309)
>     #7 0x137948c  (/home/delphi/extraClangDebug/sumo/bin/sumoD+0x137948c)
>     #8 0x1377144  (/home/delphi/extraClangDebug/sumo/bin/sumoD+0x1377144)
>     #9 0x1ba9b4a  (/home/delphi/extraClangDebug/sumo/bin/sumoD+0x1ba9b4a)
>     #10 0x1aea3c0  (/home/delphi/extraClangDebug/sumo/bin/sumoD+0x1aea3c0)
>     #11 0x1ae2bd5  (/home/delphi/extraClangDebug/sumo/bin/sumoD+0x1ae2bd5)
<truncated after showing first 30 lines>

TEST FAILED on ts-sim-build-ba : tls tls_csvSignalGroups template ( Last six runs Aug2019 )

---------- Differences in csv ----------
1,32d0
< [general]
< cycle time
< key;1
< subkey;0
< offset;0
< [links]
< SG_6;-468_0;--472_0
< SG_7;-468_0;--474_0
< SG_8;-468_1;--470_0
< SG_9;-470_0;--468_0
< SG_10;-470_0;--472_0
< SG_11;-470_0;--474_0
< SG_3;-472_0;--474_0
< SG_4;-472_0;--470_0
< SG_5;-472_0;--468_0
< SG_0;-474_0;--470_0
< SG_1;-474_0;--468_0
< SG_2;-474_1;--472_0
< [signal groups]
< id;on1;off1;on2;off2;transOn;transOff
< SG_6
< SG_7
< SG_8
< SG_9
< SG_10
< SG_11
< SG_3
< SG_4
< SG_5
<truncated after showing first 30 lines>
---------- Differences in errors ----------
0a1,6
> Traceback (most recent call last):
>   File "/home/delphi/extraClangDebug/sumo/tests/../tools/tls/tls_csvSignalGroups.py", line 395, in <module>
>     writeInputTemplates(net, options.make_input_dir, options.delimiter)
>   File "/home/delphi/extraClangDebug/sumo/tests/../tools/tls/tls_csvSignalGroups.py", line 355, in writeInputTemplates
>     csvWriter.writerows(data)
> TypeError: a bytes-like object is required, not 'str'

TEST FAILED on ts-sim-build-ba : trip randomTrips persontrips ( Last six runs Aug2019 )

---------- Differences in errors ----------
0a1,23
> 
> =================================================================
> ==29723==ERROR: LeakSanitizer: detected memory leaks
> 
> Direct leak of 54400 byte(s) in 100 object(s) allocated from:
>     #0 0x826470  (/home/delphi/extraClangDebug/sumo/bin/duarouterD+0x826470)
>     #1 0xd57ca7  (/home/delphi/extraClangDebug/sumo/bin/duarouterD+0xd57ca7)
>     #2 0xcefaf2  (/home/delphi/extraClangDebug/sumo/bin/duarouterD+0xcefaf2)
>     #3 0xe5848a  (/home/delphi/extraClangDebug/sumo/bin/duarouterD+0xe5848a)
>     #4 0xcb8ff5  (/home/delphi/extraClangDebug/sumo/bin/duarouterD+0xcb8ff5)
>     #5 0xfbe4f8  (/home/delphi/extraClangDebug/sumo/bin/duarouterD+0xfbe4f8)
>     #6 0x7f13289c3377  (/usr/lib/x86_64-linux-gnu/libxerces-c-3.2.so+0x1fb377)
> 
> Indirect leak of 13600 byte(s) in 100 object(s) allocated from:
>     #0 0x826470  (/home/delphi/extraClangDebug/sumo/bin/duarouterD+0x826470)
>     #1 0xd57cd4  (/home/delphi/extraClangDebug/sumo/bin/duarouterD+0xd57cd4)
>     #2 0xcefaf2  (/home/delphi/extraClangDebug/sumo/bin/duarouterD+0xcefaf2)
>     #3 0xe5848a  (/home/delphi/extraClangDebug/sumo/bin/duarouterD+0xe5848a)
>     #4 0xcb8ff5  (/home/delphi/extraClangDebug/sumo/bin/duarouterD+0xcb8ff5)
>     #5 0xfbe4f8  (/home/delphi/extraClangDebug/sumo/bin/duarouterD+0xfbe4f8)
>     #6 0x7f13289c3377  (/usr/lib/x86_64-linux-gnu/libxerces-c-3.2.so+0x1fb377)
> 
> SUMMARY: AddressSanitizer: 68000 byte(s) leaked in 200 allocation(s).

TEST FAILED on ts-sim-build-ba : turndefs generateTurnDefs unit_tests ( Last six runs Aug2019 )

---------- Differences in errors ----------
1c1,5
< .......................
---
> ..../home/delphi/extraClangDebug/sumo/tests/../tests/tools/turndefs/generateTurnDefs/unit_tests/../../../../../tools/turn-defs/connections.py:148: DeprecationWarning: The 'warn' method is deprecated, use 'warning' instead
>   % (str(source), str(source_lane), str(destination)))
> .............../home/delphi/extraClangDebug/sumo/tests/../tests/tools/turndefs/generateTurnDefs/unit_tests/../../../../../tools/turn-defs/turndefinitions.py:63: DeprecationWarning: The 'warn' method is deprecated, use 'warning' instead
>   (self.turn_definitions[source][destination]))
> ....

TEST FAILED on ts-sim-build-ba : xml csv2xml plain_edges ( Last six runs Aug2019 )

---------- Differences in xml ----------
2,9c2,9
<     <edge to="E" speed="13.89" id="CE" from="C" numLanes="2" priority="2" _version="1.1"/>
<     <edge to="N" speed="13.89" id="CN" from="C" numLanes="2" priority="2" _version="1.1"/>
<     <edge to="S" speed="13.89" id="CS" from="C" numLanes="2" priority="2" _version="1.1"/>
<     <edge to="W" speed="13.89" id="CW" from="C" numLanes="2" priority="2" _version="1.1"/>
<     <edge to="C" speed="13.89" id="EC" from="E" numLanes="2" priority="2" _version="1.1"/>
<     <edge to="C" speed="13.89" id="NC" from="N" numLanes="2" priority="2" _version="1.1"/>
<     <edge to="C" speed="13.89" id="SC" from="S" numLanes="2" priority="2" _version="1.1"/>
<     <edge to="C" speed="13.89" id="WC" from="W" numLanes="2" priority="2" _version="1.1"/>
---
>     <edge _version="1.1" from="C" id="CE" numLanes="2" priority="2" speed="13.89" to="E"/>
>     <edge _version="1.1" from="C" id="CN" numLanes="2" priority="2" speed="13.89" to="N"/>
>     <edge _version="1.1" from="C" id="CS" numLanes="2" priority="2" speed="13.89" to="S"/>
>     <edge _version="1.1" from="C" id="CW" numLanes="2" priority="2" speed="13.89" to="W"/>
>     <edge _version="1.1" from="E" id="EC" numLanes="2" priority="2" speed="13.89" to="C"/>
>     <edge _version="1.1" from="N" id="NC" numLanes="2" priority="2" speed="13.89" to="C"/>
>     <edge _version="1.1" from="S" id="SC" numLanes="2" priority="2" speed="13.89" to="C"/>
>     <edge _version="1.1" from="W" id="WC" numLanes="2" priority="2" speed="13.89" to="C"/>

Detailed information for the tests that had known bugs:

TEST had known bugs (see #5409) on ts-sim-build-ba : detector flowrouter motorway_ramps lane_based ( Last six runs Aug2019 )

option lane-based does not work
(This bug was triggered by text found in file 'routes' matching 'on3 3 off3')
---------- Differences in flows ----------
2c2,3
<     <flow id="1_off3.qPKW" departSpeed="max" departPos="last" departLane="best" route="1_off3.qPKW" number="450" begin="0" end="3600"/>
---
>     <flow id="1_0_9_0.qPKW" departSpeed="max" departPos="last" departLane="best" route="1_0_9_0.qPKW" number="450" begin="0" end="3600"/>
>     <flow id="on3_0_off3_0.qPKW" departSpeed="max" departPos="last" departLane="best" route="on3_0_off3_0.qPKW" number="450" begin="0" end="3600"/>
---------- Differences in routes ----------
2c2,3
<     <route id="1_off3.qPKW" edges="1 2 3 off3"/>
---
>     <route id="1_0_9_0.qPKW" edges="1 2 3 4 5 6 7 8 9"/>
>     <route id="on3_0_off3_0.qPKW" edges="on3 3 off3"/>

TEST had known bugs (see #2620) on ts-sim-build-ba : projects evacuation plain ( Last six runs Aug2019 )

unstable inputs
(This bug was triggered by text found in the full difference report matching 'Warning')
---------- Differences in errors ----------
1,6925c1
< Warning: Discarding unusable type 'waterway.canal' (first occurence for edge '4041237#0').
< Warning: Discarding unknown compound 'cycleway.track' in type 'cycleway.track|highway.primary' (first occurence for edge '4045243#0').
< Warning: Discarding unknown compound 'cycleway.lane' in type 'cycleway.lane|highway.residential' (first occurence for edge '4068019#0').
< Warning: Discarding unknown compound 'cycleway.lane' in type 'cycleway.lane|highway.primary' (first occurence for edge '4068043#0').
< Warning: Discarding unknown compound 'cycleway.track' in type 'cycleway.track|highway.secondary' (first occurence for edge '4068192').
< Warning: Discarding unknown compound 'cycleway.track' in type 'cycleway.track|highway.tertiary' (first occurence for edge '4377008#0').
< Warning: Discarding unknown compound 'cycleway.lane' in type 'cycleway.lane|highway.tertiary' (first occurence for edge '4377122#0').
< Warning: Discarding unknown compound 'cycleway.share_busway' in type 'cycleway.share_busway|highway.secondary' (first occurence for edge '4377785#0').
< Warning: Discarding unknown compound 'cycleway.lane' in type 'cycleway.lane|highway.secondary' (first occurence for edge '4383334').
< Warning: Discarding unusable type 'highway.construction' (first occurence for edge '4391568').
< Warning: Discarding unknown compound 'cycleway.track' in type 'cycleway.track|highway.residential' (first occurence for edge '4395586#0').
< Warning: Discarding unknown compound 'cycleway.share_busway' in type 'cycleway.share_busway|highway.primary' (first occurence for edge '4395950#0').
< Warning: Discarding unknown compound 'cycleway.opposite' in type 'cycleway.opposite|highway.residential' (first occurence for edge '4396234').
< Warning: Discarding unknown compound 'cycleway.track' in type 'cycleway.track|highway.living_street' (first occurence for edge '4410583').
< Warning: Discarding unknown compound 'cycleway.lane' in type 'cycleway.lane|highway.secondary_link' (first occurence for edge '4484071').
< Warning: Discarding unknown compound 'cycleway.track' in type 'cycleway.track|highway.cycleway' (first occurence for edge '4492364#0').
< Warning: Discarding unusable type 'railway.disused' (first occurence for edge '4525886').
< Warning: Discarding unusable type 'highway.proposed' (first occurence for edge '4611776#0').
< Warning: Discarding unknown compound 'cycleway.none' in type 'cycleway.none|highway.tertiary' (first occurence for edge '4612758#0').
< Warning: Discarding unknown compound 'cycleway.track' in type 'cycleway.track|cycleway.track|highway.primary' (first occurence for edge '4615457#0').
< Warning: Discarding unknown compound 'cycleway.track' in type 'cycleway.track|cycleway.track|highway.primary' (first occurence for edge '4615457#0').
< Warning: Discarding unknown compound 'cycleway.shared' in type 'cycleway.shared|highway.secondary' (first occurence for edge '4615594#0').
< Warning: Discarding unknown compound 'cycleway.opposite' in type 'cycleway.opposite|highway.living_street' (first occurence for edge '4639037#0').
< Warning: Discarding unknown compound 'cycleway.opposite_track' in type 'cycleway.opposite_track|cycleway.track|cycleway.track|highway.residential' (first occurence for edge '4686018#0').
< Warning: Discarding unknown compound 'cycleway.track' in type 'cycleway.opposite_track|cycleway.track|cycleway.track|highway.residential' (first occurence for edge '4686018#0').
< Warning: Discarding unknown compound 'cycleway.track' in type 'cycleway.opposite_track|cycleway.track|cycleway.track|highway.residential' (first occurence for edge '4686018#0').
< Warning: Discarding unusable type 'waterway.riverbank' (first occurence for edge '4686373#0').
< Warning: Discarding unknown compound 'cycleway.shared_lane' in type 'cycleway.shared_lane|highway.primary' (first occurence for edge '4790833#0').
< Warning: Discarding unusable type 'railway.abandoned' (first occurence for edge '4790904').
<truncated after showing first 30 lines>
---------- Differences in output ----------
1,97d0
< Parsing types from <DIR>/osmNetconvert.typ.xml'... done.
< Parsing nodes from osm-file 'osm_bbox.osm.xml'... 
< Found duplicate nodes. Substituting 3215103784 with 288002013
< Found duplicate nodes. Substituting 3987794203 with 3987794202
< Found duplicate nodes. Substituting 3997661445 with 3517810193
< Found duplicate nodes. Substituting 4016273048 with 26992494
< Found duplicate nodes. Substituting 4016273049 with 2306772973
< done.
< Parsing edges from osm-file 'osm_bbox.osm.xml'... done.
< Removing duplicate edges... 
< Found duplicate edges. Removing 310058575
< Found duplicate edges. Removing 310058576
< Found duplicate edges. Removing 310058577
< Found duplicate edges. Removing 335703516
< Found duplicate edges. Removing 335703519
< Found duplicate edges. Removing 335703532
< Found duplicate edges. Removing 377118659
< Found duplicate edges. Removing 377494320
< Found duplicate edges. Removing 391385403
< done.
< Adding new type 'highway.service|railway.tram' (first occurence for edge '167272531#0').
< Parsing relations from osm-file 'osm_bbox.osm.xml'... 
< done.
<  Removed 1494 traffic lights before loading plain-XML
<  Import done:
<    37203 nodes loaded.
<    34 types loaded.
<    36921 edges loaded.
< Proj projection parameters used: '+proj=utm +zone=33 +ellps=WGS84 +datum=WGS84 +units=m +no_defs'.
<truncated after showing first 30 lines>
---------- New result in catalogue ----------
No files or directories were created, edited or deleted.

TEST had known bugs (bug 1190 (NONEXISTENT)) on ts-sim-build-ba : xml csv2xml cross3ltl_full_schema ( Last six runs Aug2019 )

Failed to open URL 'https://sumo.dlr.de/trac.wsgi/ticket/1190?format=tab': HTTP Error 404: Not Found.

Please make sure that bug 1190 exists
and that the configuration entry 'bug_system_location' points to the correct trac instance.
The current value is 'https://sumo.dlr.de/trac.wsgi/'.
(This bug was triggered by FAILING to find text in file 'xml' matching 'vehicles')
---------- Differences in xml ----------
1,32d0
< <?xml version="1.0" encoding="UTF-8"?>
< 
< <!-- generated on Tue Dec  3 16:33:35 2013 by SUMO sumo Version dev-SVN-r15233
< This data file and the accompanying materials
< are made available under the terms of the Eclipse Public License v2.0
< which accompanies this distribution, and is available at
< http://www.eclipse.org/legal/epl-v20.html
< SPDX-License-Identifier: EPL-2.0
< <configuration xmlns:xsi="http://www.w3.org/2001/XMLSchema-instance" xsi:noNamespaceSchemaLocation="http://sumo.dlr.de/xsd/sumoConfiguration.xsd">
< 
<     <input>
<         <net-file value="net.net.xml"/>
<         <route-files value="input_routes.rou.xml"/>
<     </input>
< 
<     <output>
<         <full-output value="full.xml"/>
<     </output>
< 
<     <time>
<         <begin value="0"/>
<         <end value="120"/>
<     </time>
< 
<     <report>
<         <no-duration-log value="true"/>
<         <no-step-log value="true"/>
<     </report>
< 
<truncated after showing first 30 lines>

Detailed information for the tests that were terminated before completion:

TEST were terminated before completion (TIMEOUT) on ts-sim-build-ba : xml schemaCheck tests netconvert ( Last six runs Aug2019 )

Test exceeded wallclock time limit of 300.0 seconds
---------- Differences in errors ----------
1,59d0
< -- Unordered text as found by filter 'ERROR:SCHEMA' --
< netconvert/import/XML/errors/broken_edge/edge#fromnode__missing1/input_edges.edg.xml:3:0:ERROR:SCHEMASV:SCHEMAV_CVC_COMPLEX_TYPE_4: Element 'edge': The attribute 'from' is required but missing.
< netconvert/import/XML/errors/broken_edge/edge#fromnode__missing4/input_edges.edg.xml:7:0:ERROR:SCHEMASV:SCHEMAV_CVC_COMPLEX_TYPE_4: Element 'edge': The attribute 'from' is required but missing.
< netconvert/import/XML/errors/broken_edge/edge#id__empty1/input_edges.edg.xml:3:0:ERROR:SCHEMASV:SCHEMAV_CVC_DATATYPE_VALID_1_2_1: Element 'edge', attribute 'id': '' is not a valid value of the atomic type 'idType'.
< netconvert/import/XML/errors/broken_edge/edge#id__empty1/input_edges.edg.xml:3:0:ERROR:SCHEMASV:SCHEMAV_CVC_IDC: Element 'edge', attribute 'id': Warning: No precomputed value available, the value was either invalid or something strange happend.
< netconvert/import/XML/errors/broken_edge/edge#id__empty1/input_edges.edg.xml:3:0:ERROR:SCHEMASV:SCHEMAV_CVC_IDC: Element 'edge': Not all fields of key identity-constraint 'edgeKey' evaluate to a node.
< netconvert/import/XML/errors/broken_edge/edge#id__empty1/input_edges.edg.xml:3:0:ERROR:SCHEMASV:SCHEMAV_CVC_PATTERN_VALID: Element 'edge', attribute 'id': [facet 'pattern'] The value '' is not accepted by the pattern '[^ \t\n\r|\\;,']+'.
< netconvert/import/XML/errors/broken_edge/edge#id__empty4/input_edges.edg.xml:7:0:ERROR:SCHEMASV:SCHEMAV_CVC_DATATYPE_VALID_1_2_1: Element 'edge', attribute 'id': '' is not a valid value of the atomic type 'idType'.
< netconvert/import/XML/errors/broken_edge/edge#id__empty4/input_edges.edg.xml:7:0:ERROR:SCHEMASV:SCHEMAV_CVC_IDC: Element 'edge', attribute 'id': Warning: No precomputed value available, the value was either invalid or something strange happend.
< netconvert/import/XML/errors/broken_edge/edge#id__empty4/input_edges.edg.xml:7:0:ERROR:SCHEMASV:SCHEMAV_CVC_IDC: Element 'edge': Not all fields of key identity-constraint 'edgeKey' evaluate to a node.
< netconvert/import/XML/errors/broken_edge/edge#id__empty4/input_edges.edg.xml:7:0:ERROR:SCHEMASV:SCHEMAV_CVC_PATTERN_VALID: Element 'edge', attribute 'id': [facet 'pattern'] The value '' is not accepted by the pattern '[^ \t\n\r|\\;,']+'.
< netconvert/import/XML/errors/broken_edge/edge#id__invalid4/input_edges.edg.xml:7:0:ERROR:SCHEMASV:SCHEMAV_CVC_DATATYPE_VALID_1_2_1: Element 'edge', attribute 'id': '4 5' is not a valid value of the atomic type 'idType'.
< netconvert/import/XML/errors/broken_edge/edge#id__invalid4/input_edges.edg.xml:7:0:ERROR:SCHEMASV:SCHEMAV_CVC_IDC: Element 'edge', attribute 'id': Warning: No precomputed value available, the value was either invalid or something strange happend.
< netconvert/import/XML/errors/broken_edge/edge#id__invalid4/input_edges.edg.xml:7:0:ERROR:SCHEMASV:SCHEMAV_CVC_IDC: Element 'edge': Not all fields of key identity-constraint 'edgeKey' evaluate to a node.
< netconvert/import/XML/errors/broken_edge/edge#id__invalid4/input_edges.edg.xml:7:0:ERROR:SCHEMASV:SCHEMAV_CVC_PATTERN_VALID: Element 'edge', attribute 'id': [facet 'pattern'] The value '4 5' is not accepted by the pattern '[^ \t\n\r|\\;,']+'.
< netconvert/import/XML/errors/broken_edge/edge#id__missing1/input_edges.edg.xml:3:0:ERROR:SCHEMASV:SCHEMAV_CVC_COMPLEX_TYPE_4: Element 'edge': The attribute 'id' is required but missing.
< netconvert/import/XML/errors/broken_edge/edge#id__missing1/input_edges.edg.xml:3:0:ERROR:SCHEMASV:SCHEMAV_CVC_IDC: Element 'edge': Not all fields of key identity-constraint 'edgeKey' evaluate to a node.
< netconvert/import/XML/errors/broken_edge/edge#id__missing4/input_edges.edg.xml:7:0:ERROR:SCHEMASV:SCHEMAV_CVC_COMPLEX_TYPE_4: Element 'edge': The attribute 'id' is required but missing.
< netconvert/import/XML/errors/broken_edge/edge#id__missing4/input_edges.edg.xml:7:0:ERROR:SCHEMASV:SCHEMAV_CVC_IDC: Element 'edge': Not all fields of key identity-constraint 'edgeKey' evaluate to a node.
< netconvert/import/XML/errors/broken_edge/edge#length__empty1/input_edges.edg.xml:3:0:ERROR:SCHEMASV:SCHEMAV_CVC_DATATYPE_VALID_1_2_1: Element 'edge', attribute 'length': '' is not a valid value of the atomic type 'positiveFloatType'.
< netconvert/import/XML/errors/broken_edge/edge#length__empty4/input_edges.edg.xml:7:0:ERROR:SCHEMASV:SCHEMAV_CVC_DATATYPE_VALID_1_2_1: Element 'edge', attribute 'length': '' is not a valid value of the atomic type 'positiveFloatType'.
< netconvert/import/XML/errors/broken_edge/edge#length__false1/input_edges.edg.xml:3:0:ERROR:SCHEMASV:SCHEMAV_CVC_DATATYPE_VALID_1_2_1: Element 'edge', attribute 'length': 'a' is not a valid value of the atomic type 'positiveFloatType'.
< netconvert/import/XML/errors/broken_edge/edge#length__false4/input_edges.edg.xml:7:0:ERROR:SCHEMASV:SCHEMAV_CVC_DATATYPE_VALID_1_2_1: Element 'edge', attribute 'length': 'a' is not a valid value of the atomic type 'positiveFloatType'.
< netconvert/import/XML/errors/broken_edge/edge#nolanes__empty1/input_edges.edg.xml:3:0:ERROR:SCHEMASV:SCHEMAV_CVC_DATATYPE_VALID_1_2_1: Element 'edge', attribute 'numLanes': '' is not a valid value of the atomic type 'xs:positiveInteger'.
< netconvert/import/XML/errors/broken_edge/edge#nolanes__empty4/input_edges.edg.xml:7:0:ERROR:SCHEMASV:SCHEMAV_CVC_DATATYPE_VALID_1_2_1: Element 'edge', attribute 'numLanes': '' is not a valid value of the atomic type 'xs:positiveInteger'.
< netconvert/import/XML/errors/broken_edge/edge#nolanes__false1/input_edges.edg.xml:3:0:ERROR:SCHEMASV:SCHEMAV_CVC_DATATYPE_VALID_1_2_1: Element 'edge', attribute 'numLanes': 'a' is not a valid value of the atomic type 'xs:positiveInteger'.
< netconvert/import/XML/errors/broken_edge/edge#nolanes__false4/input_edges.edg.xml:7:0:ERROR:SCHEMASV:SCHEMAV_CVC_DATATYPE_VALID_1_2_1: Element 'edge', attribute 'numLanes': 'a' is not a valid value of the atomic type 'xs:positiveInteger'.
< netconvert/import/XML/errors/broken_edge/edge#priority__false1/input_edges.edg.xml:3:0:ERROR:SCHEMASV:SCHEMAV_CVC_DATATYPE_VALID_1_2_1: Element 'edge', attribute 'priority': 'a' is not a valid value of the atomic type 'xs:int'.
< netconvert/import/XML/errors/broken_edge/edge#priority__false4/input_edges.edg.xml:7:0:ERROR:SCHEMASV:SCHEMAV_CVC_DATATYPE_VALID_1_2_1: Element 'edge', attribute 'priority': 'a' is not a valid value of the atomic type 'xs:int'.
<truncated after showing first 30 lines>
---------- Differences in output ----------
1d0
< <number> files checked

TEST were terminated before completion (TIMEOUT) on ts-sim-build-ba : xml schemaCheck tests nets ( Last six runs Aug2019 )

Test exceeded wallclock time limit of 300.0 seconds
---------- Differences in errors ----------
1,8c1,8
< -- Unordered text as found by filter 'ERROR:SCHEMA' --
< netconvert/function/railway/bidi_endOffset_invalid/net.netconvert:55:0:ERROR:SCHEMASV:SCHEMAV_CVC_COMPLEX_TYPE_4: Element 'lane': The attribute 'shape' is required but missing.
< netconvert/import/SUMO/stopOffsets/incomplete_specification/input_net.net.xml:169:0:ERROR:SCHEMASV:SCHEMAV_CVC_COMPLEX_TYPE_4: Element 'stopOffset': The attribute 'value' is required but missing.
< netconvert/import/SUMO/stopOffsets/warnings/input_net.net.xml:139:0:ERROR:SCHEMASV:SCHEMAV_CVC_DATATYPE_VALID_1_2_1: Element 'stopOffset', attribute 'value': '-1' is not a valid value of the atomic type 'nonNegativeFloatType'.
< netconvert/import/SUMO/stopOffsets/warnings/input_net.net.xml:139:0:ERROR:SCHEMASV:SCHEMAV_CVC_MININCLUSIVE_VALID: Element 'stopOffset', attribute 'value': [facet 'minInclusive'] The value '-1' is less than the minimum value allowed ('0').
< netconvert/import/SUMO/stopOffsets/warnings/input_net.net.xml:154:0:ERROR:SCHEMASV:SCHEMAV_CVC_DATATYPE_VALID_1_2_1: Element 'stopOffset', attribute 'value': '-1' is not a valid value of the atomic type 'nonNegativeFloatType'.
< netconvert/import/SUMO/stopOffsets/warnings/input_net.net.xml:154:0:ERROR:SCHEMASV:SCHEMAV_CVC_MININCLUSIVE_VALID: Element 'stopOffset', attribute 'value': [facet 'minInclusive'] The value '-1' is less than the minimum value allowed ('0').
< 
---
> Traceback (most recent call last):
>   File "/home/delphi/extraClangDebug/sumo/tests/../tools/xml/schemaCheck.py", line 132, in <module>
>     sys.exit(main(srcRoot, toCheck, sys.stderr))
>   File "/home/delphi/extraClangDebug/sumo/tests/../tools/xml/schemaCheck.py", line 93, in main
>     validate(srcRoot, name)
>   File "/home/delphi/extraClangDebug/sumo/tests/../tools/xml/schemaCheck.py", line 49, in validate
>     doc = etree.parse(f)
> KeyboardInterrupt
---------- Differences in output ----------
1d0
< <number> files checked

TEST were terminated before completion (TIMEOUT) on ts-sim-build-ba : xml schemaCheck tests routes ( Last six runs Aug2019 )

Test exceeded wallclock time limit of 300.0 seconds
---------- Differences in errors ----------
1d0
< Error on parsing 'sumo/meta/xml_invalid_schema/input_routes.rou.xml'!
3c2,8
< IOError: Error reading file 'http://sumo.dlr.de/xsd/blub_file.xsd': failed to load external entity "http://sumo.dlr.de/xsd/blub_file.xsd"
---
>   File "/home/delphi/extraClangDebug/sumo/tests/../tools/xml/schemaCheck.py", line 132, in <module>
>     sys.exit(main(srcRoot, toCheck, sys.stderr))
>   File "/home/delphi/extraClangDebug/sumo/tests/../tools/xml/schemaCheck.py", line 93, in main
>     validate(srcRoot, name)
>   File "/home/delphi/extraClangDebug/sumo/tests/../tools/xml/schemaCheck.py", line 49, in validate
>     doc = etree.parse(f)
> KeyboardInterrupt
29,457d33
< netedit/demandElements/flow/load/arrivalLane/input_routes.rou.xml:56:0:ERROR:SCHEMASV:SCHEMAV_CVC_DATATYPE_VALID_1_2_3: Element 'flow', attribute 'arrivalLane': 'dummyDepart' is not a valid value of the union type 'arrivalLaneType'.
< netedit/demandElements/flow/load/arrivalLane/input_routes.rou.xml:58:0:ERROR:SCHEMASV:SCHEMAV_CVC_DATATYPE_VALID_1_2_3: Element 'flow', attribute 'arrivalLane': '-12' is not a valid value of the union type 'arrivalLaneType'.
< netedit/demandElements/flow/load/arrivalPos/input_routes.rou.xml:56:0:ERROR:SCHEMASV:SCHEMAV_CVC_DATATYPE_VALID_1_2_3: Element 'flow', attribute 'arrivalPos': 'dummyDepart' is not a valid value of the union type 'arrivalPosType'.
< netedit/demandElements/flow/load/arrivalPosLat/input_routes.rou.xml:56:0:ERROR:SCHEMASV:SCHEMAV_CVC_DATATYPE_VALID_1_2_3: Element 'flow', attribute 'arrivalPosLat': 'dummyDepart' is not a valid value of the union type 'arrivalPosLatType'.
< netedit/demandElements/flow/load/arrivalSpeed/input_routes.rou.xml:56:0:ERROR:SCHEMASV:SCHEMAV_CVC_DATATYPE_VALID_1_2_3: Element 'flow', attribute 'arrivalSpeed': 'dummyDepart' is not a valid value of the union type 'arrivalSpeedType'.
< netedit/demandElements/flow/load/arrivalSpeed/input_routes.rou.xml:58:0:ERROR:SCHEMASV:SCHEMAV_CVC_DATATYPE_VALID_1_2_3: Element 'flow', attribute 'arrivalSpeed': '-12' is not a valid value of the union type 'arrivalSpeedType'.
< netedit/demandElements/flow/load/begin/input_routes.rou.xml:58:0:ERROR:SCHEMASV:SCHEMAV_CVC_DATATYPE_VALID_1_2_3: Element 'flow', attribute 'begin': '' is not a valid value of the union type 'timeType'.
< netedit/demandElements/flow/load/begin/input_routes.rou.xml:60:0:ERROR:SCHEMASV:SCHEMAV_CVC_DATATYPE_VALID_1_2_3: Element 'flow', attribute 'begin': 'dummyBegin' is not a valid value of the union type 'timeType'.
< netedit/demandElements/flow/load/begin/input_routes.rou.xml:62:0:ERROR:SCHEMASV:SCHEMAV_CVC_DATATYPE_VALID_1_2_3: Element 'flow', attribute 'begin': '-12' is not a valid value of the union type 'timeType'.
< netedit/demandElements/flow/load/color/input_routes.rou.xml:56:0:ERROR:SCHEMASV:SCHEMAV_CVC_DATATYPE_VALID_1_2_3: Element 'flow', attribute 'color': 'dummyColor' is not a valid value of the union type 'colorType'.
< netedit/demandElements/flow/load/color/input_routes.rou.xml:58:0:ERROR:SCHEMASV:SCHEMAV_CVC_DATATYPE_VALID_1_2_3: Element 'flow', attribute 'color': '' is not a valid value of the union type 'colorType'.
< netedit/demandElements/flow/load/containerNumber/input_routes.rou.xml:56:0:ERROR:SCHEMASV:SCHEMAV_CVC_DATATYPE_VALID_1_2_1: Element 'flow', attribute 'containerNumber': 'dummycontainerNumber' is not a valid value of the atomic type 'xs:nonNegativeInteger'.
< netedit/demandElements/flow/load/containerNumber/input_routes.rou.xml:58:0:ERROR:SCHEMASV:SCHEMAV_CVC_DATATYPE_VALID_1_2_1: Element 'flow', attribute 'containerNumber': '' is not a valid value of the atomic type 'xs:nonNegativeInteger'.
< netedit/demandElements/flow/load/containerNumber/input_routes.rou.xml:60:0:ERROR:SCHEMASV:SCHEMAV_CVC_DATATYPE_VALID_1_2_1: Element 'flow', attribute 'containerNumber': '-3' is not a valid value of the atomic type 'xs:nonNegativeInteger'.
< netedit/demandElements/flow/load/containerNumber/input_routes.rou.xml:64:0:ERROR:SCHEMASV:SCHEMAV_CVC_DATATYPE_VALID_1_2_1: Element 'flow', attribute 'containerNumber': '2.5' is not a valid value of the atomic type 'xs:nonNegativeInteger'.
< netedit/demandElements/flow/load/departLane/input_routes.rou.xml:56:0:ERROR:SCHEMASV:SCHEMAV_CVC_DATATYPE_VALID_1_2_3: Element 'flow', attribute 'departLane': 'dummyDepart' is not a valid value of the union type 'departLaneType'.
< netedit/demandElements/flow/load/departLane/input_routes.rou.xml:58:0:ERROR:SCHEMASV:SCHEMAV_CVC_DATATYPE_VALID_1_2_3: Element 'flow', attribute 'departLane': '-12' is not a valid value of the union type 'departLaneType'.
<truncated after showing first 30 lines>
---------- Differences in output ----------
1d0
< <number> files checked

TEST were terminated before completion (TIMEOUT) on ts-sim-build-ba : xml schemaCheck tests sim_outputs ( Last six runs Aug2019 )

Test exceeded wallclock time limit of 300.0 seconds
---------- Differences in errors ----------
2,3d1
< sumo/cf_model/IDM/insert_with_speedLimit_speedFactor0.8/tripinfos.sumo:35:0:ERROR:SCHEMASV:SCHEMAV_CVC_DATATYPE_VALID_1_2_1: Element 'tripinfo', attribute 'timeLoss': '-0.06' is not a valid value of the atomic type 'nonNegativeFloatType'.
< sumo/cf_model/IDM/insert_with_speedLimit_speedFactor0.8/tripinfos.sumo:35:0:ERROR:SCHEMASV:SCHEMAV_CVC_MININCLUSIVE_VALID: Element 'tripinfo', attribute 'timeLoss': [facet 'minInclusive'] The value '-0.06' is less than the minimum value allowed ('0').
6,8c4
< sumo/extended/state/load_shifted/tripinfos.sumo:38:0:ERROR:SCHEMASV:SCHEMAV_CVC_DATATYPE_VALID_1_2_1: Element 'tripinfo', attribute 'depart': '-10.00' is not a valid value of the atomic type 'nonNegativeFloatType'.
< sumo/extended/state/load_shifted/tripinfos.sumo:38:0:ERROR:SCHEMASV:SCHEMAV_CVC_MININCLUSIVE_VALID: Element 'tripinfo', attribute 'depart': [facet 'minInclusive'] The value '-10.00' is less than the minimum value allowed ('0').
< sumo/sublane_model/buridan_1lane/tripinfos.sumo:33:0:ERROR:SCHEMASV:SCHEMAV_CVC_COMPLEX_TYPE_3_2_1: Element 'tripinfo', attribute 'waitSteps': The attribute 'waitSteps' is not allowed.
---
> sumo/extended/state/load_shifted/tripinfos.sumo:38:0:ERROR:SCHEMASV:SCHEMAV_CVC_MININCLUSIVE_VALID: Element 'tripinfo', attribute 'depart': [facet 'minInclusive'] The value '-10.00' is less than the minimum value allowed ('0').sumo/sublane_model/buridan_1lane/tripinfos.sumo:33:0:ERROR:SCHEMASV:SCHEMAV_CVC_COMPLEX_TYPE_3_2_1: Element 'tripinfo', attribute 'waitSteps': The attribute 'waitSteps' is not allowed.
---------- Differences in output ----------
1d0
< <number> files checked