01Jul2019 - detailed test results for COMPLEX

To reconnect the TextTest GUI to these results, run:

texttest -a complex -d /home/delphi/extraGcc/sumo/tests -reconnect /home/delphi/extraGcc/texttesttmp/extra_gcc4_64.01Aug070323.18708 -g

To start TextTest for these tests, run:

texttest -a complex -d /home/delphi/extraGcc/sumo/tests

Total: 677 tests: 563 succeeded 83 FAILED 30 known bugs 1 killed


libsumo.python3: 105 tests: 44 succeeded 58 FAILED 2 known bugs 1 killed

Detailed information for the tests that FAILED:

14 TESTS FAILED on ts-sim-build-ba :

---------- Differences in errors ----------
0a1,28
> Traceback (most recent call last):
>   File "/home/delphi/extraGcc/sumo/tools/libsumo/libsumo.py", line 14, in swig_import_helper
>     return importlib.import_module(mname)
>   File "/usr/lib/python3.6/importlib/__init__.py", line 126, in import_module
>     return _bootstrap._gcd_import(name[level:], package, level)
>   File "<frozen importlib._bootstrap>", line 994, in _gcd_import
>   File "<frozen importlib._bootstrap>", line 971, in _find_and_load
>   File "<frozen importlib._bootstrap>", line 955, in _find_and_load_unlocked
>   File "<frozen importlib._bootstrap>", line 658, in _load_unlocked
>   File "<frozen importlib._bootstrap>", line 571, in module_from_spec
>   File "<frozen importlib._bootstrap_external>", line 922, in create_module
>   File "<frozen importlib._bootstrap>", line 219, in _call_with_frames_removed
> ImportError: dynamic module does not define module export function (PyInit__libsumo)
> 
> During handling of the above exception, another exception occurred:
> 
> Traceback (most recent call last):
>   File "/home/delphi/extraGcc/sumo/tests/../tests/complex/traci/contextSubscriptions/runner.py", line 27, in <module>
>     import libsumo as traci  # noqa
>   File "/home/delphi/extraGcc/sumo/tools/libsumo/__init__.py", line 15, in <module>
>     from .libsumo import *  # noqa
>   File "/home/delphi/extraGcc/sumo/tools/libsumo/libsumo.py", line 17, in <module>
>     _libsumo = swig_import_helper()
>   File "/home/delphi/extraGcc/sumo/tools/libsumo/libsumo.py", line 16, in swig_import_helper
>     return importlib.import_module('_libsumo')
>   File "/usr/lib/python3.6/importlib/__init__.py", line 126, in import_module
>     return _bootstrap._gcd_import(name[level:], package, level)
> ModuleNotFoundError: No module named '_libsumo'
---------- Differences in output ----------
1,4d0
< Loading configuration... done.
< Ok: Unsubscribe successful
< Print ended at step 1002
< Ok: Subscription and computed are same
traci contextSubscriptions edge_100m ( Last six runs Jul2019 )
traci contextSubscriptions edge_200m ( Last six runs Jul2019 )
traci contextSubscriptions junction_100m ( Last six runs Jul2019 )
traci contextSubscriptions junction_200m ( Last six runs Jul2019 )
traci contextSubscriptions lane_100m ( Last six runs Jul2019 )
traci contextSubscriptions lane_200m ( Last six runs Jul2019 )
traci contextSubscriptions person_100m ( Last six runs Jul2019 )
traci contextSubscriptions person_200m ( Last six runs Jul2019 )
traci contextSubscriptions poi_100m ( Last six runs Jul2019 )
traci contextSubscriptions poi_200m ( Last six runs Jul2019 )
traci contextSubscriptions polygon_100m ( Last six runs Jul2019 )
traci contextSubscriptions polygon_200m ( Last six runs Jul2019 )
traci contextSubscriptions range_100m ( Last six runs Jul2019 )
traci contextSubscriptions range_200m ( Last six runs Jul2019 )

TEST FAILED on ts-sim-build-ba : traci pythonApi bugs ticket2321 ( Last six runs Jul2019 )

---------- Differences in errors ----------
1c1,28
< Error: Vehicle 'v0' is not known
---
> Traceback (most recent call last):
>   File "/home/delphi/extraGcc/sumo/tools/libsumo/libsumo.py", line 14, in swig_import_helper
>     return importlib.import_module(mname)
>   File "/usr/lib/python3.6/importlib/__init__.py", line 126, in import_module
>     return _bootstrap._gcd_import(name[level:], package, level)
>   File "<frozen importlib._bootstrap>", line 994, in _gcd_import
>   File "<frozen importlib._bootstrap>", line 971, in _find_and_load
>   File "<frozen importlib._bootstrap>", line 955, in _find_and_load_unlocked
>   File "<frozen importlib._bootstrap>", line 658, in _load_unlocked
>   File "<frozen importlib._bootstrap>", line 571, in module_from_spec
>   File "<frozen importlib._bootstrap_external>", line 922, in create_module
>   File "<frozen importlib._bootstrap>", line 219, in _call_with_frames_removed
> ImportError: dynamic module does not define module export function (PyInit__libsumo)
> 
> During handling of the above exception, another exception occurred:
> 
> Traceback (most recent call last):
>   File "/home/delphi/extraGcc/sumo/tests/../tests/complex/traci/pythonApi/bugs/ticket2321/runner.py", line 25, in <module>
>     import libsumo as traci  # noqa
>   File "/home/delphi/extraGcc/sumo/tools/libsumo/__init__.py", line 15, in <module>
>     from .libsumo import *  # noqa
>   File "/home/delphi/extraGcc/sumo/tools/libsumo/libsumo.py", line 17, in <module>
>     _libsumo = swig_import_helper()
>   File "/home/delphi/extraGcc/sumo/tools/libsumo/libsumo.py", line 16, in swig_import_helper
>     return importlib.import_module('_libsumo')
>   File "/usr/lib/python3.6/importlib/__init__.py", line 126, in import_module
>     return _bootstrap._gcd_import(name[level:], package, level)
<truncated after showing first 30 lines>
---------- Differences in output ----------
1,18d0
< Loading configuration... done.
< step=2 road=SC lane=SC_0 pos=0.00 dist=0.00 simDist=0.00 simDistToEnd=198.05 distToInt=105.75 distToEnd=198.05 simDist2DToInt=105.75 simDist2DToEnd=198.05
< step=3 road=SC lane=SC_0 pos=2.60 dist=2.60 simDist=2.60 simDistToEnd=195.45 distToInt=103.15 distToEnd=195.45 simDist2DToInt=103.15 simDist2DToEnd=195.45
< step=4 road=SC lane=SC_0 pos=7.80 dist=7.80 simDist=7.80 simDistToEnd=190.25 distToInt=97.95 distToEnd=190.25 simDist2DToInt=97.95 simDist2DToEnd=190.25
< step=5 road=SC lane=SC_0 pos=15.60 dist=15.60 simDist=15.60 simDistToEnd=182.45 distToInt=90.15 distToEnd=182.45 simDist2DToInt=90.15 simDist2DToEnd=182.45
< step=6 road=SC lane=SC_0 pos=26.00 dist=26.00 simDist=26.00 simDistToEnd=172.05 distToInt=79.75 distToEnd=172.05 simDist2DToInt=79.75 simDist2DToEnd=172.05
< step=7 road=SC lane=SC_0 pos=39.00 dist=39.00 simDist=39.00 simDistToEnd=159.05 distToInt=66.75 distToEnd=159.05 simDist2DToInt=66.75 simDist2DToEnd=159.05
< step=8 road=SC lane=SC_0 pos=52.89 dist=52.89 simDist=52.89 simDistToEnd=145.16 distToInt=52.86 distToEnd=145.16 simDist2DToInt=52.86 simDist2DToEnd=145.16
< step=9 road=SC lane=SC_0 pos=66.78 dist=66.78 simDist=66.78 simDistToEnd=131.27 distToInt=38.97 distToEnd=131.27 simDist2DToInt=38.97 simDist2DToEnd=131.27
< step=10 road=SC lane=SC_0 pos=80.67 dist=80.67 simDist=80.67 simDistToEnd=117.38 distToInt=25.08 distToEnd=117.38 simDist2DToInt=25.08 simDist2DToEnd=117.38
< step=11 road=:C_10 lane=:C_10_0 pos=2.61 dist=94.56 simDist=94.56 simDistToEnd=103.49 distToInt=11.19 distToEnd=103.49 simDist2DToInt=11.19 simDist2DToEnd=103.49
< step=12 road=CN lane=CN_0 pos=0.40 dist=108.45 simDist=108.45 simDistToEnd=89.60 distToInt=-1073741824.00 distToEnd=89.60 simDist2DToInt=2.70 simDist2DToEnd=89.60
< step=13 road=CN lane=CN_0 pos=14.29 dist=122.34 simDist=122.34 simDistToEnd=75.71 distToInt=-1073741824.00 distToEnd=75.71 simDist2DToInt=16.59 simDist2DToEnd=75.71
< step=14 road=CN lane=CN_0 pos=28.18 dist=136.23 simDist=136.23 simDistToEnd=61.82 distToInt=-1073741824.00 distToEnd=61.82 simDist2DToInt=30.48 simDist2DToEnd=61.82
< step=15 road=CN lane=CN_0 pos=42.07 dist=150.12 simDist=150.12 simDistToEnd=47.93 distToInt=-1073741824.00 distToEnd=47.93 simDist2DToInt=44.37 simDist2DToEnd=47.93
< step=16 road=CN lane=CN_0 pos=55.96 dist=164.01 simDist=164.01 simDistToEnd=34.04 distToInt=-1073741824.00 distToEnd=34.04 simDist2DToInt=58.26 simDist2DToEnd=34.04
< step=17 road=CN lane=CN_0 pos=69.85 dist=177.90 simDist=177.90 simDistToEnd=20.15 distToInt=-1073741824.00 distToEnd=20.15 simDist2DToInt=72.15 simDist2DToEnd=20.15
< step=18 road=CN lane=CN_0 pos=83.74 dist=191.79 simDist=191.79 simDistToEnd=6.26 distToInt=-1073741824.00 distToEnd=6.26 simDist2DToInt=86.04 simDist2DToEnd=6.26

TEST FAILED on ts-sim-build-ba : traci pythonApi bugs ticket2804 ( Last six runs Jul2019 )

---------- Differences in errors ----------
0a1,28
> Traceback (most recent call last):
>   File "/home/delphi/extraGcc/sumo/tools/libsumo/libsumo.py", line 14, in swig_import_helper
>     return importlib.import_module(mname)
>   File "/usr/lib/python3.6/importlib/__init__.py", line 126, in import_module
>     return _bootstrap._gcd_import(name[level:], package, level)
>   File "<frozen importlib._bootstrap>", line 994, in _gcd_import
>   File "<frozen importlib._bootstrap>", line 971, in _find_and_load
>   File "<frozen importlib._bootstrap>", line 955, in _find_and_load_unlocked
>   File "<frozen importlib._bootstrap>", line 658, in _load_unlocked
>   File "<frozen importlib._bootstrap>", line 571, in module_from_spec
>   File "<frozen importlib._bootstrap_external>", line 922, in create_module
>   File "<frozen importlib._bootstrap>", line 219, in _call_with_frames_removed
> ImportError: dynamic module does not define module export function (PyInit__libsumo)
> 
> During handling of the above exception, another exception occurred:
> 
> Traceback (most recent call last):
>   File "/home/delphi/extraGcc/sumo/tests/../tests/complex/traci/pythonApi/bugs/ticket2804/runner.py", line 25, in <module>
>     import libsumo as traci  # noqa
>   File "/home/delphi/extraGcc/sumo/tools/libsumo/__init__.py", line 15, in <module>
>     from .libsumo import *  # noqa
>   File "/home/delphi/extraGcc/sumo/tools/libsumo/libsumo.py", line 17, in <module>
>     _libsumo = swig_import_helper()
>   File "/home/delphi/extraGcc/sumo/tools/libsumo/libsumo.py", line 16, in swig_import_helper
>     return importlib.import_module('_libsumo')
>   File "/usr/lib/python3.6/importlib/__init__.py", line 126, in import_module
>     return _bootstrap._gcd_import(name[level:], package, level)
> ModuleNotFoundError: No module named '_libsumo'
---------- Differences in output ----------
1d0
< Loading configuration... done.
---------- Missing result in fcd ----------
<?xml version="1.0" encoding="UTF-8"?>


<fcd-export xmlns:xsi="http://www.w3.org/2001/XMLSchema-instance" xsi:noNamespaceSchemaLocation="http://sumo.dlr.de/xsd/fcd_file.xsd">
    <timestep time="0.00"/>
    <timestep time="1.00">
        <vehicle id="v0" x="0.00" y="-1.65" angle="90.00" type="DEFAULT_VEHTYPE" speed="0.00" pos="0.00" lane="beg_0" slope="0.00" signals="0"/>
    </timestep>
    <timestep time="2.00">
        <vehicle id="v0" x="0.00" y="-1.65" angle="90.00" type="DEFAULT_VEHTYPE" speed="0.00" pos="0.00" lane="beg_0" slope="0.00" signals="8"/>
    </timestep>
    <timestep time="3.00">
        <vehicle id="v0" x="0.00" y="-1.65" angle="90.00" type="DEFAULT_VEHTYPE" speed="0.00" pos="0.00" lane="beg_0" slope="0.00" signals="8"/>
    </timestep>
    <timestep time="4.00">
        <vehicle id="v0" x="0.00" y="-1.65" angle="90.00" type="DEFAULT_VEHTYPE" speed="0.00" pos="0.00" lane="beg_0" slope="0.00" signals="2048"/>
    </timestep>
    <timestep time="5.00">
        <vehicle id="v0" x="0.00" y="-1.65" angle="90.00" type="DEFAULT_VEHTYPE" speed="0.00" pos="0.00" lane="beg_0" slope="0.00" signals="2056"/>
    </timestep>
    <timestep time="6.00">
        <vehicle id="v0" x="0.00" y="-1.65" angle="90.00" type="DEFAULT_VEHTYPE" speed="0.00" pos="0.00" lane="beg_0" slope="0.00" signals="2056"/>
    </timestep>
    <timestep time="7.00">
        <vehicle id="v0" x="0.00" y="-1.65" angle="90.00" type="DEFAULT_VEHTYPE" speed="0.00" pos="0.00" lane="beg_0" slope="0.00" signals="8"/>
    </timestep>
    <timestep time="8.00">
        <vehicle id="v0" x="0.00" y="-1.65" angle="90.00" type="DEFAULT_VEHTYPE" speed="0.00" pos="0.00" lane="beg_0" slope="0.00" signals="8"/>
    </timestep>
    <timestep time="9.00">
<truncated after showing first 30 lines>

TEST FAILED on ts-sim-build-ba : traci pythonApi bugs ticket5114 ( Last six runs Jul2019 )

---------- Differences in output ----------
1,8c1,8
< ('getDistanceRoad (no connection):', -1073741824.0)
< ('getDistanceRoad (normal to normal):', 110.66999999999999)
< ('getDistanceRoad (normal to 1st internal):', 41.8)
< ('getDistanceRoad (normal to 2nd internal):', 49.65)
< ('getDistanceRoad (1st internal to normal):', 52.85)
< ('getDistanceRoad (1st internal to 2nd internal):', 7.85)
< ('getDistanceRoad (2nd internal to normal):', 61.019999999999996)
< ('getDistanceRoad (2nd internal to 1st internal):', -1073741824.0)
---
> getDistanceRoad (no connection): -1073741824.0
> getDistanceRoad (normal to normal): 110.66999999999999
> getDistanceRoad (normal to 1st internal): 41.8
> getDistanceRoad (normal to 2nd internal): 49.65
> getDistanceRoad (1st internal to normal): 52.85
> getDistanceRoad (1st internal to 2nd internal): 7.85
> getDistanceRoad (2nd internal to normal): 61.019999999999996
> getDistanceRoad (2nd internal to 1st internal): -1073741824.0

TEST FAILED on ts-sim-build-ba : traci pythonApi distance_after_reroute ( Last six runs Jul2019 )

---------- Differences in errors ----------
0a1,28
> Traceback (most recent call last):
>   File "/home/delphi/extraGcc/sumo/tools/libsumo/libsumo.py", line 14, in swig_import_helper
>     return importlib.import_module(mname)
>   File "/usr/lib/python3.6/importlib/__init__.py", line 126, in import_module
>     return _bootstrap._gcd_import(name[level:], package, level)
>   File "<frozen importlib._bootstrap>", line 994, in _gcd_import
>   File "<frozen importlib._bootstrap>", line 971, in _find_and_load
>   File "<frozen importlib._bootstrap>", line 955, in _find_and_load_unlocked
>   File "<frozen importlib._bootstrap>", line 658, in _load_unlocked
>   File "<frozen importlib._bootstrap>", line 571, in module_from_spec
>   File "<frozen importlib._bootstrap_external>", line 922, in create_module
>   File "<frozen importlib._bootstrap>", line 219, in _call_with_frames_removed
> ImportError: dynamic module does not define module export function (PyInit__libsumo)
> 
> During handling of the above exception, another exception occurred:
> 
> Traceback (most recent call last):
>   File "/home/delphi/extraGcc/sumo/tests/../tests/complex/traci/pythonApi/distance_after_reroute/runner.py", line 25, in <module>
>     import libsumo as traci  # noqa
>   File "/home/delphi/extraGcc/sumo/tools/libsumo/__init__.py", line 15, in <module>
>     from .libsumo import *  # noqa
>   File "/home/delphi/extraGcc/sumo/tools/libsumo/libsumo.py", line 17, in <module>
>     _libsumo = swig_import_helper()
>   File "/home/delphi/extraGcc/sumo/tools/libsumo/libsumo.py", line 16, in swig_import_helper
>     return importlib.import_module('_libsumo')
>   File "/usr/lib/python3.6/importlib/__init__.py", line 126, in import_module
>     return _bootstrap._gcd_import(name[level:], package, level)
> ModuleNotFoundError: No module named '_libsumo'
---------- Differences in output ----------
1,7d0
< Loading configuration... done.
< 1145.0
< ('ed0', 'ed1', 'ed5')
< 1145.0
< 1165.0
< ('ed1', 'ed2')
< 162.04
---------- Missing result in rawdump ----------
<?xml version="1.0" encoding="UTF-8"?>


<netstate xmlns:xsi="http://www.w3.org/2001/XMLSchema-instance" xsi:noNamespaceSchemaLocation="http://sumo.dlr.de/xsd/netstate_file.xsd">
    <timestep time="0.00"/>
    <timestep time="1.00">
        <edge id="ed0">
            <lane id="ed0_0">
                <vehicle id="Stapler_00" pos="5.10" speed="0.00"/>
            </lane>
            <lane id="ed0_1"/>
            <lane id="ed0_2"/>
        </edge>
    </timestep>
    <timestep time="2.00">
        <edge id="ed0">
            <lane id="ed0_0">
                <vehicle id="Stapler_00" pos="6.10" speed="1.00"/>
            </lane>
            <lane id="ed0_1"/>
            <lane id="ed0_2"/>
        </edge>
    </timestep>
    <timestep time="3.00">
        <edge id="ed0">
            <lane id="ed0_0">
                <vehicle id="Stapler_00" pos="8.10" speed="2.00"/>
            </lane>
            <lane id="ed0_1"/>
            <lane id="ed0_2"/>
<truncated after showing first 30 lines>

TEST FAILED on ts-sim-build-ba : traci pythonApi edge ( Last six runs Jul2019 )

---------- Differences in errors ----------
0a1,28
> Traceback (most recent call last):
>   File "/home/delphi/extraGcc/sumo/tools/libsumo/libsumo.py", line 14, in swig_import_helper
>     return importlib.import_module(mname)
>   File "/usr/lib/python3.6/importlib/__init__.py", line 126, in import_module
>     return _bootstrap._gcd_import(name[level:], package, level)
>   File "<frozen importlib._bootstrap>", line 994, in _gcd_import
>   File "<frozen importlib._bootstrap>", line 971, in _find_and_load
>   File "<frozen importlib._bootstrap>", line 955, in _find_and_load_unlocked
>   File "<frozen importlib._bootstrap>", line 658, in _load_unlocked
>   File "<frozen importlib._bootstrap>", line 571, in module_from_spec
>   File "<frozen importlib._bootstrap_external>", line 922, in create_module
>   File "<frozen importlib._bootstrap>", line 219, in _call_with_frames_removed
> ImportError: dynamic module does not define module export function (PyInit__libsumo)
> 
> During handling of the above exception, another exception occurred:
> 
> Traceback (most recent call last):
>   File "/home/delphi/extraGcc/sumo/tests/../tests/complex/traci/pythonApi/edge/runner.py", line 26, in <module>
>     import libsumo as traci  # noqa
>   File "/home/delphi/extraGcc/sumo/tools/libsumo/__init__.py", line 15, in <module>
>     from .libsumo import *  # noqa
>   File "/home/delphi/extraGcc/sumo/tools/libsumo/libsumo.py", line 17, in <module>
>     _libsumo = swig_import_helper()
>   File "/home/delphi/extraGcc/sumo/tools/libsumo/libsumo.py", line 16, in swig_import_helper
>     return importlib.import_module('_libsumo')
>   File "/usr/lib/python3.6/importlib/__init__.py", line 126, in import_module
>     return _bootstrap._gcd_import(name[level:], package, level)
> ModuleNotFoundError: No module named '_libsumo'
---------- Differences in output ----------
1,57d0
< Loading configuration... done.
< step 0
< step 1
< step 2
< edges ('1fi', '1o', '1si', '2fi', '2o', '2si', '3fi', '3o', '3si', '4fi', '4o', '4si', 'taz12-sink', 'taz12-source', 'taz34-sink', 'taz34-source')
< edge count 16
< examining 2fi
< laneNumber 1
< streetName exampleStreetName1
< adaptedTraveltime -1.0
< effort -1.0
< CO2 4962.098029013955
< CO 148.4043943117062
< HC 0.793287746205698
< PMx 0.10689025015863887
< NOx 2.197042560996833
< Fuel 2.133021417095528
< Noise 68.96613013111516
< Elec 0.0
< meanSpeed 4.033343723951839
< occupancy 0.02012072434607646
< lastLength 5.0
< traveltime 61.61141152545303
< numVeh 1
< haltVeh 0
< vehIds ('horiz',)
< personIds ('p0',)
< waiting time 0.0
< checking occupancy with unicode id 0.02012072434607646
<truncated after showing first 30 lines>

TEST FAILED on ts-sim-build-ba : traci pythonApi getNeighbors ( Last six runs Jul2019 )

---------- Differences in errors ----------
0a1,28
> Traceback (most recent call last):
>   File "/home/delphi/extraGcc/sumo/tools/libsumo/libsumo.py", line 14, in swig_import_helper
>     return importlib.import_module(mname)
>   File "/usr/lib/python3.6/importlib/__init__.py", line 126, in import_module
>     return _bootstrap._gcd_import(name[level:], package, level)
>   File "<frozen importlib._bootstrap>", line 994, in _gcd_import
>   File "<frozen importlib._bootstrap>", line 971, in _find_and_load
>   File "<frozen importlib._bootstrap>", line 955, in _find_and_load_unlocked
>   File "<frozen importlib._bootstrap>", line 658, in _load_unlocked
>   File "<frozen importlib._bootstrap>", line 571, in module_from_spec
>   File "<frozen importlib._bootstrap_external>", line 922, in create_module
>   File "<frozen importlib._bootstrap>", line 219, in _call_with_frames_removed
> ImportError: dynamic module does not define module export function (PyInit__libsumo)
> 
> During handling of the above exception, another exception occurred:
> 
> Traceback (most recent call last):
>   File "/home/delphi/extraGcc/sumo/tests/../tests/complex/traci/pythonApi/getNeighbors/runner.py", line 27, in <module>
>     import libsumo as traci  # noqa
>   File "/home/delphi/extraGcc/sumo/tools/libsumo/__init__.py", line 15, in <module>
>     from .libsumo import *  # noqa
>   File "/home/delphi/extraGcc/sumo/tools/libsumo/libsumo.py", line 17, in <module>
>     _libsumo = swig_import_helper()
>   File "/home/delphi/extraGcc/sumo/tools/libsumo/libsumo.py", line 16, in swig_import_helper
>     return importlib.import_module('_libsumo')
>   File "/usr/lib/python3.6/importlib/__init__.py", line 126, in import_module
>     return _bootstrap._gcd_import(name[level:], package, level)
> ModuleNotFoundError: No module named '_libsumo'
---------- Differences in output ----------
1,706d0
< Loading configuration... done.
< step 0.0
< step 1.0
< step 2.0
< Neigh infos for ego:
<   rightFollowers:
<   [('r0', -5.42072813466657)]
<   rightLeaders:
<   [('r1', 30.436343734408723)]
<   leftFollowers:
<   [('l0', -5.507664906745777)]
<   leftLeaders:
<   [('l1', 30.60311518707313)]
<   rightFollowers (only blocking):
<   [('r0', -5.42072813466657)]
<   rightLeaders (only blocking):
<   []
<   leftFollowers (only blocking):
<   [('l0', -5.507664906745777)]
<   leftLeaders (only blocking):
<   []
< step 3.0
< Neigh infos for ego:
<   rightFollowers:
<   [('r0', -4.414532593172044)]
<   rightLeaders:
<   []
<   leftFollowers:
<   [('l0', -4.115679128072227)]
<truncated after showing first 30 lines>
---------- Missing result in fcd ----------
<?xml version="1.0" encoding="UTF-8"?>


<fcd-export xmlns:xsi="http://www.w3.org/2001/XMLSchema-instance" xsi:noNamespaceSchemaLocation="http://sumo.dlr.de/xsd/fcd_file.xsd">
    <timestep time="0.00">
        <vehicle id="ego" x="5.10" y="-4.80" angle="90.00" type="t1" speed="0.00" pos="5.10" lane="entry_1" slope="0.00"/>
        <vehicle id="l0" x="5.10" y="-1.60" angle="90.00" type="t0" speed="0.00" pos="5.10" lane="entry_2" slope="0.00"/>
        <vehicle id="l1" x="45.00" y="-1.60" angle="90.00" type="t0" speed="0.00" pos="45.00" lane="entry_2" slope="0.00"/>
        <vehicle id="r0" x="5.10" y="-8.00" angle="90.00" type="t0" speed="0.00" pos="5.10" lane="entry_0" slope="0.00"/>
        <vehicle id="r1" x="45.00" y="-8.00" angle="90.00" type="t0" speed="0.00" pos="45.00" lane="entry_0" slope="0.00"/>
    </timestep>
    <timestep time="1.00">
        <vehicle id="ego" x="7.70" y="-4.80" angle="90.00" type="t1" speed="2.60" pos="7.70" lane="entry_1" slope="0.00"/>
        <vehicle id="l0" x="7.01" y="-1.60" angle="90.00" type="t0" speed="1.91" pos="7.01" lane="entry_2" slope="0.00"/>
        <vehicle id="l1" x="46.75" y="-1.60" angle="90.00" type="t0" speed="1.75" pos="46.75" lane="entry_2" slope="0.00"/>
        <vehicle id="r0" x="6.77" y="-8.00" angle="90.00" type="t0" speed="1.67" pos="6.77" lane="entry_0" slope="0.00"/>
        <vehicle id="r1" x="46.44" y="-8.00" angle="90.00" type="t0" speed="1.44" pos="46.44" lane="entry_0" slope="0.00"/>
    </timestep>
    <timestep time="2.00">
        <vehicle id="ego" x="12.49" y="-4.80" angle="90.00" type="t1" speed="4.79" pos="12.49" lane="entry_1" slope="0.00"/>
        <vehicle id="l0" x="10.50" y="-1.60" angle="90.00" type="t0" speed="3.49" pos="10.50" lane="entry_2" slope="0.00"/>
        <vehicle id="l1" x="50.59" y="-1.60" angle="90.00" type="t0" speed="3.84" pos="0.59" lane="mid_2" slope="0.00"/>
        <vehicle id="r0" x="10.41" y="-8.00" angle="90.00" type="t0" speed="3.63" pos="10.41" lane="entry_0" slope="0.00"/>
        <vehicle id="r1" x="50.42" y="-8.00" angle="90.00" type="t0" speed="3.98" pos="0.42" lane="mid_0" slope="0.00"/>
    </timestep>
    <timestep time="3.00">
        <vehicle id="ego" x="18.96" y="-4.80" angle="90.00" type="t1" speed="6.47" pos="18.96" lane="entry_1" slope="0.00"/>
        <vehicle id="l0" x="15.58" y="-1.60" angle="90.00" type="t0" speed="5.08" pos="15.58" lane="entry_2" slope="0.00"/>
        <vehicle id="l1" x="56.55" y="-1.60" angle="90.00" type="t0" speed="5.96" pos="6.55" lane="mid_2" slope="0.00"/>
        <vehicle id="r0" x="15.88" y="-8.00" angle="90.00" type="t0" speed="5.47" pos="15.88" lane="entry_0" slope="0.00"/>
<truncated after showing first 30 lines>

TEST FAILED on ts-sim-build-ba : traci pythonApi inductionloop ( Last six runs Jul2019 )

---------- Differences in errors ----------
0a1,28
> Traceback (most recent call last):
>   File "/home/delphi/extraGcc/sumo/tools/libsumo/libsumo.py", line 14, in swig_import_helper
>     return importlib.import_module(mname)
>   File "/usr/lib/python3.6/importlib/__init__.py", line 126, in import_module
>     return _bootstrap._gcd_import(name[level:], package, level)
>   File "<frozen importlib._bootstrap>", line 994, in _gcd_import
>   File "<frozen importlib._bootstrap>", line 971, in _find_and_load
>   File "<frozen importlib._bootstrap>", line 955, in _find_and_load_unlocked
>   File "<frozen importlib._bootstrap>", line 658, in _load_unlocked
>   File "<frozen importlib._bootstrap>", line 571, in module_from_spec
>   File "<frozen importlib._bootstrap_external>", line 922, in create_module
>   File "<frozen importlib._bootstrap>", line 219, in _call_with_frames_removed
> ImportError: dynamic module does not define module export function (PyInit__libsumo)
> 
> During handling of the above exception, another exception occurred:
> 
> Traceback (most recent call last):
>   File "/home/delphi/extraGcc/sumo/tests/../tests/complex/traci/pythonApi/inductionloop/runner.py", line 26, in <module>
>     import libsumo as traci  # noqa
>   File "/home/delphi/extraGcc/sumo/tools/libsumo/__init__.py", line 15, in <module>
>     from .libsumo import *  # noqa
>   File "/home/delphi/extraGcc/sumo/tools/libsumo/libsumo.py", line 17, in <module>
>     _libsumo = swig_import_helper()
>   File "/home/delphi/extraGcc/sumo/tools/libsumo/libsumo.py", line 16, in swig_import_helper
>     return importlib.import_module('_libsumo')
>   File "/usr/lib/python3.6/importlib/__init__.py", line 126, in import_module
>     return _bootstrap._gcd_import(name[level:], package, level)
> ModuleNotFoundError: No module named '_libsumo'
---------- Differences in output ----------
1,45d0
< Loading configuration... done.
< step 0
< step 1
< step 2
< inductionloops ('0',)
< inductionloop count 1
< examining 0
< vehNum 1
< meanSpeed 4.03334372395
< vehIDs ('horiz',)
< occupancy 14.0626126034
< meanLength 5.0
< timeSinceDet 0.0
< vehData [('horiz', 5.0, 2.859373873965989, -1.0, 'DEFAULT_VEHTYPE')]
< {16: 1}
< step 3
< {16: 0}
< step 4
< {16: 0}
< step 5
< {16: 0}
< step=6.0 detVehs=() vehData=[]
< step=7.0 detVehs=() vehData=[]
< step=8.0 detVehs=() vehData=[]
< step=9.0 detVehs=() vehData=[]
< step=10.0 detVehs=('jump',) vehData=[('jump', 5.0, 9.217991643355125, 9.762970751742937, 'DEFAULT_VEHTYPE')]
< step=11.0 detVehs=('departOnDet',) vehData=[('departOnDet', 5.0, 10.0, -1.0, 'DEFAULT_VEHTYPE')]
< step=12.0 detVehs=() vehData=[('departOnDet', 5.0, 10.0, 11.520954348148399, 'DEFAULT_VEHTYPE')]
< step=13.0 detVehs=() vehData=[]
<truncated after showing first 30 lines>

TEST FAILED on ts-sim-build-ba : traci pythonApi junction ( Last six runs Jul2019 )

---------- Differences in errors ----------
0a1,28
> Traceback (most recent call last):
>   File "/home/delphi/extraGcc/sumo/tools/libsumo/libsumo.py", line 14, in swig_import_helper
>     return importlib.import_module(mname)
>   File "/usr/lib/python3.6/importlib/__init__.py", line 126, in import_module
>     return _bootstrap._gcd_import(name[level:], package, level)
>   File "<frozen importlib._bootstrap>", line 994, in _gcd_import
>   File "<frozen importlib._bootstrap>", line 971, in _find_and_load
>   File "<frozen importlib._bootstrap>", line 955, in _find_and_load_unlocked
>   File "<frozen importlib._bootstrap>", line 658, in _load_unlocked
>   File "<frozen importlib._bootstrap>", line 571, in module_from_spec
>   File "<frozen importlib._bootstrap_external>", line 922, in create_module
>   File "<frozen importlib._bootstrap>", line 219, in _call_with_frames_removed
> ImportError: dynamic module does not define module export function (PyInit__libsumo)
> 
> During handling of the above exception, another exception occurred:
> 
> Traceback (most recent call last):
>   File "/home/delphi/extraGcc/sumo/tests/../tests/complex/traci/pythonApi/junction/runner.py", line 26, in <module>
>     import libsumo as traci  # noqa
>   File "/home/delphi/extraGcc/sumo/tools/libsumo/__init__.py", line 15, in <module>
>     from .libsumo import *  # noqa
>   File "/home/delphi/extraGcc/sumo/tools/libsumo/libsumo.py", line 17, in <module>
>     _libsumo = swig_import_helper()
>   File "/home/delphi/extraGcc/sumo/tools/libsumo/libsumo.py", line 16, in swig_import_helper
>     return importlib.import_module('_libsumo')
>   File "/usr/lib/python3.6/importlib/__init__.py", line 126, in import_module
>     return _bootstrap._gcd_import(name[level:], package, level)
> ModuleNotFoundError: No module named '_libsumo'
---------- Differences in output ----------
1,15d0
< Loading configuration... done.
< step 0
< step 1
< step 2
< junctions ('0', '1', '2', '3', '4', 'm1', 'm2', 'm3', 'm4')
< junction count 9
< examining 0
< pos (500.0, 500.0)
< {0: ('0', '1', '2', '3', '4', 'm1', 'm2', 'm3', 'm4')}
< step 3
< {0: ('0', '1', '2', '3', '4', 'm1', 'm2', 'm3', 'm4')}
< step 4
< {0: ('0', '1', '2', '3', '4', 'm1', 'm2', 'm3', 'm4')}
< step 5
< {0: ('0', '1', '2', '3', '4', 'm1', 'm2', 'm3', 'm4')}

TEST FAILED on ts-sim-build-ba : traci pythonApi lane ( Last six runs Jul2019 )

---------- Differences in errors ----------
0a1,28
> Traceback (most recent call last):
>   File "/home/delphi/extraGcc/sumo/tools/libsumo/libsumo.py", line 14, in swig_import_helper
>     return importlib.import_module(mname)
>   File "/usr/lib/python3.6/importlib/__init__.py", line 126, in import_module
>     return _bootstrap._gcd_import(name[level:], package, level)
>   File "<frozen importlib._bootstrap>", line 994, in _gcd_import
>   File "<frozen importlib._bootstrap>", line 971, in _find_and_load
>   File "<frozen importlib._bootstrap>", line 955, in _find_and_load_unlocked
>   File "<frozen importlib._bootstrap>", line 658, in _load_unlocked
>   File "<frozen importlib._bootstrap>", line 571, in module_from_spec
>   File "<frozen importlib._bootstrap_external>", line 922, in create_module
>   File "<frozen importlib._bootstrap>", line 219, in _call_with_frames_removed
> ImportError: dynamic module does not define module export function (PyInit__libsumo)
> 
> During handling of the above exception, another exception occurred:
> 
> Traceback (most recent call last):
>   File "/home/delphi/extraGcc/sumo/tests/../tests/complex/traci/pythonApi/lane/runner.py", line 25, in <module>
>     import libsumo as traci  # noqa
>   File "/home/delphi/extraGcc/sumo/tools/libsumo/__init__.py", line 15, in <module>
>     from .libsumo import *  # noqa
>   File "/home/delphi/extraGcc/sumo/tools/libsumo/libsumo.py", line 17, in <module>
>     _libsumo = swig_import_helper()
>   File "/home/delphi/extraGcc/sumo/tools/libsumo/libsumo.py", line 16, in swig_import_helper
>     return importlib.import_module('_libsumo')
>   File "/usr/lib/python3.6/importlib/__init__.py", line 126, in import_module
>     return _bootstrap._gcd_import(name[level:], package, level)
> ModuleNotFoundError: No module named '_libsumo'
---------- Differences in output ----------
1,44d0
< Loading configuration... done.
< step 0
< step 1
< step 2
< lanes ('1fi_0', '1o_0', '1si_0', '1si_1', '1si_2', '2fi_0', '2o_0', '2si_0', '2si_1', '2si_2', '3fi_0', '3o_0', '3si_0', '3si_1', '3si_2', '4fi_0', '4o_0', '4si_0', '4si_1', '4si_2')
< lane count 20
< examining 2fi_0
< length 248.5
< maxSpeed 11.11
< width 3.2
< allowed ()
< disallowed ()
< linkNum 3
< links [('2si_0', True, True, False, '', 'M', 's', 7.249827584156712), ('2si_1', True, True, False, '', 'M', 's', 4.459820624195518), ('2si_2', True, True, False, '', 'M', 's', 3.0)]
< shape ((1000.0, 501.65000000000003), (751.5, 501.65000000000003))
< edge 2fi
< CO2 3655.9332315441243
< CO 134.99569372949378
< HC 0.7001697688063016
< PMx 0.07689796956352524
< NOx 1.605517698575536
< Fuel 1.5715746576853664
< Noise 64.53183306655048
< Elec 0.0
< meanSpeed 3.1154472965048625
< occupancy 0.02012072434607646
< lastLength 5.0
< traveltime 79.76382726126856
< numVeh 1
<truncated after showing first 30 lines>

TEST FAILED on ts-sim-build-ba : traci pythonApi lanearea ( Last six runs Jul2019 )

---------- Differences in errors ----------
0a1,28
> Traceback (most recent call last):
>   File "/home/delphi/extraGcc/sumo/tools/libsumo/libsumo.py", line 14, in swig_import_helper
>     return importlib.import_module(mname)
>   File "/usr/lib/python3.6/importlib/__init__.py", line 126, in import_module
>     return _bootstrap._gcd_import(name[level:], package, level)
>   File "<frozen importlib._bootstrap>", line 994, in _gcd_import
>   File "<frozen importlib._bootstrap>", line 971, in _find_and_load
>   File "<frozen importlib._bootstrap>", line 955, in _find_and_load_unlocked
>   File "<frozen importlib._bootstrap>", line 658, in _load_unlocked
>   File "<frozen importlib._bootstrap>", line 571, in module_from_spec
>   File "<frozen importlib._bootstrap_external>", line 922, in create_module
>   File "<frozen importlib._bootstrap>", line 219, in _call_with_frames_removed
> ImportError: dynamic module does not define module export function (PyInit__libsumo)
> 
> During handling of the above exception, another exception occurred:
> 
> Traceback (most recent call last):
>   File "/home/delphi/extraGcc/sumo/tests/../tests/complex/traci/pythonApi/lanearea/runner.py", line 26, in <module>
>     import libsumo as traci  # noqa
>   File "/home/delphi/extraGcc/sumo/tools/libsumo/__init__.py", line 15, in <module>
>     from .libsumo import *  # noqa
>   File "/home/delphi/extraGcc/sumo/tools/libsumo/libsumo.py", line 17, in <module>
>     _libsumo = swig_import_helper()
>   File "/home/delphi/extraGcc/sumo/tools/libsumo/libsumo.py", line 16, in swig_import_helper
>     return importlib.import_module('_libsumo')
>   File "/usr/lib/python3.6/importlib/__init__.py", line 126, in import_module
>     return _bootstrap._gcd_import(name[level:], package, level)
> ModuleNotFoundError: No module named '_libsumo'
---------- Differences in output ----------
1,32d0
< Loading configuration... done.
< step 0
< step 1
< step 2
< step 3
< laneareas ('det0', 'det1')
< lanearea count 2
< examining det0
< pos 100.0
< length 25.0
< lane 2fi_0
< vehNum 0
< haltNum 0
< meanSpeed -1.0
< vehIDs ()
< occupancy 0.0
< examining det1
< pos 148.5
< length 400.0
< lane 2o_0
< vehNum 0
< haltNum 0
< meanSpeed -1.0
< vehIDs ()
< occupancy 0.0
< {16: 0}
< step 3
< {16: 0}
< step 4
<truncated after showing first 30 lines>
---------- Missing result in detector ----------
<?xml version="1.0" encoding="UTF-8"?>


<detector xmlns:xsi="http://www.w3.org/2001/XMLSchema-instance" xsi:noNamespaceSchemaLocation="http://sumo.dlr.de/xsd/det_e2_file.xsd">
   <interval begin="0.00" end="1.00" id="det0" sampledSeconds="0.00" nVehEntered="0" nVehLeft="0" nVehSeen="0" meanSpeed="-1.00" meanTimeLoss="-1.00" meanOccupancy="0.00" maxOccupancy="0.00" meanMaxJamLengthInVehicles="0.00" meanMaxJamLengthInMeters="0.00" maxJamLengthInVehicles="0" maxJamLengthInMeters="0.00" jamLengthInVehiclesSum="0" jamLengthInMetersSum="0.00" meanHaltingDuration="0.00" maxHaltingDuration="0.00" haltingDurationSum="0.00" meanIntervalHaltingDuration="0.00" maxIntervalHaltingD
uration="0.00" intervalHaltingDurationSum="0.00" startedHalts="0.00" meanVehicleNumber="0.00" maxVehicleNumber="0" />
   <interval begin="0.00" end="1.00" id="det1" sampledSeconds="0.00" nVehEntered="0" nVehLeft="0" nVehSeen="0" meanSpeed="-1.00" meanTimeLoss="-1.00" meanOccupancy="0.00" maxOccupancy="0.00" meanMaxJamLengthInVehicles="0.00" meanMaxJamLengthInMeters="0.00" maxJamLengthInVehicles="0" maxJamLengthInMeters="0.00" jamLengthInVehiclesSum="0" jamLengthInMetersSum="0.00" meanHaltingDuration="0.00" maxHaltingDuration="0.00" haltingDurationSum="0.00" meanIntervalHaltingDuration="0.00" maxIntervalHaltingD
uration="0.00" intervalHaltingDurationSum="0.00" startedHalts="0.00" meanVehicleNumber="0.00" maxVehicleNumber="0" />
   <interval begin="1.00" end="2.00" id="det0" sampledSeconds="0.00" nVehEntered="0" nVehLeft="0" nVehSeen="0" meanSpeed="-1.00" meanTimeLoss="-1.00" meanOccupancy="0.00" maxOccupancy="0.00" meanMaxJamLengthInVehicles="0.00" meanMaxJamLengthInMeters="0.00" maxJamLengthInVehicles="0" maxJamLengthInMeters="0.00" jamLengthInVehiclesSum="0" jamLengthInMetersSum="0.00" meanHaltingDuration="0.00" maxHaltingDuration="0.00" haltingDurationSum="0.00" meanIntervalHaltingDuration="0.00" maxIntervalHaltingD
uration="0.00" intervalHaltingDurationSum="0.00" startedHalts="0.00" meanVehicleNumber="0.00" maxVehicleNumber="0" />
   <interval begin="1.00" end="2.00" id="det1" sampledSeconds="0.00" nVehEntered="0" nVehLeft="0" nVehSeen="0" meanSpeed="-1.00" meanTimeLoss="-1.00" meanOccupancy="0.00" maxOccupancy="0.00" meanMaxJamLengthInVehicles="0.00" meanMaxJamLengthInMeters="0.00" maxJamLengthInVehicles="0" maxJamLengthInMeters="0.00" jamLengthInVehiclesSum="0" jamLengthInMetersSum="0.00" meanHaltingDuration="0.00" maxHaltingDuration="0.00" haltingDurationSum="0.00" meanIntervalHaltingDuration="0.00" maxIntervalHaltingD
uration="0.00" intervalHaltingDurationSum="0.00" startedHalts="0.00" meanVehicleNumber="0.00" maxVehicleNumber="0" />
   <interval begin="2.00" end="3.00" id="det0" sampledSeconds="0.00" nVehEntered="0" nVehLeft="0" nVehSeen="0" meanSpeed="-1.00" meanTimeLoss="-1.00" meanOccupancy="0.00" maxOccupancy="0.00" meanMaxJamLengthInVehicles="0.00" meanMaxJamLengthInMeters="0.00" maxJamLengthInVehicles="0" maxJamLengthInMeters="0.00" jamLengthInVehiclesSum="0" jamLengthInMetersSum="0.00" meanHaltingDuration="0.00" maxHaltingDuration="0.00" haltingDurationSum="0.00" meanIntervalHaltingDuration="0.00" maxIntervalHaltingD
uration="0.00" intervalHaltingDurationSum="0.00" startedHalts="0.00" meanVehicleNumber="0.00" maxVehicleNumber="0" />
   <interval begin="2.00" end="3.00" id="det1" sampledSeconds="0.00" nVehEntered="0" nVehLeft="0" nVehSeen="0" meanSpeed="-1.00" meanTimeLoss="-1.00" meanOccupancy="0.00" maxOccupancy="0.00" meanMaxJamLengthInVehicles="0.00" meanMaxJamLengthInMeters="0.00" maxJamLengthInVehicles="0" maxJamLengthInMeters="0.00" jamLengthInVehiclesSum="0" jamLengthInMetersSum="0.00" meanHaltingDuration="0.00" maxHaltingDuration="0.00" haltingDurationSum="0.00" meanIntervalHaltingDuration="0.00" maxIntervalHaltingD
uration="0.00" intervalHaltingDurationSum="0.00" startedHalts="0.00" meanVehicleNumber="0.00" maxVehicleNumber="0" />
   <interval begin="3.00" end="4.00" id="det0" sampledSeconds="0.00" nVehEntered="0" nVehLeft="0" nVehSeen="0" meanSpeed="-1.00" meanTimeLoss="-1.00" meanOccupancy="0.00" maxOccupancy="0.00" meanMaxJamLengthInVehicles="0.00" meanMaxJamLengthInMeters="0.00" maxJamLengthInVehicles="0" maxJamLengthInMeters="0.00" jamLengthInVehiclesSum="0" jamLengthInMetersSum="0.00" meanHaltingDuration="0.00" maxHaltingDuration="0.00" haltingDurationSum="0.00" meanIntervalHaltingDuration="0.00" maxIntervalHaltingD
uration="0.00" intervalHaltingDurationSum="0.00" startedHalts="0.00" meanVehicleNumber="0.00" maxVehicleNumber="0" />
   <interval begin="3.00" end="4.00" id="det1" sampledSeconds="0.00" nVehEntered="0" nVehLeft="0" nVehSeen="0" meanSpeed="-1.00" meanTimeLoss="-1.00" meanOccupancy="0.00" maxOccupancy="0.00" meanMaxJamLengthInVehicles="0.00" meanMaxJamLengthInMeters="0.00" maxJamLengthInVehicles="0" maxJamLengthInMeters="0.00" jamLengthInVehiclesSum="0" jamLengthInMetersSum="0.00" meanHaltingDuration="0.00" maxHaltingDuration="0.00" haltingDurationSum="0.00" meanIntervalHaltingDuration="0.00" maxIntervalHaltingD
uration="0.00" intervalHaltingDurationSum="0.00" startedHalts="0.00" meanVehicleNumber="0.00" maxVehicleNumber="0" />
   <interval begin="4.00" end="5.00" id="det0" sampledSeconds="0.00" nVehEntered="0" nVehLeft="0" nVehSeen="0" meanSpeed="-1.00" meanTimeLoss="-1.00" meanOccupancy="0.00" maxOccupancy="0.00" meanMaxJamLengthInVehicles="0.00" meanMaxJamLengthInMeters="0.00" maxJamLengthInVehicles="0" maxJamLengthInMeters="0.00" jamLengthInVehiclesSum="0" jamLengthInMetersSum="0.00" meanHaltingDuration="0.00" maxHaltingDuration="0.00" haltingDurationSum="0.00" meanIntervalHaltingDuration="0.00" maxIntervalHaltingD
uration="0.00" intervalHaltingDurationSum="0.00" startedHalts="0.00" meanVehicleNumber="0.00" maxVehicleNumber="0" />
   <interval begin="4.00" end="5.00" id="det1" sampledSeconds="0.00" nVehEntered="0" nVehLeft="0" nVehSeen="0" meanSpeed="-1.00" meanTimeLoss="-1.00" meanOccupancy="0.00" maxOccupancy="0.00" meanMaxJamLengthInVehicles="0.00" meanMaxJamLengthInMeters="0.00" maxJamLengthInVehicles="0" maxJamLengthInMeters="0.00" jamLengthInVehiclesSum="0" jamLengthInMetersSum="0.00" meanHaltingDuration="0.00" maxHaltingDuration="0.00" haltingDurationSum="0.00" meanIntervalHaltingDuration="0.00" maxIntervalHaltingD
uration="0.00" intervalHaltingDurationSum="0.00" startedHalts="0.00" meanVehicleNumber="0.00" maxVehicleNumber="0" />
   <interval begin="5.00" end="6.00" id="det0" sampledSeconds="0.00" nVehEntered="0" nVehLeft="0" nVehSeen="0" meanSpeed="-1.00" meanTimeLoss="-1.00" meanOccupancy="0.00" maxOccupancy="0.00" meanMaxJamLengthInVehicles="0.00" meanMaxJamLengthInMeters="0.00" maxJamLengthInVehicles="0" maxJamLengthInMeters="0.00" jamLengthInVehiclesSum="0" jamLengthInMetersSum="0.00" meanHaltingDuration="0.00" maxHaltingDuration="0.00" haltingDurationSum="0.00" meanIntervalHaltingDuration="0.00" maxIntervalHaltingD
uration="0.00" intervalHaltingDurationSum="0.00" startedHalts="0.00" meanVehicleNumber="0.00" maxVehicleNumber="0" />
   <interval begin="5.00" end="6.00" id="det1" sampledSeconds="0.00" nVehEntered="0" nVehLeft="0" nVehSeen="0" meanSpeed="-1.00" meanTimeLoss="-1.00" meanOccupancy="0.00" maxOccupancy="0.00" meanMaxJamLengthInVehicles="0.00" meanMaxJamLengthInMeters="0.00" maxJamLengthInVehicles="0" maxJamLengthInMeters="0.00" jamLengthInVehiclesSum="0" jamLengthInMetersSum="0.00" meanHaltingDuration="0.00" maxHaltingDuration="0.00" haltingDurationSum="0.00" meanIntervalHaltingDuration="0.00" maxIntervalHaltingD
uration="0.00" intervalHaltingDurationSum="0.00" startedHalts="0.00" meanVehicleNumber="0.00" maxVehicleNumber="0" />
   <interval begin="6.00" end="7.00" id="det0" sampledSeconds="0.00" nVehEntered="0" nVehLeft="0" nVehSeen="0" meanSpeed="-1.00" meanTimeLoss="-1.00" meanOccupancy="0.00" maxOccupancy="0.00" meanMaxJamLengthInVehicles="0.00" meanMaxJamLengthInMeters="0.00" maxJamLengthInVehicles="0" maxJamLengthInMeters="0.00" jamLengthInVehiclesSum="0" jamLengthInMetersSum="0.00" meanHaltingDuration="0.00" maxHaltingDuration="0.00" haltingDurationSum="0.00" meanIntervalHaltingDuration="0.00" maxIntervalHaltingD
uration="0.00" intervalHaltingDurationSum="0.00" startedHalts="0.00" meanVehicleNumber="0.00" maxVehicleNumber="0" />
   <interval begin="6.00" end="7.00" id="det1" sampledSeconds="0.00" nVehEntered="0" nVehLeft="0" nVehSeen="0" meanSpeed="-1.00" meanTimeLoss="-1.00" meanOccupancy="0.00" maxOccupancy="0.00" meanMaxJamLengthInVehicles="0.00" meanMaxJamLengthInMeters="0.00" maxJamLengthInVehicles="0" maxJamLengthInMeters="0.00" jamLengthInVehiclesSum="0" jamLengthInMetersSum="0.00" meanHaltingDuration="0.00" maxHaltingDuration="0.00" haltingDurationSum="0.00" meanIntervalHaltingDuration="0.00" maxIntervalHaltingD
uration="0.00" intervalHaltingDurationSum="0.00" startedHalts="0.00" meanVehicleNumber="0.00" maxVehicleNumber="0" />
   <interval begin="7.00" end="8.00" id="det0" sampledSeconds="0.00" nVehEntered="0" nVehLeft="0" nVehSeen="0" meanSpeed="-1.00" meanTimeLoss="-1.00" meanOccupancy="0.00" maxOccupancy="0.00" meanMaxJamLengthInVehicles="0.00" meanMaxJamLengthInMeters="0.00" maxJamLengthInVehicles="0" maxJamLengthInMeters="0.00" jamLengthInVehiclesSum="0" jamLengthInMetersSum="0.00" meanHaltingDuration="0.00" maxHaltingDuration="0.00" haltingDurationSum="0.00" meanIntervalHaltingDuration="0.00" maxIntervalHaltingD
uration="0.00" intervalHaltingDurationSum="0.00" startedHalts="0.00" meanVehicleNumber="0.00" maxVehicleNumber="0" />
   <interval begin="7.00" end="8.00" id="det1" sampledSeconds="0.00" nVehEntered="0" nVehLeft="0" nVehSeen="0" meanSpeed="-1.00" meanTimeLoss="-1.00" meanOccupancy="0.00" maxOccupancy="0.00" meanMaxJamLengthInVehicles="0.00" meanMaxJamLengthInMeters="0.00" maxJamLengthInVehicles="0" maxJamLengthInMeters="0.00" jamLengthInVehiclesSum="0" jamLengthInMetersSum="0.00" meanHaltingDuration="0.00" maxHaltingDuration="0.00" haltingDurationSum="0.00" meanIntervalHaltingDuration="0.00" maxIntervalHaltingD
uration="0.00" intervalHaltingDurationSum="0.00" startedHalts="0.00" meanVehicleNumber="0.00" maxVehicleNumber="0" />
</detector>

TEST FAILED on ts-sim-build-ba : traci pythonApi lateralCollision laneChanging leftLane ( Last six runs Jul2019 )

---------- Differences in errors ----------
1,2c1,4
< Warning: Teleporting vehicle 'left'; collision with vehicle 'collider', lane='e2_2', gap=-7.50, time=6.00 stage=laneChange.
< Warning: Vehicle 'left' ends teleporting on edge 'e3', time 6.00.
---
> Traceback (most recent call last):
>   File "/home/delphi/extraGcc/sumo/tests/../tests/complex/traci/pythonApi/lateralCollision/laneChanging/runner.py", line 75, in <module>
>     runSingle(50, float(sys.argv[2]), "collider")
> ValueError: could not convert string to float: 'sumo'
---------- Differences in output ----------
1,28d0
< Loading configuration... done.
< old lanechangemode 011001010101
< old speedmode 31
< new lanechangemode 010001010101
< new speedmode 0
< [000] lane 1, lateral pos: 0.00
< [001] lane 1, lateral pos: 0.00
< [002] lane 1, lateral pos: 0.00
< [003] lane 1, lateral pos: 0.00
< [004] lane 1, lateral pos: 0.00
< trying to change lane...
< [005] lane 1, lateral pos: 0.00
< [006] lane 2, lateral pos: 0.00
< [007] lane 2, lateral pos: 0.00
< [008] lane 2, lateral pos: 0.00
< [009] lane 2, lateral pos: 0.00
< [010] lane 2, lateral pos: 0.00
< [011] lane 2, lateral pos: 0.00
< [012] lane 2, lateral pos: 0.00
< [013] lane 2, lateral pos: 0.00
< [014] lane 2, lateral pos: 0.00
< [015] lane 2, lateral pos: 0.00
< [016] lane 2, lateral pos: 0.00
< [017] lane 2, lateral pos: 0.00
< [018] lane 2, lateral pos: 0.00
< [019] lane 2, lateral pos: 0.00
< [020] Vehicle 'collider' has arrived at destination
< Print ended at step 21

TEST FAILED on ts-sim-build-ba : traci pythonApi lateralCollision laneChanging rightLane ( Last six runs Jul2019 )

---------- Differences in errors ----------
1,2c1,4
< Warning: Teleporting vehicle 'collider'; collision with vehicle 'right', lane='e2_0', gap=-7.50, time=6.00 stage=laneChange.
< Warning: Vehicle 'collider' ends teleporting on edge 'e3', time 6.00.
---
> Traceback (most recent call last):
>   File "/home/delphi/extraGcc/sumo/tests/../tests/complex/traci/pythonApi/lateralCollision/laneChanging/runner.py", line 75, in <module>
>     runSingle(50, float(sys.argv[2]), "collider")
> ValueError: could not convert string to float: 'sumo'
---------- Differences in output ----------
1,24d0
< Loading configuration... done.
< old lanechangemode 011001010101
< old speedmode 31
< new lanechangemode 010001010101
< new speedmode 0
< [000] lane 1, lateral pos: 0.00
< [001] lane 1, lateral pos: 0.00
< [002] lane 1, lateral pos: 0.00
< [003] lane 1, lateral pos: 0.00
< [004] lane 1, lateral pos: 0.00
< trying to change lane...
< [005] lane 1, lateral pos: 0.00
< [006] lane 0, lateral pos: 0.00
< [007] lane 0, lateral pos: 0.00
< [008] lane 0, lateral pos: 0.00
< [009] lane 0, lateral pos: 0.00
< [010] lane 0, lateral pos: 0.00
< [011] lane 0, lateral pos: 0.00
< [012] lane 0, lateral pos: 0.00
< [013] lane 0, lateral pos: 0.00
< [014] lane 0, lateral pos: 0.00
< [015] lane 0, lateral pos: 0.00
< [016] Vehicle 'collider' has arrived at destination
< Print ended at step 17

TEST FAILED on ts-sim-build-ba : traci pythonApi lateralCollision sublaneChanging leftLane0.2 ( Last six runs Jul2019 )

---------- Differences in errors ----------
1,4c1,4
< Warning: Teleporting vehicle 'collider'; collision with vehicle 'left', lane='e3_2', gap=-7.50', latGap=-0.10, time=11.00 stage=laneChange.
< Warning: Teleporting vehicle 'left'; collision with vehicle 'collider', lane='e3_2', gap=-7.50', latGap=-0.10, time=11.00 stage=laneChange.
< Warning: Vehicle 'collider' ends teleporting on edge 'e4', time 11.00.
< Warning: Vehicle 'left' ends teleporting on edge 'e4', time 11.00.
---
> Traceback (most recent call last):
>   File "/home/delphi/extraGcc/sumo/tests/../tests/complex/traci/pythonApi/lateralCollision/sublaneChanging/runner.py", line 74, in <module>
>     runSingle(50, float(sys.argv[2]), "collider")
> ValueError: could not convert string to float: 'sumo'
---------- Differences in output ----------
1,39d0
< Loading configuration... done.
< old lanechangemode 011001010101
< old speedmode 31
< new lanechangemode 010001010101
< new speedmode 0
< trying to change lateral position by 0.20...
< [000] lane 1, lateral pos: 0.00
< trying to change lateral position by 0.20...
< [001] lane 1, lateral pos: 0.20
< trying to change lateral position by 0.20...
< [002] lane 1, lateral pos: 0.40
< trying to change lateral position by 0.20...
< [003] lane 1, lateral pos: 0.60
< trying to change lateral position by 0.20...
< [004] lane 1, lateral pos: 0.80
< trying to change lateral position by 0.20...
< [005] lane 1, lateral pos: 1.00
< trying to change lateral position by 0.20...
< [006] lane 1, lateral pos: 1.20
< trying to change lateral position by 0.20...
< [007] lane 1, lateral pos: 1.40
< trying to change lateral position by 0.20...
< [008] lane 1, lateral pos: 1.60
< trying to change lateral position by 0.20...
< [009] lane 2, lateral pos: -1.40
< trying to change lateral position by 0.20...
< [010] lane 2, lateral pos: -1.20
< trying to change lateral position by 0.20...
< [011] lane 0, lateral pos: 0.00
<truncated after showing first 30 lines>

TEST FAILED on ts-sim-build-ba : traci pythonApi lateralCollision sublaneChanging leftLane0.5 ( Last six runs Jul2019 )

---------- Differences in errors ----------
1,8c1,4
< Warning: Teleporting vehicle 'collider'; collision with vehicle 'left', lane='e1_2', gap=-7.50', latGap=-0.40, time=5.00 stage=laneChange.
< Warning: Teleporting vehicle 'left'; collision with vehicle 'collider', lane='e1_2', gap=-7.50', latGap=-0.40, time=5.00 stage=laneChange.
< Warning: Vehicle 'collider' ends teleporting on edge 'e2', time 6.00.
< Warning: Vehicle 'left' ends teleporting on edge 'e2', time 6.00.
< Warning: Teleporting vehicle 'collider'; collision with vehicle 'left', lane='e3_2', gap=-7.50', latGap=-0.40, time=11.00 stage=laneChange.
< Warning: Teleporting vehicle 'left'; collision with vehicle 'collider', lane='e3_2', gap=-7.50', latGap=-0.40, time=11.00 stage=laneChange.
< Warning: Vehicle 'collider' ends teleporting on edge 'e4', time 11.00.
< Warning: Vehicle 'left' ends teleporting on edge 'e4', time 11.00.
---
> Traceback (most recent call last):
>   File "/home/delphi/extraGcc/sumo/tests/../tests/complex/traci/pythonApi/lateralCollision/sublaneChanging/runner.py", line 74, in <module>
>     runSingle(50, float(sys.argv[2]), "collider")
> ValueError: could not convert string to float: 'sumo'
---------- Differences in output ----------
1,39d0
< Loading configuration... done.
< old lanechangemode 011001010101
< old speedmode 31
< new lanechangemode 010001010101
< new speedmode 0
< trying to change lateral position by 0.50...
< [000] lane 1, lateral pos: 0.00
< trying to change lateral position by 0.50...
< [001] lane 1, lateral pos: 0.50
< trying to change lateral position by 0.50...
< [002] lane 1, lateral pos: 1.00
< trying to change lateral position by 0.50...
< [003] lane 1, lateral pos: 1.50
< trying to change lateral position by 0.50...
< [004] lane 2, lateral pos: -1.20
< trying to change lateral position by 0.50...
< [005] lane -1073741824, lateral pos: -1073741824.00
< trying to change lateral position by 0.50...
< [006] lane 1, lateral pos: 0.00
< trying to change lateral position by 0.50...
< [007] lane 1, lateral pos: 0.50
< trying to change lateral position by 0.50...
< [008] lane 1, lateral pos: 1.00
< trying to change lateral position by 0.50...
< [009] lane 1, lateral pos: 1.50
< trying to change lateral position by 0.50...
< [010] lane 2, lateral pos: -1.20
< trying to change lateral position by 0.50...
< [011] lane 0, lateral pos: 0.00
<truncated after showing first 30 lines>

TEST FAILED on ts-sim-build-ba : traci pythonApi load ( Last six runs Jul2019 )

---------- Differences in errors ----------
1,2c1,28
< Error: Invalid edge list for vehicle 'horiz' (The edge 'dummy' within the route <unknown> is not known.
<  The route can not be build.)
---
> Traceback (most recent call last):
>   File "/home/delphi/extraGcc/sumo/tools/libsumo/libsumo.py", line 14, in swig_import_helper
>     return importlib.import_module(mname)
>   File "/usr/lib/python3.6/importlib/__init__.py", line 126, in import_module
>     return _bootstrap._gcd_import(name[level:], package, level)
>   File "<frozen importlib._bootstrap>", line 994, in _gcd_import
>   File "<frozen importlib._bootstrap>", line 971, in _find_and_load
>   File "<frozen importlib._bootstrap>", line 955, in _find_and_load_unlocked
>   File "<frozen importlib._bootstrap>", line 658, in _load_unlocked
>   File "<frozen importlib._bootstrap>", line 571, in module_from_spec
>   File "<frozen importlib._bootstrap_external>", line 922, in create_module
>   File "<frozen importlib._bootstrap>", line 219, in _call_with_frames_removed
> ImportError: dynamic module does not define module export function (PyInit__libsumo)
> 
> During handling of the above exception, another exception occurred:
> 
> Traceback (most recent call last):
>   File "/home/delphi/extraGcc/sumo/tests/../tests/complex/traci/pythonApi/load/runner.py", line 28, in <module>
>     import libsumo as traci  # noqa
>   File "/home/delphi/extraGcc/sumo/tools/libsumo/__init__.py", line 15, in <module>
>     from .libsumo import *  # noqa
>   File "/home/delphi/extraGcc/sumo/tools/libsumo/libsumo.py", line 17, in <module>
>     _libsumo = swig_import_helper()
>   File "/home/delphi/extraGcc/sumo/tools/libsumo/libsumo.py", line 16, in swig_import_helper
>     return importlib.import_module('_libsumo')
>   File "/usr/lib/python3.6/importlib/__init__.py", line 126, in import_module
<truncated after showing first 30 lines>
---------- Differences in output ----------
1,368d0
< Loading configuration... done.
< Loading configuration... done.
< Loading configuration... done.
< step=1000 departed=('horiz',)
< step=2000 departed=()
< step=3000 departed=()
< reloading
< step=1000 departed=('horiz',)
< step=2000 departed=()
< step=3000 departed=()
< step=4000 departed=()
< step=5000 departed=()
< step=6000 departed=()
< step=7000 departed=()
< step=8000 departed=()
< step=9000 departed=()
< step=10000 departed=()
< step=11000 departed=()
< step=12000 departed=()
< step=13000 departed=()
< step=14000 departed=()
< step=15000 departed=()
< step=16000 departed=()
< step=17000 departed=()
< step=18000 departed=()
< step=19000 departed=()
< step=20000 departed=()
< step=21000 departed=()
< step=22000 departed=()
<truncated after showing first 30 lines>
---------- Missing result in log ----------
***Starting server on port <PORT> ***
Loading net-file from 'input_net.net.xml'... done ((TIME)).
Loading additional-files from 'input_additional2.add.xml'... done ((TIME)).
Loading done.
Simulation started with time: 0.00
Simulation ended at time: 4.00
Reason: TraCI issued load command.

TEST FAILED on ts-sim-build-ba : traci pythonApi moveToXY elevation_sublane ( Last six runs Jul2019 )

---------- Differences in errors ----------
1c1,10
< Warning: Vehicle 'v0' performs emergency braking with decel=-9.00 wished=4.50 severity=1.00, time=4.00.
---
> Traceback (most recent call last):
>   File "/home/delphi/extraGcc/sumo/tests/../tests/complex/traci/pythonApi/moveToXY/elevation_sublane/runner.py", line 60, in <module>
>     check(50, 0, ANGLE_UNDEF, 5,        "ascending beg")
>   File "/home/delphi/extraGcc/sumo/tests/../tests/complex/traci/pythonApi/moveToXY/elevation_sublane/runner.py", line 44, in check
>     traci.vehicle.moveToXY(vehID, "", angle, x, y, keepRoute=2)
>   File "/home/delphi/extraGcc/sumo/tools/traci/_vehicle.py", line 1619, in moveToXY
>     self._connection._string += struct.pack("!Bi", tc.TYPE_INTEGER, lane)
> struct.error: required argument is not an integer
> Error: tcpip::Socket::recvAndCheck @ recv: peer shutdown
> Quitting (on error).

TEST FAILED on ts-sim-build-ba : traci pythonApi moveToXY keepRoute2 ( Last six runs Jul2019 )

---------- Differences in errors ----------
0a1,10
> Traceback (most recent call last):
>   File "/home/delphi/extraGcc/sumo/tests/../tests/complex/traci/pythonApi/moveToXY/keepRoute2/runner.py", line 69, in <module>
>     check(-1,  0,   ANGLE_UNDEF, "",         None, None,       "1m before the start of the edge")
>   File "/home/delphi/extraGcc/sumo/tests/../tests/complex/traci/pythonApi/moveToXY/keepRoute2/runner.py", line 47, in check
>     traci.vehicle.moveToXY(vehID, "", angle, x, y, keepRoute=2)
>   File "/home/delphi/extraGcc/sumo/tools/traci/_vehicle.py", line 1619, in moveToXY
>     self._connection._string += struct.pack("!Bi", tc.TYPE_INTEGER, lane)
> struct.error: required argument is not an integer
> Error: tcpip::Socket::recvAndCheck @ recv: peer shutdown
> Quitting (on error).
---------- Differences in output ----------
1d0
< vehicleList ('v0',)

TEST FAILED on ts-sim-build-ba : traci pythonApi moveToXY multi_lane ( Last six runs Jul2019 )

---------- Differences in errors ----------
0a1,10
> Traceback (most recent call last):
>   File "/home/delphi/extraGcc/sumo/tests/../tests/complex/traci/pythonApi/moveToXY/multi_lane/runner.py", line 77, in <module>
>     check(104.95, 20,   ANGLE_UNDEF, None,         None, None,       "correct lane")
>   File "/home/delphi/extraGcc/sumo/tests/../tests/complex/traci/pythonApi/moveToXY/multi_lane/runner.py", line 46, in check
>     traci.vehicle.moveToXY(vehID, "", angle, x, y)
>   File "/home/delphi/extraGcc/sumo/tools/traci/_vehicle.py", line 1619, in moveToXY
>     self._connection._string += struct.pack("!Bi", tc.TYPE_INTEGER, lane)
> struct.error: required argument is not an integer
> Error: tcpip::Socket::recvAndCheck @ recv: peer shutdown
> Quitting (on error).
---------- Differences in output ----------
1,7d0
< 2.0  lane=SC_0  right=[], []  left=[], []  accel=0.0  nextTLS=('C', 10, 71.95, 'G')  leader=None
< 3.0  lane=SC_0  right=[], []  left=['stay', 'strategic'], ['stay', 'strategic']  accel=10.0  nextTLS=('C', 10, 61.95, 'G')  leader=None
< 4.0  lane=SC_0  right=[], []  left=['stay', 'strategic'], ['stay', 'strategic']  accel=0.0  nextTLS=('C', 10, 51.95, 'G')  leader=None
< 5.0  lane=SC_1  right=[], []  left=['stay', 'strategic'], ['stay', 'strategic']  accel=7.1054273576e-15  nextTLS=('C', 10, 41.949999999999996, 'G')  leader=None
< 6.0  lane=SC_1  right=['right', 'strategic', 'urgent'], ['right', 'strategic', 'urgent']  left=[], []  accel=-1.42108547152e-14  nextTLS=('C', 10, 31.950000000000003, 'G')  leader=None
< 7.0  lane=SC_1  right=['right', 'strategic', 'urgent'], ['right', 'strategic', 'urgent']  left=[], []  accel=2.13162820728e-14  nextTLS=('C', 10, 21.94999999999999, 'G')  leader=None
< 8.0  lane=SC_1  right=['right', 'strategic', 'urgent'], ['right', 'strategic', 'urgent']  left=[], []  accel=-2.84217094304e-14  nextTLS=('C', 10, 11.950000000000003, 'G')  leader=None

TEST FAILED on ts-sim-build-ba : traci pythonApi moveToXY multi_lane_sublane ( Last six runs Jul2019 )

---------- Differences in errors ----------
0a1,10
> Traceback (most recent call last):
>   File "/home/delphi/extraGcc/sumo/tests/../tests/complex/traci/pythonApi/moveToXY/multi_lane_sublane/runner.py", line 78, in <module>
>     check(104.95, 20,   ANGLE_UNDEF, None,         None, None,       "correct lane")
>   File "/home/delphi/extraGcc/sumo/tests/../tests/complex/traci/pythonApi/moveToXY/multi_lane_sublane/runner.py", line 47, in check
>     traci.vehicle.moveToXY(vehID, "", angle, x, y)
>   File "/home/delphi/extraGcc/sumo/tools/traci/_vehicle.py", line 1619, in moveToXY
>     self._connection._string += struct.pack("!Bi", tc.TYPE_INTEGER, lane)
> struct.error: required argument is not an integer
> Error: tcpip::Socket::recvAndCheck @ recv: peer shutdown
> Quitting (on error).
---------- Differences in output ----------
1,7d0
< 2.0  lane=SC_0  right=[], []  left=[], []  accel=0.0  nextTLS=('C', 10, 71.95, 'G')  leader=None
< 3.0  lane=SC_0  right=[], []  left=['stay', 'strategic'], ['stay', 'strategic']  accel=10.0  nextTLS=('C', 10, 61.95, 'G')  leader=None
< 4.0  lane=SC_0  right=[], []  left=['stay', 'strategic'], ['stay', 'strategic']  accel=0.0  nextTLS=('C', 10, 51.95, 'G')  leader=None
< 5.0  lane=SC_1  right=[], []  left=['stay', 'strategic'], ['stay', 'strategic']  accel=7.1054273576e-15  nextTLS=('C', 10, 41.949999999999996, 'G')  leader=None
< 6.0  lane=SC_1  right=['right', 'strategic', 'urgent'], ['right', 'strategic', 'urgent']  left=[], []  accel=-1.42108547152e-14  nextTLS=('C', 10, 31.950000000000003, 'G')  leader=None
< 7.0  lane=SC_1  right=['right', 'strategic', 'urgent'], ['right', 'strategic', 'urgent']  left=[], []  accel=2.13162820728e-14  nextTLS=('C', 10, 21.94999999999999, 'G')  leader=None
< 8.0  lane=SC_1  right=['right', 'strategic', 'urgent'], ['right', 'strategic', 'urgent']  left=[], []  accel=-2.84217094304e-14  nextTLS=('C', 10, 11.950000000000003, 'G')  leader=None

TEST FAILED on ts-sim-build-ba : traci pythonApi moveToXY short_edges ( Last six runs Jul2019 )

---------- Differences in errors ----------
0a1,10
> Traceback (most recent call last):
>   File "/home/delphi/extraGcc/sumo/tests/../tests/complex/traci/pythonApi/moveToXY/short_edges/runner.py", line 71, in <module>
>     check(6.54, -1.50,  ANGLE_UNDEF, "A0toB0_0",         None, None,       "middle of the first edge")
>   File "/home/delphi/extraGcc/sumo/tests/../tests/complex/traci/pythonApi/moveToXY/short_edges/runner.py", line 50, in check
>     traci.vehicle.moveToXY(vehID, "", angle, x, y, keepRoute=2)
>   File "/home/delphi/extraGcc/sumo/tools/traci/_vehicle.py", line 1619, in moveToXY
>     self._connection._string += struct.pack("!Bi", tc.TYPE_INTEGER, lane)
> struct.error: required argument is not an integer
> Error: tcpip::Socket::recvAndCheck @ recv: peer shutdown
> Quitting (on error).

TEST FAILED on ts-sim-build-ba : traci pythonApi multientryexit ( Last six runs Jul2019 )

---------- Differences in errors ----------
0a1,28
> Traceback (most recent call last):
>   File "/home/delphi/extraGcc/sumo/tools/libsumo/libsumo.py", line 14, in swig_import_helper
>     return importlib.import_module(mname)
>   File "/usr/lib/python3.6/importlib/__init__.py", line 126, in import_module
>     return _bootstrap._gcd_import(name[level:], package, level)
>   File "<frozen importlib._bootstrap>", line 994, in _gcd_import
>   File "<frozen importlib._bootstrap>", line 971, in _find_and_load
>   File "<frozen importlib._bootstrap>", line 955, in _find_and_load_unlocked
>   File "<frozen importlib._bootstrap>", line 658, in _load_unlocked
>   File "<frozen importlib._bootstrap>", line 571, in module_from_spec
>   File "<frozen importlib._bootstrap_external>", line 922, in create_module
>   File "<frozen importlib._bootstrap>", line 219, in _call_with_frames_removed
> ImportError: dynamic module does not define module export function (PyInit__libsumo)
> 
> During handling of the above exception, another exception occurred:
> 
> Traceback (most recent call last):
>   File "/home/delphi/extraGcc/sumo/tests/../tests/complex/traci/pythonApi/multientryexit/runner.py", line 26, in <module>
>     import libsumo as traci  # noqa
>   File "/home/delphi/extraGcc/sumo/tools/libsumo/__init__.py", line 15, in <module>
>     from .libsumo import *  # noqa
>   File "/home/delphi/extraGcc/sumo/tools/libsumo/libsumo.py", line 17, in <module>
>     _libsumo = swig_import_helper()
>   File "/home/delphi/extraGcc/sumo/tools/libsumo/libsumo.py", line 16, in swig_import_helper
>     return importlib.import_module('_libsumo')
>   File "/usr/lib/python3.6/importlib/__init__.py", line 126, in import_module
>     return _bootstrap._gcd_import(name[level:], package, level)
> ModuleNotFoundError: No module named '_libsumo'
---------- Differences in output ----------
1,19d0
< Loading configuration... done.
< step 0
< step 1
< step 2
< step 3
< multientryexits ('0',)
< multientryexit count 1
< examining 0
< vehNum 1
< meanSpeed 6.20637786887
< vehIDs ('horiz',)
< haltNum 0
< {16: 1}
< step 3
< {16: 1}
< step 4
< {16: 0}
< step 5
< {16: 0}

TEST FAILED on ts-sim-build-ba : traci pythonApi nextTLS ( Last six runs Jul2019 )

---------- Differences in output ----------
1,100c1,100
< (1.0, (('C', 13, 86.85000000000001, 'g'), ('C', 15, 270.75, 'r'), ('C', 10, 454.65, 'G')))
< (2.0, (('C', 13, 84.25, 'g'), ('C', 15, 268.15, 'r'), ('C', 10, 452.04999999999995, 'G')))
< (3.0, (('C', 13, 79.05000000000001, 'g'), ('C', 15, 283.41, 'r'), ('C', 10, 467.31, 'G')))
< (4.0, (('C', 13, 71.25, 'g'), ('C', 15, 275.61, 'r'), ('C', 10, 459.51, 'G')))
< (5.0, (('C', 13, 60.85, 'g'), ('C', 15, 265.21, 'r'), ('C', 10, 449.10999999999996, 'G')))
< (6.0, (('C', 13, 47.85, 'g'), ('C', 15, 252.20999999999998, 'r'), ('C', 10, 436.10999999999996, 'G')))
< (7.0, (('C', 13, 33.96, 'g'), ('C', 15, 238.32, 'r'), ('C', 10, 422.21999999999997, 'G')))
< (8.0, (('C', 13, 20.070000000000007, 'g'), ('C', 15, 224.43, 'r'), ('C', 10, 408.33, 'G')))
< (9.0, (('C', 13, 6.777000000000001, 'g'), ('C', 15, 211.137, 'r'), ('C', 10, 395.037, 'G')))
< (10.0, (('C', 15, 202.344, 'r'), ('C', 10, 386.24399999999997, 'G')))
< (11.0, (('C', 15, 190.95100000000002, 'r'), ('C', 10, 374.851, 'G')))
< (12.0, (('C', 15, 177.06099999999998, 'r'), ('C', 10, 360.96099999999996, 'G')))
< (13.0, (('C', 15, 163.171, 'r'), ('C', 10, 347.07099999999997, 'G')))
< (14.0, (('C', 15, 149.281, 'r'), ('C', 10, 333.181, 'G')))
< (15.0, (('C', 15, 135.391, 'r'), ('C', 10, 319.291, 'G')))
< (16.0, (('C', 15, 121.501, 'r'), ('C', 10, 305.401, 'G')))
< (17.0, (('C', 15, 107.61099999999999, 'r'), ('C', 10, 291.51099999999997, 'G')))
< (18.0, (('C', 15, 93.721, 'r'), ('C', 10, 277.621, 'G')))
< (19.0, (('C', 15, 79.83099999999999, 'r'), ('C', 10, 268.731, 'G')))
< (20.0, (('C', 15, 65.941, 'r'), ('C', 10, 254.841, 'G')))
< (21.0, (('C', 15, 52.050999999999995, 'r'), ('C', 10, 240.95100000000002, 'G')))
< (22.0, (('C', 15, 38.160999999999994, 'r'), ('C', 10, 227.06099999999998, 'G')))
< (23.0, (('C', 15, 24.271, 'r'), ('C', 10, 213.171, 'G')))
< (24.0, (('C', 15, 12.01433333333334, 'r'), ('C', 10, 200.91433333333333, 'G')))
< (25.0, (('C', 15, 4.257666666666665, 'r'), ('C', 10, 193.15766666666667, 'G')))
< (26.0, (('C', 15, 1.0010000000000048, 'r'), ('C', 10, 189.901, 'G')))
< (27.0, (('C', 15, 1.0010000000000048, 'r'), ('C', 10, 189.901, 'G')))
< (28.0, (('C', 15, 1.0010000000000048, 'r'), ('C', 10, 189.901, 'G')))
< (29.0, (('C', 15, 1.0010000000000048, 'r'), ('C', 10, 189.901, 'G')))
<truncated after showing first 30 lines>

TEST FAILED on ts-sim-build-ba : traci pythonApi params ( Last six runs Jul2019 )

---------- Differences in errors ----------
0a1,28
> Traceback (most recent call last):
>   File "/home/delphi/extraGcc/sumo/tools/libsumo/libsumo.py", line 14, in swig_import_helper
>     return importlib.import_module(mname)
>   File "/usr/lib/python3.6/importlib/__init__.py", line 126, in import_module
>     return _bootstrap._gcd_import(name[level:], package, level)
>   File "<frozen importlib._bootstrap>", line 994, in _gcd_import
>   File "<frozen importlib._bootstrap>", line 971, in _find_and_load
>   File "<frozen importlib._bootstrap>", line 955, in _find_and_load_unlocked
>   File "<frozen importlib._bootstrap>", line 658, in _load_unlocked
>   File "<frozen importlib._bootstrap>", line 571, in module_from_spec
>   File "<frozen importlib._bootstrap_external>", line 922, in create_module
>   File "<frozen importlib._bootstrap>", line 219, in _call_with_frames_removed
> ImportError: dynamic module does not define module export function (PyInit__libsumo)
> 
> During handling of the above exception, another exception occurred:
> 
> Traceback (most recent call last):
>   File "/home/delphi/extraGcc/sumo/tests/../tests/complex/traci/pythonApi/params/runner.py", line 25, in <module>
>     import libsumo as traci  # noqa
>   File "/home/delphi/extraGcc/sumo/tools/libsumo/__init__.py", line 15, in <module>
>     from .libsumo import *  # noqa
>   File "/home/delphi/extraGcc/sumo/tools/libsumo/libsumo.py", line 17, in <module>
>     _libsumo = swig_import_helper()
>   File "/home/delphi/extraGcc/sumo/tools/libsumo/libsumo.py", line 16, in swig_import_helper
>     return importlib.import_module('_libsumo')
>   File "/usr/lib/python3.6/importlib/__init__.py", line 126, in import_module
>     return _bootstrap._gcd_import(name[level:], package, level)
> ModuleNotFoundError: No module named '_libsumo'
---------- Differences in output ----------
1,17d0
< Loading configuration... done.
< step 0
< vehicle foo=""
< vehicle foo="42"
< person foo=""
< person foo="42"
< edge foo=""
< edge foo="42"
< lane foo=""
< lane foo="42"
< vType foo=""
< vType foo="42"
< route foo=""
< route foo="42"
< trafficlight foo=""
< trafficlight foo="42"
< step 1

TEST FAILED on ts-sim-build-ba : traci pythonApi person ( Last six runs Jul2019 )

---------- Differences in errors ----------
1,3c1,28
< Error: Person 'bla' is not known
< Error: The stage index must be lower than the number of remaining stages.
< Error: The negative stage index must refer to a valid previous stage.
---
> Traceback (most recent call last):
>   File "/home/delphi/extraGcc/sumo/tools/libsumo/libsumo.py", line 14, in swig_import_helper
>     return importlib.import_module(mname)
>   File "/usr/lib/python3.6/importlib/__init__.py", line 126, in import_module
>     return _bootstrap._gcd_import(name[level:], package, level)
>   File "<frozen importlib._bootstrap>", line 994, in _gcd_import
>   File "<frozen importlib._bootstrap>", line 971, in _find_and_load
>   File "<frozen importlib._bootstrap>", line 955, in _find_and_load_unlocked
>   File "<frozen importlib._bootstrap>", line 658, in _load_unlocked
>   File "<frozen importlib._bootstrap>", line 571, in module_from_spec
>   File "<frozen importlib._bootstrap_external>", line 922, in create_module
>   File "<frozen importlib._bootstrap>", line 219, in _call_with_frames_removed
> ImportError: dynamic module does not define module export function (PyInit__libsumo)
> 
> During handling of the above exception, another exception occurred:
> 
> Traceback (most recent call last):
>   File "/home/delphi/extraGcc/sumo/tests/../tests/complex/traci/pythonApi/person/runner.py", line 25, in <module>
>     import libsumo as traci  # noqa
>   File "/home/delphi/extraGcc/sumo/tools/libsumo/__init__.py", line 15, in <module>
>     from .libsumo import *  # noqa
>   File "/home/delphi/extraGcc/sumo/tools/libsumo/libsumo.py", line 17, in <module>
>     _libsumo = swig_import_helper()
>   File "/home/delphi/extraGcc/sumo/tools/libsumo/libsumo.py", line 16, in swig_import_helper
>     return importlib.import_module('_libsumo')
<truncated after showing first 30 lines>
---------- Differences in output ----------
1,105d0
< Loading configuration... done.
< step 0
< step 1
< step 2
< detour edges ('3si', '2o', '2fi', '2si', '4o')
< detour edges after routing ('3si', '4o')
< tripTest edges after routing ('2fi', '2si', '1si', '1fi')
< type pType2@horiz
< persons ('detour', 'detour2', 'horiz', 'newPerson', 'tripTest')
< person count 5
< examining horiz
< speed 1.22501255666
< pos (759.1336009754515, 504.95000000000005)
< pos3D (759.1336009754515, 504.95000000000005, 0.0)
< angle 270.0
< slope 0.0
< road 2fi
< type pType2@horiz
< lanePos 240.866399025
< color (0, 0, 255, 255)
< length 2.0
< MinGap 2.22
< width 1.11
< waiting time 0.0
< stage Stage(type=2, vType='', line='', destStop='', edges=('2fi', '2si', '1o'), travelTime=-1.0, cost=-1.0, length=766.537661434478, intended='', depart=-1073741824.0, departPos=238.5, arrivalPos=486.54, description='walking')
< remainingStages 1
< edges ('2fi', '2si', '1o')
< vehicle 
< {0: ('detour', 'detour2', 'horiz', 'newPerson', 'tripTest')}
<truncated after showing first 30 lines>
---------- Missing result in fcd ----------
<?xml version="1.0" encoding="UTF-8"?>


<fcd-export xmlns:xsi="http://www.w3.org/2001/XMLSchema-instance" xsi:noNamespaceSchemaLocation="http://sumo.dlr.de/xsd/fcd_file.xsd">
    <timestep time="0.00">
        <person id="horiz" x="761.50" y="504.95" angle="270.00" speed="0.00" pos="238.50" edge="2fi" slope="0.00"/>
        <person id="detour2" x="511.55" y="466.55" angle="0.00" speed="0.00" pos="215.05" edge="3si" slope="0.00"/>
        <person id="detour" x="511.55" y="471.55" angle="0.00" speed="0.00" pos="220.05" edge="3si" slope="0.00"/>
        <person id="newPerson" x="511.55" y="476.55" angle="0.00" speed="0.00" pos="225.05" edge="3si" slope="0.00"/>
    </timestep>
    <timestep time="1.00">
        <person id="horiz" x="760.36" y="504.95" angle="270.00" speed="1.14" pos="239.64" edge="2fi" slope="0.00"/>
        <person id="detour2" x="511.55" y="467.80" angle="0.00" speed="1.25" pos="216.30" edge="3si" slope="0.00"/>
        <person id="detour" x="511.55" y="472.93" angle="0.00" speed="1.38" pos="221.43" edge="3si" slope="0.00"/>
        <person id="newPerson" x="511.55" y="477.58" angle="0.00" speed="1.03" pos="226.08" edge="3si" slope="0.00"/>
    </timestep>
    <timestep time="2.00">
        <person id="horiz" x="759.13" y="504.95" angle="270.00" speed="1.23" pos="240.87" edge="2fi" slope="0.00"/>
        <person id="detour2" x="511.55" y="469.12" angle="0.00" speed="1.32" pos="217.62" edge="3si" slope="0.00"/>
        <person id="detour" x="511.55" y="474.11" angle="0.00" speed="1.18" pos="222.61" edge="3si" slope="0.00"/>
        <person id="newPerson" x="511.55" y="478.77" angle="0.00" speed="1.19" pos="227.27" edge="3si" slope="0.00"/>
    </timestep>
    <timestep time="3.00">
        <person id="tripTest" x="760.34" y="504.95" angle="270.00" speed="1.16" pos="239.66" edge="2fi" slope="0.00"/>
        <person id="horiz" x="757.89" y="504.95" angle="270.00" speed="1.25" pos="242.11" edge="2fi" slope="0.00"/>
        <person id="detour2" x="511.55" y="470.38" angle="0.00" speed="1.26" pos="218.88" edge="3si" slope="0.00"/>
        <person id="detour" x="511.55" y="475.31" angle="0.00" speed="1.20" pos="223.81" edge="3si" slope="0.00"/>
        <person id="newPerson" x="511.55" y="479.97" angle="0.00" speed="1.20" pos="228.47" edge="3si" slope="0.00"/>
    </timestep>
    <timestep time="4.00">
<truncated after showing first 30 lines>

TEST FAILED on ts-sim-build-ba : traci pythonApi poi ( Last six runs Jul2019 )

---------- Differences in errors ----------
0a1,28
> Traceback (most recent call last):
>   File "/home/delphi/extraGcc/sumo/tools/libsumo/libsumo.py", line 14, in swig_import_helper
>     return importlib.import_module(mname)
>   File "/usr/lib/python3.6/importlib/__init__.py", line 126, in import_module
>     return _bootstrap._gcd_import(name[level:], package, level)
>   File "<frozen importlib._bootstrap>", line 994, in _gcd_import
>   File "<frozen importlib._bootstrap>", line 971, in _find_and_load
>   File "<frozen importlib._bootstrap>", line 955, in _find_and_load_unlocked
>   File "<frozen importlib._bootstrap>", line 658, in _load_unlocked
>   File "<frozen importlib._bootstrap>", line 571, in module_from_spec
>   File "<frozen importlib._bootstrap_external>", line 922, in create_module
>   File "<frozen importlib._bootstrap>", line 219, in _call_with_frames_removed
> ImportError: dynamic module does not define module export function (PyInit__libsumo)
> 
> During handling of the above exception, another exception occurred:
> 
> Traceback (most recent call last):
>   File "/home/delphi/extraGcc/sumo/tests/../tests/complex/traci/pythonApi/poi/runner.py", line 26, in <module>
>     import libsumo as traci  # noqa
>   File "/home/delphi/extraGcc/sumo/tools/libsumo/__init__.py", line 15, in <module>
>     from .libsumo import *  # noqa
>   File "/home/delphi/extraGcc/sumo/tools/libsumo/libsumo.py", line 17, in <module>
>     _libsumo = swig_import_helper()
>   File "/home/delphi/extraGcc/sumo/tools/libsumo/libsumo.py", line 16, in swig_import_helper
>     return importlib.import_module('_libsumo')
>   File "/usr/lib/python3.6/importlib/__init__.py", line 126, in import_module
>     return _bootstrap._gcd_import(name[level:], package, level)
> ModuleNotFoundError: No module named '_libsumo'
---------- Differences in output ----------
1,41d0
< Loading configuration... done.
< step 0
< step 1
< step 2
< adding 0
< pois ('0', 'poi1', 'poi2')
< poi count 3
< examining 0
< pos (1.0, 1.0)
< type test
< color (1, 2, 3, 4)
< {0: ('0', 'poi1', 'poi2')}
< step 3
< {0: ('0', 'poi1', 'poi2')}
< step 4
< {0: ('0', 'poi1', 'poi2')}
< step 5
< {0: ('0', 'poi1', 'poi2')}
< pois ('0', 'poi1', 'poi2')
< poi count 3
< examining 0
< pos (5.0, 5.0)
< type blub
< color (222, 111, 221, 0)
< pois ('0', 'p2', 'poi1', 'poi2')
< poi count 4
< examining p2
< pos (2.0, 2.0)
< type ptest
<truncated after showing first 30 lines>

TEST FAILED on ts-sim-build-ba : traci pythonApi polygon ( Last six runs Jul2019 )

---------- Differences in errors ----------
1c1,28
< Error: NaN-Value in shape
---
> Traceback (most recent call last):
>   File "/home/delphi/extraGcc/sumo/tools/libsumo/libsumo.py", line 14, in swig_import_helper
>     return importlib.import_module(mname)
>   File "/usr/lib/python3.6/importlib/__init__.py", line 126, in import_module
>     return _bootstrap._gcd_import(name[level:], package, level)
>   File "<frozen importlib._bootstrap>", line 994, in _gcd_import
>   File "<frozen importlib._bootstrap>", line 971, in _find_and_load
>   File "<frozen importlib._bootstrap>", line 955, in _find_and_load_unlocked
>   File "<frozen importlib._bootstrap>", line 658, in _load_unlocked
>   File "<frozen importlib._bootstrap>", line 571, in module_from_spec
>   File "<frozen importlib._bootstrap_external>", line 922, in create_module
>   File "<frozen importlib._bootstrap>", line 219, in _call_with_frames_removed
> ImportError: dynamic module does not define module export function (PyInit__libsumo)
> 
> During handling of the above exception, another exception occurred:
> 
> Traceback (most recent call last):
>   File "/home/delphi/extraGcc/sumo/tests/../tests/complex/traci/pythonApi/polygon/runner.py", line 26, in <module>
>     import libsumo as traci  # noqa
>   File "/home/delphi/extraGcc/sumo/tools/libsumo/__init__.py", line 15, in <module>
>     from .libsumo import *  # noqa
>   File "/home/delphi/extraGcc/sumo/tools/libsumo/libsumo.py", line 17, in <module>
>     _libsumo = swig_import_helper()
>   File "/home/delphi/extraGcc/sumo/tools/libsumo/libsumo.py", line 16, in swig_import_helper
>     return importlib.import_module('_libsumo')
>   File "/usr/lib/python3.6/importlib/__init__.py", line 126, in import_module
>     return _bootstrap._gcd_import(name[level:], package, level)
<truncated after showing first 30 lines>
---------- Differences in output ----------
1,28d0
< Loading configuration... done.
< step 0
< step 1
< step 2
< adding 0
< polygons ('0',)
< polygon count 1
< examining 0
< shape ((1.0, 1.0), (1.0, 10.0), (10.0, 10.0))
< type test
< color (1, 2, 3, 4)
< filled True
< shape modified ((11.0, 11.0), (11.0, 101.0), (101.0, 101.0))
< type modified blub
< color modified (5, 6, 7, 8)
< color modified2 (5, 6, 7, 255)
< filled modified False
< getParameter='' (unset)
< getParameter='42' (after setting)
< {0: ('0',)}
< step 3
< {0: ('0',)}
< step 4
< {0: ('0',)}
< step 5
< {0: ('0',)}
< new polygon lineWidth 3.0
< lineWidth modified 0.5

TEST FAILED on ts-sim-build-ba : traci pythonApi polygon_dynamics ( Last six runs Jul2019 )

---------- Differences in errors ----------
1,6c1,28
< Error: Could not add polygon dynamics for polygon 'poly0': dynamics underspecified (either a tracked object ID or a time span have to be provided).
< Error: Could not add polygon dynamics for polygon 'poly0': entries of time span must be ordered ascendingly.
< Error: Could not add polygon dynamics for polygon 'poly0': first element of time span must be zero.
< Error: Could not add polygon dynamics for polygon 'poly0': alpha span must have length zero or equal to time span length.
< Error: Could not add polygon dynamics for polygon 'poly0': time span cannot have length one.
< Error: Could not add polygon dynamics for polygon 'poly0': looped==true requires time line of positive length.
---
> Traceback (most recent call last):
>   File "/home/delphi/extraGcc/sumo/tools/libsumo/libsumo.py", line 14, in swig_import_helper
>     return importlib.import_module(mname)
>   File "/usr/lib/python3.6/importlib/__init__.py", line 126, in import_module
>     return _bootstrap._gcd_import(name[level:], package, level)
>   File "<frozen importlib._bootstrap>", line 994, in _gcd_import
>   File "<frozen importlib._bootstrap>", line 971, in _find_and_load
>   File "<frozen importlib._bootstrap>", line 955, in _find_and_load_unlocked
>   File "<frozen importlib._bootstrap>", line 658, in _load_unlocked
>   File "<frozen importlib._bootstrap>", line 571, in module_from_spec
>   File "<frozen importlib._bootstrap_external>", line 922, in create_module
>   File "<frozen importlib._bootstrap>", line 219, in _call_with_frames_removed
> ImportError: dynamic module does not define module export function (PyInit__libsumo)
> 
> During handling of the above exception, another exception occurred:
> 
> Traceback (most recent call last):
>   File "/home/delphi/extraGcc/sumo/tests/../tests/complex/traci/pythonApi/polygon_dynamics/runner.py", line 26, in <module>
>     import libsumo as traci  # noqa
>   File "/home/delphi/extraGcc/sumo/tools/libsumo/__init__.py", line 15, in <module>
>     from .libsumo import *  # noqa
>   File "/home/delphi/extraGcc/sumo/tools/libsumo/libsumo.py", line 17, in <module>
<truncated after showing first 30 lines>
---------- Differences in output ----------
1,262d0
< Loading configuration... done.
< step 0
< step 1
< step 2
< adding poly0
< polygons ('poly0',)
< polygon count 1
< # examining poly0
< shape ((960.0, 510.0), (960.0, 550.0), (1000.0, 550.0), (1000.0, 510.0))
< type test
< color (100, 200, 0, 255)
< filled True
< step 3
< step 4
< step 5
< # (1) Adding underspecified dynamics...
< Caught TraCIException
< # (2) Adding malformed dynamics 1 ...
< Caught TraCIException
< # (3) Adding malformed dynamics 2 ...
< Caught TraCIException
< # (4) Adding malformed dynamics 3 ...
< Caught TraCIException
< # (5) Adding malformed dynamics 4 ...
< Caught TraCIException
< # (6) Adding malformed dynamics 5 ...
< Caught TraCIException
< # examining poly0
< shape ((960.0, 510.0), (960.0, 550.0), (1000.0, 550.0), (1000.0, 510.0))
<truncated after showing first 30 lines>

TEST FAILED on ts-sim-build-ba : traci pythonApi polygon_dynamics_gui ( Last six runs Jul2019 )

---------- Differences in errors ----------
0a1,28
> Traceback (most recent call last):
>   File "/home/delphi/extraGcc/sumo/tools/libsumo/libsumo.py", line 14, in swig_import_helper
>     return importlib.import_module(mname)
>   File "/usr/lib/python3.6/importlib/__init__.py", line 126, in import_module
>     return _bootstrap._gcd_import(name[level:], package, level)
>   File "<frozen importlib._bootstrap>", line 994, in _gcd_import
>   File "<frozen importlib._bootstrap>", line 971, in _find_and_load
>   File "<frozen importlib._bootstrap>", line 955, in _find_and_load_unlocked
>   File "<frozen importlib._bootstrap>", line 658, in _load_unlocked
>   File "<frozen importlib._bootstrap>", line 571, in module_from_spec
>   File "<frozen importlib._bootstrap_external>", line 922, in create_module
>   File "<frozen importlib._bootstrap>", line 219, in _call_with_frames_removed
> ImportError: dynamic module does not define module export function (PyInit__libsumo)
> 
> During handling of the above exception, another exception occurred:
> 
> Traceback (most recent call last):
>   File "/home/delphi/extraGcc/sumo/tests/../tests/complex/traci/pythonApi/polygon_dynamics_gui/runner.py", line 26, in <module>
>     import libsumo as traci  # noqa
>   File "/home/delphi/extraGcc/sumo/tools/libsumo/__init__.py", line 15, in <module>
>     from .libsumo import *  # noqa
>   File "/home/delphi/extraGcc/sumo/tools/libsumo/libsumo.py", line 17, in <module>
>     _libsumo = swig_import_helper()
>   File "/home/delphi/extraGcc/sumo/tools/libsumo/libsumo.py", line 16, in swig_import_helper
>     return importlib.import_module('_libsumo')
>   File "/usr/lib/python3.6/importlib/__init__.py", line 126, in import_module
>     return _bootstrap._gcd_import(name[level:], package, level)
> ModuleNotFoundError: No module named '_libsumo'
---------- Differences in output ----------
1,257d0
< Loading configuration... done.
< step 0
< step 1
< step 2
< adding poly0
< polygons ('poly0',)
< polygon count 1
< # examining poly0
< shape ((960.0, 510.0), (960.0, 550.0), (1000.0, 550.0), (1000.0, 510.0))
< type test
< color (100, 200, 0, 255)
< filled True
< step 3
< step 4
< step 5
< # (1) Adding underspecified dynamics...
< Caught TraCIException
< # (2) Adding malformed dynamics 1 ...
< Caught TraCIException
< # (3) Adding malformed dynamics 2 ...
< Caught TraCIException
< # (4) Adding malformed dynamics 3 ...
< Caught TraCIException
< # (5) Adding malformed dynamics 4 ...
< Caught TraCIException
< # (6) Adding malformed dynamics 5 ...
< Caught TraCIException
< # examining poly0
< shape ((960.0, 510.0), (960.0, 550.0), (1000.0, 550.0), (1000.0, 510.0))
<truncated after showing first 30 lines>

TEST FAILED on ts-sim-build-ba : traci pythonApi rerouting add_with_taz ( Last six runs Jul2019 )

---------- Differences in errors ----------
0a1,28
> Traceback (most recent call last):
>   File "/home/delphi/extraGcc/sumo/tools/libsumo/libsumo.py", line 14, in swig_import_helper
>     return importlib.import_module(mname)
>   File "/usr/lib/python3.6/importlib/__init__.py", line 126, in import_module
>     return _bootstrap._gcd_import(name[level:], package, level)
>   File "<frozen importlib._bootstrap>", line 994, in _gcd_import
>   File "<frozen importlib._bootstrap>", line 971, in _find_and_load
>   File "<frozen importlib._bootstrap>", line 955, in _find_and_load_unlocked
>   File "<frozen importlib._bootstrap>", line 658, in _load_unlocked
>   File "<frozen importlib._bootstrap>", line 571, in module_from_spec
>   File "<frozen importlib._bootstrap_external>", line 922, in create_module
>   File "<frozen importlib._bootstrap>", line 219, in _call_with_frames_removed
> ImportError: dynamic module does not define module export function (PyInit__libsumo)
> 
> During handling of the above exception, another exception occurred:
> 
> Traceback (most recent call last):
>   File "/home/delphi/extraGcc/sumo/tests/../tests/complex/traci/pythonApi/rerouting/add_with_taz/runner.py", line 25, in <module>
>     import libsumo as traci  # noqa
>   File "/home/delphi/extraGcc/sumo/tools/libsumo/__init__.py", line 15, in <module>
>     from .libsumo import *  # noqa
>   File "/home/delphi/extraGcc/sumo/tools/libsumo/libsumo.py", line 17, in <module>
>     _libsumo = swig_import_helper()
>   File "/home/delphi/extraGcc/sumo/tools/libsumo/libsumo.py", line 16, in swig_import_helper
>     return importlib.import_module('_libsumo')
>   File "/usr/lib/python3.6/importlib/__init__.py", line 126, in import_module
>     return _bootstrap._gcd_import(name[level:], package, level)
> ModuleNotFoundError: No module named '_libsumo'
---------- Differences in output ----------
1d0
< Loading configuration... done.
---------- Missing result in vehroutes ----------
<?xml version="1.0" encoding="UTF-8"?>


<routes xmlns:xsi="http://www.w3.org/2001/XMLSchema-instance" xsi:noNamespaceSchemaLocation="http://sumo.dlr.de/xsd/routes_file.xsd">
    <vehicle id="toTAZ" depart="1.00" arrival="26.00">
        <route edges="A3B3 B3C3 C3D3"/>
    </vehicle>

    <vehicle id="fromTAZ" depart="1.00" arrival="34.00">
        <route edges="D3C3 C3B3 B3A3 A3B3"/>
    </vehicle>

    <vehicle id="betweenTAZ" depart="1.00" arrival="49.00">
        <route edges="D3D2 D2D1 D1D0 D0C0 C0B0 B0A0"/>
    </vehicle>

</routes>

TEST FAILED on ts-sim-build-ba : traci pythonApi rerouting person stop_walk_stop_walk ( Last six runs Jul2019 )

---------- Differences in errors ----------
0a1,28
> Traceback (most recent call last):
>   File "/home/delphi/extraGcc/sumo/tools/libsumo/libsumo.py", line 14, in swig_import_helper
>     return importlib.import_module(mname)
>   File "/usr/lib/python3.6/importlib/__init__.py", line 126, in import_module
>     return _bootstrap._gcd_import(name[level:], package, level)
>   File "<frozen importlib._bootstrap>", line 994, in _gcd_import
>   File "<frozen importlib._bootstrap>", line 971, in _find_and_load
>   File "<frozen importlib._bootstrap>", line 955, in _find_and_load_unlocked
>   File "<frozen importlib._bootstrap>", line 658, in _load_unlocked
>   File "<frozen importlib._bootstrap>", line 571, in module_from_spec
>   File "<frozen importlib._bootstrap_external>", line 922, in create_module
>   File "<frozen importlib._bootstrap>", line 219, in _call_with_frames_removed
> ImportError: dynamic module does not define module export function (PyInit__libsumo)
> 
> During handling of the above exception, another exception occurred:
> 
> Traceback (most recent call last):
>   File "/home/delphi/extraGcc/sumo/tests/../tests/complex/traci/pythonApi/rerouting/person/stop_walk_stop_walk/runner.py", line 24, in <module>
>     import libsumo as traci  # noqa
>   File "/home/delphi/extraGcc/sumo/tools/libsumo/__init__.py", line 15, in <module>
>     from .libsumo import *  # noqa
>   File "/home/delphi/extraGcc/sumo/tools/libsumo/libsumo.py", line 17, in <module>
>     _libsumo = swig_import_helper()
>   File "/home/delphi/extraGcc/sumo/tools/libsumo/libsumo.py", line 16, in swig_import_helper
>     return importlib.import_module('_libsumo')
>   File "/usr/lib/python3.6/importlib/__init__.py", line 126, in import_module
>     return _bootstrap._gcd_import(name[level:], package, level)
> ModuleNotFoundError: No module named '_libsumo'
---------- Missing result in fcd ----------
<?xml version="1.0" encoding="UTF-8"?>


<fcd-export xmlns:xsi="http://www.w3.org/2001/XMLSchema-instance" xsi:noNamespaceSchemaLocation="http://sumo.dlr.de/xsd/fcd_file.xsd">
    <timestep time="0.00">
        <person id="p0" x="107.95" y="81.95" angle="270.00" speed="0.00" pos="81.95" edge="SC" slope="0.00"/>
    </timestep>
    <timestep time="1.00">
        <person id="p0" x="107.95" y="81.95" angle="270.00" speed="0.00" pos="81.95" edge="SC" slope="0.00"/>
    </timestep>
    <timestep time="2.00">
        <person id="p0" x="107.95" y="81.95" angle="270.00" speed="0.00" pos="81.95" edge="SC" slope="0.00"/>
    </timestep>
    <timestep time="3.00">
        <person id="p0" x="107.95" y="81.95" angle="270.00" speed="0.00" pos="81.95" edge="SC" slope="0.00"/>
    </timestep>
    <timestep time="4.00">
        <person id="p0" x="107.95" y="81.95" angle="270.00" speed="0.00" pos="81.95" edge="SC" slope="0.00"/>
    </timestep>
    <timestep time="5.00">
        <person id="p0" x="107.95" y="81.95" angle="270.00" speed="0.00" pos="81.95" edge="SC" slope="0.00"/>
    </timestep>
    <timestep time="6.00">
        <person id="p0" x="107.95" y="81.95" angle="270.00" speed="0.00" pos="81.95" edge="SC" slope="0.00"/>
    </timestep>
    <timestep time="7.00">
        <person id="p0" x="107.95" y="81.95" angle="270.00" speed="0.00" pos="81.95" edge="SC" slope="0.00"/>
    </timestep>
    <timestep time="8.00">
        <person id="p0" x="107.95" y="81.95" angle="270.00" speed="0.00" pos="81.95" edge="SC" slope="0.00"/>
<truncated after showing first 30 lines>
---------- Missing result in vehroutes ----------
<?xml version="1.0" encoding="UTF-8"?>


<routes xmlns:xsi="http://www.w3.org/2001/XMLSchema-instance" xsi:noNamespaceSchemaLocation="http://sumo.dlr.de/xsd/routes_file.xsd">
    <person id="p0" depart="0.00" departPos="-10.00" arrival="110.00">
        <stop lane="SC_0" duration="15.00"/>
        <walk edges="SC CN"/>
        <stop lane="CN_0" duration="15.00"/>
        <walk edges="CN SC"/>
    </person>

</routes>

TEST FAILED on ts-sim-build-ba : traci pythonApi rerouting rerouteParkingArea_end ( Last six runs Jul2019 )

---------- Differences in errors ----------
0a1,28
> Traceback (most recent call last):
>   File "/home/delphi/extraGcc/sumo/tools/libsumo/libsumo.py", line 14, in swig_import_helper
>     return importlib.import_module(mname)
>   File "/usr/lib/python3.6/importlib/__init__.py", line 126, in import_module
>     return _bootstrap._gcd_import(name[level:], package, level)
>   File "<frozen importlib._bootstrap>", line 994, in _gcd_import
>   File "<frozen importlib._bootstrap>", line 971, in _find_and_load
>   File "<frozen importlib._bootstrap>", line 955, in _find_and_load_unlocked
>   File "<frozen importlib._bootstrap>", line 658, in _load_unlocked
>   File "<frozen importlib._bootstrap>", line 571, in module_from_spec
>   File "<frozen importlib._bootstrap_external>", line 922, in create_module
>   File "<frozen importlib._bootstrap>", line 219, in _call_with_frames_removed
> ImportError: dynamic module does not define module export function (PyInit__libsumo)
> 
> During handling of the above exception, another exception occurred:
> 
> Traceback (most recent call last):
>   File "/home/delphi/extraGcc/sumo/tests/../tests/complex/traci/pythonApi/rerouting/rerouteParkingArea_end/runner.py", line 25, in <module>
>     import libsumo as traci  # noqa
>   File "/home/delphi/extraGcc/sumo/tools/libsumo/__init__.py", line 15, in <module>
>     from .libsumo import *  # noqa
>   File "/home/delphi/extraGcc/sumo/tools/libsumo/libsumo.py", line 17, in <module>
>     _libsumo = swig_import_helper()
>   File "/home/delphi/extraGcc/sumo/tools/libsumo/libsumo.py", line 16, in swig_import_helper
>     return importlib.import_module('_libsumo')
>   File "/usr/lib/python3.6/importlib/__init__.py", line 126, in import_module
>     return _bootstrap._gcd_import(name[level:], package, level)
> ModuleNotFoundError: No module named '_libsumo'
---------- Differences in output ----------
1d0
< Loading configuration... done.
---------- Missing result in vehroutes ----------
<?xml version="1.0" encoding="UTF-8"?>


<routes xmlns:xsi="http://www.w3.org/2001/XMLSchema-instance" xsi:noNamespaceSchemaLocation="http://sumo.dlr.de/xsd/routes_file.xsd">
    <vehicle id="ego" depart="triggered" arrivalPos="55.00" arrival="37.00">
        <routeDistribution>
            <route replacedOnEdge="A0A1" reason="TraCI:parkingAreaReroute" replacedAtTime="1.00" probability="0" edges="A0A1 A1A2"/>
            <route edges="A0A1 A1B1 B1B2"/>
        </routeDistribution>
        <stop parkingArea="parkB1B2" duration="10.00"/>
    </vehicle>

    <person id="p0" depart="0.00" arrival="173.00">
        <ride from="A0A1" to="B1B2" busStop="parkB1B2" lines="ego"/>
        <walk edges="B1B2 B3B2 A3B3"/>
    </person>

</routes>

TEST FAILED on ts-sim-build-ba : traci pythonApi rerouting rerouteTraveltime_adaptEdgeWeight ( Last six runs Jul2019 )

---------- Differences in errors ----------
0a1,28
> Traceback (most recent call last):
>   File "/home/delphi/extraGcc/sumo/tools/libsumo/libsumo.py", line 14, in swig_import_helper
>     return importlib.import_module(mname)
>   File "/usr/lib/python3.6/importlib/__init__.py", line 126, in import_module
>     return _bootstrap._gcd_import(name[level:], package, level)
>   File "<frozen importlib._bootstrap>", line 994, in _gcd_import
>   File "<frozen importlib._bootstrap>", line 971, in _find_and_load
>   File "<frozen importlib._bootstrap>", line 955, in _find_and_load_unlocked
>   File "<frozen importlib._bootstrap>", line 658, in _load_unlocked
>   File "<frozen importlib._bootstrap>", line 571, in module_from_spec
>   File "<frozen importlib._bootstrap_external>", line 922, in create_module
>   File "<frozen importlib._bootstrap>", line 219, in _call_with_frames_removed
> ImportError: dynamic module does not define module export function (PyInit__libsumo)
> 
> During handling of the above exception, another exception occurred:
> 
> Traceback (most recent call last):
>   File "/home/delphi/extraGcc/sumo/tests/../tests/complex/traci/pythonApi/rerouting/rerouteTraveltime_adaptEdgeWeight/runner.py", line 25, in <module>
>     import libsumo as traci  # noqa
>   File "/home/delphi/extraGcc/sumo/tools/libsumo/__init__.py", line 15, in <module>
>     from .libsumo import *  # noqa
>   File "/home/delphi/extraGcc/sumo/tools/libsumo/libsumo.py", line 17, in <module>
>     _libsumo = swig_import_helper()
>   File "/home/delphi/extraGcc/sumo/tools/libsumo/libsumo.py", line 16, in swig_import_helper
>     return importlib.import_module('_libsumo')
>   File "/usr/lib/python3.6/importlib/__init__.py", line 126, in import_module
>     return _bootstrap._gcd_import(name[level:], package, level)
> ModuleNotFoundError: No module named '_libsumo'
---------- Differences in output ----------
1,7d0
< Loading configuration... done.
< edge=middle current=7.19942404608 adapted=-1.0
< edge=middle2 current=14.3988480922 adapted=-1.0
< edge=middle3 current=28.7976961843 adapted=-1.0
< edge=middle current=7.19942404608 adapted=20.0
< edge=middle2 current=14.3988480922 adapted=-1.0
< edge=middle3 current=28.7976961843 adapted=10.0
---------- Missing result in vehroutes ----------
<?xml version="1.0" encoding="UTF-8"?>


<routes xmlns:xsi="http://www.w3.org/2001/XMLSchema-instance" xsi:noNamespaceSchemaLocation="http://sumo.dlr.de/xsd/routes_file.xsd">
    <vehicle id="ego" depart="0.00" arrival="46.00">
        <routeDistribution>
            <route replacedOnEdge="beg" reason="traci:rerouteTraveltime" replacedAtTime="1.00" probability="0" edges="beg middle2 end"/>
            <route edges="beg middle3 end"/>
        </routeDistribution>
    </vehicle>

</routes>

TEST FAILED on ts-sim-build-ba : traci pythonApi rerouting rerouteTraveltime_adaptEdgeWeight_varyWithTime ( Last six runs Jul2019 )

---------- Differences in errors ----------
0a1,28
> Traceback (most recent call last):
>   File "/home/delphi/extraGcc/sumo/tools/libsumo/libsumo.py", line 14, in swig_import_helper
>     return importlib.import_module(mname)
>   File "/usr/lib/python3.6/importlib/__init__.py", line 126, in import_module
>     return _bootstrap._gcd_import(name[level:], package, level)
>   File "<frozen importlib._bootstrap>", line 994, in _gcd_import
>   File "<frozen importlib._bootstrap>", line 971, in _find_and_load
>   File "<frozen importlib._bootstrap>", line 955, in _find_and_load_unlocked
>   File "<frozen importlib._bootstrap>", line 658, in _load_unlocked
>   File "<frozen importlib._bootstrap>", line 571, in module_from_spec
>   File "<frozen importlib._bootstrap_external>", line 922, in create_module
>   File "<frozen importlib._bootstrap>", line 219, in _call_with_frames_removed
> ImportError: dynamic module does not define module export function (PyInit__libsumo)
> 
> During handling of the above exception, another exception occurred:
> 
> Traceback (most recent call last):
>   File "/home/delphi/extraGcc/sumo/tests/../tests/complex/traci/pythonApi/rerouting/rerouteTraveltime_adaptEdgeWeight_varyWithTime/runner.py", line 25, in <module>
>     import libsumo as traci  # noqa
>   File "/home/delphi/extraGcc/sumo/tools/libsumo/__init__.py", line 15, in <module>
>     from .libsumo import *  # noqa
>   File "/home/delphi/extraGcc/sumo/tools/libsumo/libsumo.py", line 17, in <module>
>     _libsumo = swig_import_helper()
>   File "/home/delphi/extraGcc/sumo/tools/libsumo/libsumo.py", line 16, in swig_import_helper
>     return importlib.import_module('_libsumo')
>   File "/usr/lib/python3.6/importlib/__init__.py", line 126, in import_module
>     return _bootstrap._gcd_import(name[level:], package, level)
> ModuleNotFoundError: No module named '_libsumo'
---------- Differences in output ----------
1,7d0
< Loading configuration... done.
< edge=middle current=7.19942404608 adapted=-1.0
< edge=middle2 current=14.3988480922 adapted=-1.0
< edge=middle3 current=28.7976961843 adapted=-1.0
< edge=middle current=7.19942404608 adapted=-1.0
< edge=middle2 current=14.3988480922 adapted=-1.0
< edge=middle3 current=28.7976961843 adapted=-1.0
---------- Missing result in vehroutes ----------
<?xml version="1.0" encoding="UTF-8"?>


<routes xmlns:xsi="http://www.w3.org/2001/XMLSchema-instance" xsi:noNamespaceSchemaLocation="http://sumo.dlr.de/xsd/routes_file.xsd">
    <vehicle id="ego" depart="0.00" arrival="419.00">
        <routeDistribution>
            <route replacedOnEdge="beg" reason="traci:rerouteTraveltime" replacedAtTime="1.00" probability="0" edges="beg middle2 end"/>
            <route edges="beg middle3 end"/>
        </routeDistribution>
    </vehicle>

</routes>

TEST FAILED on ts-sim-build-ba : traci pythonApi rerouting rerouteTraveltime_adaptVehicleEdgeWeight ( Last six runs Jul2019 )

---------- Differences in errors ----------
0a1,28
> Traceback (most recent call last):
>   File "/home/delphi/extraGcc/sumo/tools/libsumo/libsumo.py", line 14, in swig_import_helper
>     return importlib.import_module(mname)
>   File "/usr/lib/python3.6/importlib/__init__.py", line 126, in import_module
>     return _bootstrap._gcd_import(name[level:], package, level)
>   File "<frozen importlib._bootstrap>", line 994, in _gcd_import
>   File "<frozen importlib._bootstrap>", line 971, in _find_and_load
>   File "<frozen importlib._bootstrap>", line 955, in _find_and_load_unlocked
>   File "<frozen importlib._bootstrap>", line 658, in _load_unlocked
>   File "<frozen importlib._bootstrap>", line 571, in module_from_spec
>   File "<frozen importlib._bootstrap_external>", line 922, in create_module
>   File "<frozen importlib._bootstrap>", line 219, in _call_with_frames_removed
> ImportError: dynamic module does not define module export function (PyInit__libsumo)
> 
> During handling of the above exception, another exception occurred:
> 
> Traceback (most recent call last):
>   File "/home/delphi/extraGcc/sumo/tests/../tests/complex/traci/pythonApi/rerouting/rerouteTraveltime_adaptVehicleEdgeWeight/runner.py", line 25, in <module>
>     import libsumo as traci  # noqa
>   File "/home/delphi/extraGcc/sumo/tools/libsumo/__init__.py", line 15, in <module>
>     from .libsumo import *  # noqa
>   File "/home/delphi/extraGcc/sumo/tools/libsumo/libsumo.py", line 17, in <module>
>     _libsumo = swig_import_helper()
>   File "/home/delphi/extraGcc/sumo/tools/libsumo/libsumo.py", line 16, in swig_import_helper
>     return importlib.import_module('_libsumo')
>   File "/usr/lib/python3.6/importlib/__init__.py", line 126, in import_module
>     return _bootstrap._gcd_import(name[level:], package, level)
> ModuleNotFoundError: No module named '_libsumo'
---------- Differences in output ----------
1d0
< Loading configuration... done.
---------- Missing result in vehroutes ----------
<?xml version="1.0" encoding="UTF-8"?>


<routes xmlns:xsi="http://www.w3.org/2001/XMLSchema-instance" xsi:noNamespaceSchemaLocation="http://sumo.dlr.de/xsd/routes_file.xsd">
    <vehicle id="ego" depart="0.00" arrival="46.00">
        <routeDistribution>
            <route replacedOnEdge="beg" reason="traci:rerouteTraveltime" replacedAtTime="1.00" probability="0" edges="beg middle2 end"/>
            <route edges="beg middle3 end"/>
        </routeDistribution>
    </vehicle>

</routes>

TEST FAILED on ts-sim-build-ba : traci pythonApi rerouting rerouteTraveltime_default ( Last six runs Jul2019 )

---------- Differences in errors ----------
0a1,28
> Traceback (most recent call last):
>   File "/home/delphi/extraGcc/sumo/tools/libsumo/libsumo.py", line 14, in swig_import_helper
>     return importlib.import_module(mname)
>   File "/usr/lib/python3.6/importlib/__init__.py", line 126, in import_module
>     return _bootstrap._gcd_import(name[level:], package, level)
>   File "<frozen importlib._bootstrap>", line 994, in _gcd_import
>   File "<frozen importlib._bootstrap>", line 971, in _find_and_load
>   File "<frozen importlib._bootstrap>", line 955, in _find_and_load_unlocked
>   File "<frozen importlib._bootstrap>", line 658, in _load_unlocked
>   File "<frozen importlib._bootstrap>", line 571, in module_from_spec
>   File "<frozen importlib._bootstrap_external>", line 922, in create_module
>   File "<frozen importlib._bootstrap>", line 219, in _call_with_frames_removed
> ImportError: dynamic module does not define module export function (PyInit__libsumo)
> 
> During handling of the above exception, another exception occurred:
> 
> Traceback (most recent call last):
>   File "/home/delphi/extraGcc/sumo/tests/../tests/complex/traci/pythonApi/rerouting/rerouteTraveltime_default/runner.py", line 25, in <module>
>     import libsumo as traci  # noqa
>   File "/home/delphi/extraGcc/sumo/tools/libsumo/__init__.py", line 15, in <module>
>     from .libsumo import *  # noqa
>   File "/home/delphi/extraGcc/sumo/tools/libsumo/libsumo.py", line 17, in <module>
>     _libsumo = swig_import_helper()
>   File "/home/delphi/extraGcc/sumo/tools/libsumo/libsumo.py", line 16, in swig_import_helper
>     return importlib.import_module('_libsumo')
>   File "/usr/lib/python3.6/importlib/__init__.py", line 126, in import_module
>     return _bootstrap._gcd_import(name[level:], package, level)
> ModuleNotFoundError: No module named '_libsumo'
---------- Differences in output ----------
1d0
< Loading configuration... done.
---------- Missing result in vehroutes ----------
<?xml version="1.0" encoding="UTF-8"?>


<routes xmlns:xsi="http://www.w3.org/2001/XMLSchema-instance" xsi:noNamespaceSchemaLocation="http://sumo.dlr.de/xsd/routes_file.xsd">
    <vehicle id="ego" depart="0.00" arrival="24.00">
        <routeDistribution>
            <route replacedOnEdge="beg" reason="traci:rerouteTraveltime" replacedAtTime="1.00" probability="0" edges="beg middle2 end"/>
            <route edges="beg middle end"/>
        </routeDistribution>
    </vehicle>

</routes>

TEST FAILED on ts-sim-build-ba : traci pythonApi rerouting routingMode rerouteTraveltime_aggregated ( Last six runs Jul2019 )

---------- Differences in errors ----------
0a1,28
> Traceback (most recent call last):
>   File "/home/delphi/extraGcc/sumo/tools/libsumo/libsumo.py", line 14, in swig_import_helper
>     return importlib.import_module(mname)
>   File "/usr/lib/python3.6/importlib/__init__.py", line 126, in import_module
>     return _bootstrap._gcd_import(name[level:], package, level)
>   File "<frozen importlib._bootstrap>", line 994, in _gcd_import
>   File "<frozen importlib._bootstrap>", line 971, in _find_and_load
>   File "<frozen importlib._bootstrap>", line 955, in _find_and_load_unlocked
>   File "<frozen importlib._bootstrap>", line 658, in _load_unlocked
>   File "<frozen importlib._bootstrap>", line 571, in module_from_spec
>   File "<frozen importlib._bootstrap_external>", line 922, in create_module
>   File "<frozen importlib._bootstrap>", line 219, in _call_with_frames_removed
> ImportError: dynamic module does not define module export function (PyInit__libsumo)
> 
> During handling of the above exception, another exception occurred:
> 
> Traceback (most recent call last):
>   File "/home/delphi/extraGcc/sumo/tests/../tests/complex/traci/pythonApi/rerouting/routingMode/rerouteTraveltime_aggregated/runner.py", line 25, in <module>
>     import libsumo as traci  # noqa
>   File "/home/delphi/extraGcc/sumo/tools/libsumo/__init__.py", line 15, in <module>
>     from .libsumo import *  # noqa
>   File "/home/delphi/extraGcc/sumo/tools/libsumo/libsumo.py", line 17, in <module>
>     _libsumo = swig_import_helper()
>   File "/home/delphi/extraGcc/sumo/tools/libsumo/libsumo.py", line 16, in swig_import_helper
>     return importlib.import_module('_libsumo')
>   File "/usr/lib/python3.6/importlib/__init__.py", line 126, in import_module
>     return _bootstrap._gcd_import(name[level:], package, level)
> ModuleNotFoundError: No module named '_libsumo'
---------- Differences in output ----------
1,11d0
< Loading configuration... done.
< step=1 rerouted=flow.0
< step=11 rerouted=flow.1
< step=21 rerouted=flow.2
< step=31 rerouted=flow.3
< step=41 rerouted=flow.4
< step=51 rerouted=flow.5
< step=61 rerouted=flow.6
< step=71 rerouted=flow.7
< step=81 rerouted=flow.8
< step=91 rerouted=flow.9
---------- Missing result in vehroutes ----------
<?xml version="1.0" encoding="UTF-8"?>


<routes xmlns:xsi="http://www.w3.org/2001/XMLSchema-instance" xsi:noNamespaceSchemaLocation="http://sumo.dlr.de/xsd/routes_file.xsd">
    <vehicle id="flow.0" depart="0.00" arrival="48.00">
        <routeDistribution>
            <route replacedOnEdge="beg" reason="traci:rerouteTraveltime" replacedAtTime="1.00" probability="0" edges="beg detour end"/>
            <route edges="beg middle middle2 end"/>
        </routeDistribution>
    </vehicle>

    <vehicle id="flow.1" depart="10.00" arrival="50.00">
        <routeDistribution>
            <route replacedOnEdge="beg" reason="traci:rerouteTraveltime" replacedAtTime="11.00" probability="0" edges="beg detour end"/>
            <route edges="beg middle middle2 end"/>
        </routeDistribution>
    </vehicle>

    <vehicle id="flow.2" depart="20.00" arrival="52.00">
        <routeDistribution>
            <route replacedOnEdge="beg" reason="traci:rerouteTraveltime" replacedAtTime="21.00" probability="0" edges="beg detour end"/>
            <route edges="beg middle middle2 end"/>
        </routeDistribution>
    </vehicle>

    <vehicle id="flow.3" depart="30.00" arrival="81.00">
        <routeDistribution>
            <route replacedOnEdge="beg" reason="traci:rerouteTraveltime" replacedAtTime="31.00" probability="0" edges="beg detour end"/>
            <route edges="beg middle middle2 end"/>
        </routeDistribution>
<truncated after showing first 30 lines>

TEST FAILED on ts-sim-build-ba : traci pythonApi rerouting routingMode rerouteTraveltime_default ( Last six runs Jul2019 )

---------- Differences in errors ----------
0a1,28
> Traceback (most recent call last):
>   File "/home/delphi/extraGcc/sumo/tools/libsumo/libsumo.py", line 14, in swig_import_helper
>     return importlib.import_module(mname)
>   File "/usr/lib/python3.6/importlib/__init__.py", line 126, in import_module
>     return _bootstrap._gcd_import(name[level:], package, level)
>   File "<frozen importlib._bootstrap>", line 994, in _gcd_import
>   File "<frozen importlib._bootstrap>", line 971, in _find_and_load
>   File "<frozen importlib._bootstrap>", line 955, in _find_and_load_unlocked
>   File "<frozen importlib._bootstrap>", line 658, in _load_unlocked
>   File "<frozen importlib._bootstrap>", line 571, in module_from_spec
>   File "<frozen importlib._bootstrap_external>", line 922, in create_module
>   File "<frozen importlib._bootstrap>", line 219, in _call_with_frames_removed
> ImportError: dynamic module does not define module export function (PyInit__libsumo)
> 
> During handling of the above exception, another exception occurred:
> 
> Traceback (most recent call last):
>   File "/home/delphi/extraGcc/sumo/tests/../tests/complex/traci/pythonApi/rerouting/routingMode/rerouteTraveltime_default/runner.py", line 25, in <module>
>     import libsumo as traci  # noqa
>   File "/home/delphi/extraGcc/sumo/tools/libsumo/__init__.py", line 15, in <module>
>     from .libsumo import *  # noqa
>   File "/home/delphi/extraGcc/sumo/tools/libsumo/libsumo.py", line 17, in <module>
>     _libsumo = swig_import_helper()
>   File "/home/delphi/extraGcc/sumo/tools/libsumo/libsumo.py", line 16, in swig_import_helper
>     return importlib.import_module('_libsumo')
>   File "/usr/lib/python3.6/importlib/__init__.py", line 126, in import_module
>     return _bootstrap._gcd_import(name[level:], package, level)
> ModuleNotFoundError: No module named '_libsumo'
---------- Differences in output ----------
1,11d0
< Loading configuration... done.
< step=1 rerouted=flow.0
< step=11 rerouted=flow.1
< step=21 rerouted=flow.2
< step=31 rerouted=flow.3
< step=41 rerouted=flow.4
< step=51 rerouted=flow.5
< step=61 rerouted=flow.6
< step=71 rerouted=flow.7
< step=81 rerouted=flow.8
< step=91 rerouted=flow.9
---------- Missing result in vehroutes ----------
<?xml version="1.0" encoding="UTF-8"?>


<routes xmlns:xsi="http://www.w3.org/2001/XMLSchema-instance" xsi:noNamespaceSchemaLocation="http://sumo.dlr.de/xsd/routes_file.xsd">
    <vehicle id="flow.0" depart="0.00" arrival="48.00">
        <routeDistribution>
            <route replacedOnEdge="beg" reason="traci:rerouteTraveltime" replacedAtTime="1.00" probability="0" edges="beg detour end"/>
            <route edges="beg middle middle2 end"/>
        </routeDistribution>
    </vehicle>

    <vehicle id="flow.1" depart="10.00" arrival="50.00">
        <routeDistribution>
            <route replacedOnEdge="beg" reason="traci:rerouteTraveltime" replacedAtTime="11.00" probability="0" edges="beg detour end"/>
            <route edges="beg middle middle2 end"/>
        </routeDistribution>
    </vehicle>

    <vehicle id="flow.2" depart="20.00" arrival="80.00">
        <route edges="beg detour end"/>
    </vehicle>

    <vehicle id="flow.4" depart="40.00" arrival="81.00">
        <routeDistribution>
            <route replacedOnEdge="beg" reason="traci:rerouteTraveltime" replacedAtTime="41.00" probability="0" edges="beg detour end"/>
            <route edges="beg middle middle2 end"/>
        </routeDistribution>
    </vehicle>

    <vehicle id="flow.5" depart="50.00" arrival="83.00">
<truncated after showing first 30 lines>

TEST FAILED on ts-sim-build-ba : traci pythonApi route ( Last six runs Jul2019 )

---------- Differences in errors ----------
1c1,28
< Error: Cannot add route 'empty' without edges.
---
> Traceback (most recent call last):
>   File "/home/delphi/extraGcc/sumo/tools/libsumo/libsumo.py", line 14, in swig_import_helper
>     return importlib.import_module(mname)
>   File "/usr/lib/python3.6/importlib/__init__.py", line 126, in import_module
>     return _bootstrap._gcd_import(name[level:], package, level)
>   File "<frozen importlib._bootstrap>", line 994, in _gcd_import
>   File "<frozen importlib._bootstrap>", line 971, in _find_and_load
>   File "<frozen importlib._bootstrap>", line 955, in _find_and_load_unlocked
>   File "<frozen importlib._bootstrap>", line 658, in _load_unlocked
>   File "<frozen importlib._bootstrap>", line 571, in module_from_spec
>   File "<frozen importlib._bootstrap_external>", line 922, in create_module
>   File "<frozen importlib._bootstrap>", line 219, in _call_with_frames_removed
> ImportError: dynamic module does not define module export function (PyInit__libsumo)
> 
> During handling of the above exception, another exception occurred:
> 
> Traceback (most recent call last):
>   File "/home/delphi/extraGcc/sumo/tests/../tests/complex/traci/pythonApi/route/runner.py", line 26, in <module>
>     import libsumo as traci  # noqa
>   File "/home/delphi/extraGcc/sumo/tools/libsumo/__init__.py", line 15, in <module>
>     from .libsumo import *  # noqa
>   File "/home/delphi/extraGcc/sumo/tools/libsumo/libsumo.py", line 17, in <module>
>     _libsumo = swig_import_helper()
>   File "/home/delphi/extraGcc/sumo/tools/libsumo/libsumo.py", line 16, in swig_import_helper
>     return importlib.import_module('_libsumo')
>   File "/usr/lib/python3.6/importlib/__init__.py", line 126, in import_module
>     return _bootstrap._gcd_import(name[level:], package, level)
<truncated after showing first 30 lines>
---------- Differences in output ----------
1,18d0
< Loading configuration... done.
< step 0
< step 1
< step 2
< routes ('horizontal', 'vertical', 'withTaz2')
< route count 3
< examining horizontal
< edges ('2fi', '2si', '1o', '1fi', '1si', '3o', '3fi', '3si', '4o', '4fi', '4si')
< {0: ('horizontal', 'vertical', 'withTaz2')}
< step 3
< {0: ('horizontal', 'vertical', 'withTaz2')}
< step 4
< {0: ('horizontal', 'vertical', 'withTaz2')}
< step 5
< {0: ('horizontal', 'vertical', 'withTaz2')}
< routes ('h2', 'horizontal', 'vertical', 'withTaz', 'withTaz2')
< edges ('1o',)
< edges ('taz12-source', 'taz34-sink')

TEST FAILED on ts-sim-build-ba : traci pythonApi simulation ( Last six runs Jul2019 )

---------- Differences in errors ----------
1,16c1,28
< Warning: Value of tau=0.1 in car following model 'carFollowing-Krauss' lower than simulation step size may cause collisions
< Error: Parameter 'foo.bla' is not supported.
< Error: Invalid chargingStation parameter 'bla'
< Error: Invalid chargingStation 'foo'
< Error: Unknown bus stop 'foo'.
< Error: Unknown from edge 'foo'.
< Error: Invalid departure edge for vehicle type 'DEFAULT_VEHTYPE' (Vehicle '' is not allowed to depart on any lane of its first edge.)
< Error: Unknown from edge 'foo'.
< Warning: Ignoring vehicle type 'DEFAULT_BIKETYPE' when performing intermodal routing because it is not allowed on the start edge 'footpath'.
< Warning: Ignoring vehicle type 'DEFAULT_BIKETYPE' when performing intermodal routing because it is not allowed on the start edge 'footpath'.
< Warning: Teleporting vehicle 'collider'; collision with vehicle 'suddenStop', lane='o_0', gap=-1.36, time=13.00 stage=move.
< Warning: Vehicle 'collider' teleports beyond arrival edge 'o', time 13.00.
< Warning: Vehicle 'emergencyStopper' performs emergency stop at the end of lane 'o_0' because there is no connection to the next edge (decel=-100.00, offset=68.12), time=16.00.
< Warning: Vehicle 'emergencyStopper' performs emergency stop at the end of lane 'o_0' because there is no connection to the next edge (decel=0.00, offset=100.00), time=17.00.
< Error: Requested command not implemented (0xac): GUI is not running, command not implemented in command line sumo
< Warning: Vehicle 'emergencyStopper' performs emergency stop at the end of lane 'o_0' because there is no connection to the next edge (decel=0.00, offset=100.00), time=18.00.
---
> Traceback (most recent call last):
>   File "/home/delphi/extraGcc/sumo/tools/libsumo/libsumo.py", line 14, in swig_import_helper
>     return importlib.import_module(mname)
>   File "/usr/lib/python3.6/importlib/__init__.py", line 126, in import_module
>     return _bootstrap._gcd_import(name[level:], package, level)
>   File "<frozen importlib._bootstrap>", line 994, in _gcd_import
>   File "<frozen importlib._bootstrap>", line 971, in _find_and_load
>   File "<frozen importlib._bootstrap>", line 955, in _find_and_load_unlocked
>   File "<frozen importlib._bootstrap>", line 658, in _load_unlocked
>   File "<frozen importlib._bootstrap>", line 571, in module_from_spec
>   File "<frozen importlib._bootstrap_external>", line 922, in create_module
>   File "<frozen importlib._bootstrap>", line 219, in _call_with_frames_removed
<truncated after showing first 30 lines>
---------- Differences in output ----------
1,184d0
< Loading configuration... done.
< {114: ('horiz', 'horiz1'), 116: ()}
< step 0
< {114: (), 116: ('horiz',)}
< step 1
< {114: (), 116: ()}
< step 2
< {114: (), 116: ()}
< step 3
< {114: (), 116: ()}
< step 4
< {114: (), 116: ()}
< step 5
< {114: ('horiz2', 'suddenStop', 'collider', 'emergencyStopper'), 116: ('horiz1',)}
< time 6000
< #loaded 4
< loaded ('horiz2', 'suddenStop', 'collider', 'emergencyStopper')
< #departed 1
< departed ('horiz1',)
< #arrived 0
< arrived ()
< #parkstart 0
< parkstart ()
< #parkend 0
< parkend ()
< #stopstart 0
< stopstart ()
< #stopend 0
< stopend ()
<truncated after showing first 30 lines>
---------- Missing result in state ----------
<?xml version="1.0" encoding="UTF-8"?>


<snapshot xmlns:xsi="http://www.w3.org/2001/XMLSchema-instance" xsi:noNamespaceSchemaLocation="http://sumo.dlr.de/xsd/state_file.xsd" version="<version>" time="6.00">
    <route id="broken" state="1" edges="o o"/>
    <route id="horizontal" state="1" edges="o"/>
    <delay number="2" begin="6" end="1" depart="0.00" time="0.00"/>
    <vType id="DEFAULT_BIKETYPE" vClass="bicycle"/>
    <vType id="DEFAULT_PEDTYPE" vClass="pedestrian"/>
    <vType id="DEFAULT_VEHTYPE"/>
    <vType id="badDriver" accel="5" decel="2" tau="0.1"/>
    <vehicle id="collider" type="badDriver" depart="10.00" departSpeed="max" route="horizontal" speedFactor="1.00" state="9223372036854775807 0 -1.00 0 0" pos="0.00" speed="0.00" posLat="0.00"/>
    <vehicle id="emergencyStopper" type="DEFAULT_VEHTYPE" depart="14.00" departPos="5000.00" departSpeed="max" route="broken" speedFactor="1.00" state="9223372036854775807 0 -1.00 0 0" pos="0.00" speed="0.00" posLat="0.00"/>
    <vehicle id="horiz" type="DEFAULT_VEHTYPE" depart="0.00" route="horizontal" speedFactor="1.00" state="0 0 5.10 0 5000" pos="36.07" speed="10.67" posLat="0.00"/>
    <vehicle id="horiz1" type="DEFAULT_VEHTYPE" depart="5.00" route="horizontal" speedFactor="1.00" state="5000 0 5.10 0 6000" pos="5.10" speed="0.00" posLat="0.00"/>
    <vehicle id="suddenStop" type="DEFAULT_VEHTYPE" depart="6.00" route="horizontal" speedFactor="1.00" state="9223372036854775807 0 -1.00 0 0" pos="0.00" speed="0.00" posLat="0.00">
        <stop lane="o_0" startPos="19.80" endPos="20.00" duration="5.00"/>
    </vehicle>
    <lane id=":0_0_0">
        <vehicles value=""/>
    </lane>
    <lane id=":1_0_0">
        <vehicles value=""/>
    </lane>
    <lane id="2o_0">
        <vehicles value=""/>
    </lane>
    <lane id="footpath_0">
        <vehicles value=""/>
    </lane>
<truncated after showing first 30 lines>

TEST FAILED on ts-sim-build-ba : traci pythonApi trafficlight ( Last six runs Jul2019 )

---------- Differences in errors ----------
0a1,28
> Traceback (most recent call last):
>   File "/home/delphi/extraGcc/sumo/tools/libsumo/libsumo.py", line 14, in swig_import_helper
>     return importlib.import_module(mname)
>   File "/usr/lib/python3.6/importlib/__init__.py", line 126, in import_module
>     return _bootstrap._gcd_import(name[level:], package, level)
>   File "<frozen importlib._bootstrap>", line 994, in _gcd_import
>   File "<frozen importlib._bootstrap>", line 971, in _find_and_load
>   File "<frozen importlib._bootstrap>", line 955, in _find_and_load_unlocked
>   File "<frozen importlib._bootstrap>", line 658, in _load_unlocked
>   File "<frozen importlib._bootstrap>", line 571, in module_from_spec
>   File "<frozen importlib._bootstrap_external>", line 922, in create_module
>   File "<frozen importlib._bootstrap>", line 219, in _call_with_frames_removed
> ImportError: dynamic module does not define module export function (PyInit__libsumo)
> 
> During handling of the above exception, another exception occurred:
> 
> Traceback (most recent call last):
>   File "/home/delphi/extraGcc/sumo/tests/../tests/complex/traci/pythonApi/trafficlight/runner.py", line 26, in <module>
>     import libsumo as traci  # noqa
>   File "/home/delphi/extraGcc/sumo/tools/libsumo/__init__.py", line 15, in <module>
>     from .libsumo import *  # noqa
>   File "/home/delphi/extraGcc/sumo/tools/libsumo/libsumo.py", line 17, in <module>
>     _libsumo = swig_import_helper()
>   File "/home/delphi/extraGcc/sumo/tools/libsumo/libsumo.py", line 16, in swig_import_helper
>     return importlib.import_module('_libsumo')
>   File "/usr/lib/python3.6/importlib/__init__.py", line 126, in import_module
>     return _bootstrap._gcd_import(name[level:], package, level)
> ModuleNotFoundError: No module named '_libsumo'
---------- Differences in output ----------
1,37d0
< Loading configuration... done.
< step 0
< step 1
< step 2
< trafficlights deprecated ('0',)
< trafficlight ('0',)
< trafficlight count 1
< examining 0
< ryg rrrrGGggrrrrGGgg
< rygdef [Logic(programID='0', type=0, currentPhaseIndex=0, phases=[Phase(duration=31.0, state='GGggrrrrGGggrrrr', minDur=31.0, maxDur=31.0, next=(), name='major 1'), Phase(duration=4.0, state='yyggrrrryyggrrrr', minDur=4.0, maxDur=4.0, next=(), name='transition 1-2'), Phase(duration=6.0, state='rrGGrrrrrrGGrrrr', minDur=6.0, maxDur=6.0, next=(), name='major 2'), Phase(duration=4.0, state='rryyrrrrrryyrrrr', minDur=4.0, maxDur=4.0, next=(), name='transition 2-3'), Phase(duration=31.0, state='rrr
rGGggrrrrGGgg', minDur=31.0, maxDur=31.0, next=(), name='major 3'), Phase(duration=4.0, state='rrrryyggrrrryygg', minDur=4.0, maxDur=4.0, next=(), name='transition 3-4'), Phase(duration=6.0, state='rrrrrrGGrrrrrrGG', minDur=6.0, maxDur=6.0, next=(), name='major 4'), Phase(duration=4.0, state='rrrrrryyrrrrrryy', minDur=4.0, maxDur=4.0, next=(), name='transition 4-1')], subParameter={}), Logic(programID='custom', type=0, currentPhaseIndex=4, phases=[Phase(duration=30.0, state='rrrrGGggrrrrGGgg', m
inDur=0.0, maxDur=0.0, next=(1, 2, 3), name='setViaComplete'), Phase(duration=10.0, state='rrrrGGggrrrrGGgg', minDur=0.0, maxDur=0.0, next=()), Phase(duration=40.0, state='rrrrGGggrrrrGGgg', minDur=0.0, maxDur=0.0, next=()), Phase(duration=20.0, state='rrrrGGggrrrrGGgg', minDur=0.0, maxDur=0.0, next=()), Phase(duration=20.0, state='rrrrGGggrrrrGGgg', minDur=0.0, maxDur=0.0, next=(), name='setByTraCI'), Phase(duration=20.0, state='rrrrGGggrrrrGGgg', minDur=0.0, maxDur=0.0, next=())], subParameter
={})]
< lanes ('4si_0', '4si_1', '4si_2', '4si_2', '2si_0', '2si_1', '2si_2', '2si_2', '3si_0', '3si_1', '3si_2', '3si_2', '1si_0', '1si_1', '1si_2', '1si_2')
< links [[('4si_0', '1o_0', '')], [('4si_1', '3o_0', '')], [('4si_2', '2o_0', '')], [('4si_2', '4o_0', '')], [('2si_0', '4o_0', '')], [('2si_1', '1o_0', '')], [('2si_2', '3o_0', '')], [('2si_2', '2o_0', '')], [('3si_0', '2o_0', '')], [('3si_1', '4o_0', '')], [('3si_2', '1o_0', '')], [('3si_2', '3o_0', '')], [('1si_0', '3o_0', '')], [('1si_1', '2o_0', '')], [('1si_2', '4o_0', '')], [('1si_2', '1o_0', '')]]
< program custom
< phase 4
< phaseName setByTraCI
< switch 26.0
< numDefs=2 numPhases=[8, 6]
< {0: ('0',)}
< step 3
< {0: ('0',)}
< step 4
< {0: ('0',)}
< step 5
< {0: ('0',)}
< caught Invalid tlsLinkIndex 16 for tls '0' with maximum index 15.
< examining 0
< ryg rrrruGggrrrrGGgg
< rygdef [Logic(programID='0', type=0, currentPhaseIndex=0, phases=[Phase(duration=31.0, state='GGggrrrrGGggrrrr', minDur=31.0, maxDur=31.0, next=(), name='major 1'), Phase(duration=4.0, state='yyggrrrryyggrrrr', minDur=4.0, maxDur=4.0, next=(), name='transition 1-2'), Phase(duration=6.0, state='rrGGrrrrrrGGrrrr', minDur=6.0, maxDur=6.0, next=(), name='major 2'), Phase(duration=4.0, state='rryyrrrrrryyrrrr', minDur=4.0, maxDur=4.0, next=(), name='transition 2-3'), Phase(duration=31.0, state='rrr
rGGggrrrrGGgg', minDur=31.0, maxDur=31.0, next=(), name='major 3'), Phase(duration=4.0, state='rrrryyggrrrryygg', minDur=4.0, maxDur=4.0, next=(), name='transition 3-4'), Phase(duration=6.0, state='rrrrrrGGrrrrrrGG', minDur=6.0, maxDur=6.0, next=(), name='major 4'), Phase(duration=4.0, state='rrrrrryyrrrrrryy', minDur=4.0, maxDur=4.0, next=(), name='transition 4-1')], subParameter={}), Logic(programID='custom', type=0, currentPhaseIndex=4, phases=[Phase(duration=30.0, state='rrrrGGggrrrrGGgg', m
inDur=0.0, maxDur=0.0, next=(1, 2, 3), name='setViaComplete'), Phase(duration=10.0, state='rrrrGGggrrrrGGgg', minDur=0.0, maxDur=0.0, next=()), Phase(duration=40.0, state='rrrrGGggrrrrGGgg', minDur=0.0, maxDur=0.0, next=()), Phase(duration=20.0, state='rrrrGGggrrrrGGgg', minDur=0.0, maxDur=0.0, next=()), Phase(duration=20.0, state='rrrrGGggrrrrGGgg', minDur=0.0, maxDur=0.0, next=(), name='setByTraCI'), Phase(duration=20.0, state='rrrrGGggrrrrGGgg', minDur=0.0, maxDur=0.0, next=())], subParameter
={}), Logic(programID='online', type=0, currentPhaseIndex=0, phases=[Phase(duration=1.0, state='rrrruGggrrrrGGgg', minDur=1.0, maxDur=1.0, next=())], subParameter={})]
< lanes ('4si_0', '4si_1', '4si_2', '4si_2', '2si_0', '2si_1', '2si_2', '2si_2', '3si_0', '3si_1', '3si_2', '3si_2', '1si_0', '1si_1', '1si_2', '1si_2')
<truncated after showing first 30 lines>

TEST FAILED on ts-sim-build-ba : traci pythonApi vehicle ( Last six runs Jul2019 )

---------- Differences in errors ----------
1,13c1,28
< Warning: New value of emergencyDecel (3.00) is lower than decel (4.50)
< Warning: Automatically setting emergencyDecel to 5.10 for vType 'DEFAULT_VEHTYPE@horiz' to match decel.
< Error: Vehicle 'bla' is not known
< Warning: Vehicle '1' aborts stop.
< Error: Vehicle 'anotherOne' is not known
< Warning: Departure time for vehicle 'departInThePast' is in the past; using current time instead.
< Warning: Vehicle 'parking2' aborts stop.
< Warning: Teleporting vehicle 'collider'; collision with vehicle 'blocker', lane='2fi_0', gap=-5.02, time=117.00 stage=events.
< Warning: Vehicle 'collider' ends teleporting on edge '2si', time 118.00.
< Warning: No connection between edge '3fi' and edge 'disconnected' found.
< Warning: No route for vehicle 'failVeh' found.
< Error: Vehicle 'elVeh' does not support device parameter 'device.foo.bar' (No device of type 'foo' exists).
< Error: Vehicle 'elVeh' does not support device parameter 'device.battery.foobar' (Parameter 'foobar' is not supported for device of type 'battery').
---
> Traceback (most recent call last):
>   File "/home/delphi/extraGcc/sumo/tools/libsumo/libsumo.py", line 14, in swig_import_helper
>     return importlib.import_module(mname)
>   File "/usr/lib/python3.6/importlib/__init__.py", line 126, in import_module
>     return _bootstrap._gcd_import(name[level:], package, level)
>   File "<frozen importlib._bootstrap>", line 994, in _gcd_import
>   File "<frozen importlib._bootstrap>", line 971, in _find_and_load
>   File "<frozen importlib._bootstrap>", line 955, in _find_and_load_unlocked
>   File "<frozen importlib._bootstrap>", line 658, in _load_unlocked
>   File "<frozen importlib._bootstrap>", line 571, in module_from_spec
>   File "<frozen importlib._bootstrap_external>", line 922, in create_module
>   File "<frozen importlib._bootstrap>", line 219, in _call_with_frames_removed
> ImportError: dynamic module does not define module export function (PyInit__libsumo)
> 
> During handling of the above exception, another exception occurred:
<truncated after showing first 30 lines>
---------- Differences in output ----------
1,1021d0
< Loading configuration... done.
< step 0.0
< step 1.0
< step 2.0
< vehicles ('horiz',)
< vehicle count 1
< examining horiz
< speed 4.03334372395
< speedLat 0.0
< speed w/o traci 4.03334372395
< acceleration 2.59949394504
< pos (989.4962096581543, 501.65)
< pos3D (989.4962096581543, 501.65, 0.0)
< angle 270.0
< road 2fi
< lane 2fi_0
< laneIndex 0
< type DEFAULT_VEHTYPE
< routeID horizontal
< routeIndex 0
< route ('2fi', '2si', '1o', '1fi', '1si', '3o', '3fi', '3si', '4o', '4fi', '4si')
< lanePos 10.5671935029
< color (255, 255, 0, 255)
< bestLanes (('2fi_0', 3000.0, 0.0, 0, True, ('2fi_0', '2si_1', '1o_0', '1fi_0', '1si_0', '3o_0', '3fi_0', '3si_1', '4o_0')),)
< CO2 4962.09802901
< CO 148.404394312
< HC 0.793287746206
< PMx 0.106890250159
< NOx 2.197042561
<truncated after showing first 30 lines>
---------- Missing result in vehroutes ----------
<?xml version="1.0" encoding="UTF-8"?>


<routes xmlns:xsi="http://www.w3.org/2001/XMLSchema-instance" xsi:noNamespaceSchemaLocation="http://sumo.dlr.de/xsd/routes_file.xsd">
    <vehicle id="1" depart="6.00" arrival="19.00">
        <routeDistribution>
            <route replacedOnEdge="" reason="traci:changeTarget" replacedAtTime="6.00" probability="0" edges="2fi 2si 1o 1fi 1si 3o 3fi 3si 4o 4fi 4si"/>
            <route edges="2fi 2si 4o 4fi"/>
        </routeDistribution>
        <stop lane="2fi_0" startPos="49.90" endPos="50.00" duration="1.00" parking="1"/>
    </vehicle>

    <vehicle id="movedVeh" depart="125.00" arrival="131.00">
        <routeDistribution>
            <route replacedOnEdge="1si" reason="traci:moveToXY" replacedAtTime="126.00" probability="0" edges="3fi 3si 4o"/>
            <route edges="3fi 3si 4o 1si"/>
        </routeDistribution>
    </vehicle>

</routes>

TEST FAILED on ts-sim-build-ba : traci pythonApi vehicle_asl ( Last six runs Jul2019 )

---------- Differences in errors ----------
0a1,28
> Traceback (most recent call last):
>   File "/home/delphi/extraGcc/sumo/tools/libsumo/libsumo.py", line 14, in swig_import_helper
>     return importlib.import_module(mname)
>   File "/usr/lib/python3.6/importlib/__init__.py", line 126, in import_module
>     return _bootstrap._gcd_import(name[level:], package, level)
>   File "<frozen importlib._bootstrap>", line 994, in _gcd_import
>   File "<frozen importlib._bootstrap>", line 971, in _find_and_load
>   File "<frozen importlib._bootstrap>", line 955, in _find_and_load_unlocked
>   File "<frozen importlib._bootstrap>", line 658, in _load_unlocked
>   File "<frozen importlib._bootstrap>", line 571, in module_from_spec
>   File "<frozen importlib._bootstrap_external>", line 922, in create_module
>   File "<frozen importlib._bootstrap>", line 219, in _call_with_frames_removed
> ImportError: dynamic module does not define module export function (PyInit__libsumo)
> 
> During handling of the above exception, another exception occurred:
> 
> Traceback (most recent call last):
>   File "/home/delphi/extraGcc/sumo/tests/../tests/complex/traci/pythonApi/vehicle_asl/runner.py", line 25, in <module>
>     import libsumo as traci  # noqa
>   File "/home/delphi/extraGcc/sumo/tools/libsumo/__init__.py", line 15, in <module>
>     from .libsumo import *  # noqa
>   File "/home/delphi/extraGcc/sumo/tools/libsumo/libsumo.py", line 17, in <module>
>     _libsumo = swig_import_helper()
>   File "/home/delphi/extraGcc/sumo/tools/libsumo/libsumo.py", line 16, in swig_import_helper
>     return importlib.import_module('_libsumo')
>   File "/usr/lib/python3.6/importlib/__init__.py", line 126, in import_module
>     return _bootstrap._gcd_import(name[level:], package, level)
> ModuleNotFoundError: No module named '_libsumo'
---------- Missing result in fcd ----------
<?xml version="1.0" encoding="UTF-8"?>


<fcd-export xmlns:xsi="http://www.w3.org/2001/XMLSchema-instance" xsi:noNamespaceSchemaLocation="http://sumo.dlr.de/xsd/fcd_file.xsd">
    <timestep time="0.00">
        <vehicle id="v0" x="5.10" y="-4.95" angle="90.00" type="t0" speed="0.00" pos="5.10" lane="beg_0" slope="0.00"/>
    </timestep>
    <timestep time="0.10">
        <vehicle id="v0" x="5.11" y="-1.65" angle="90.00" type="t0" speed="0.26" pos="5.11" lane="beg_1" slope="0.00"/>
    </timestep>
    <timestep time="0.20">
        <vehicle id="v0" x="5.15" y="-1.65" angle="90.00" type="t0" speed="0.52" pos="5.15" lane="beg_1" slope="0.00"/>
    </timestep>
    <timestep time="0.30">
        <vehicle id="v0" x="5.22" y="-1.65" angle="90.00" type="t0" speed="0.78" pos="5.22" lane="beg_1" slope="0.00"/>
    </timestep>
    <timestep time="0.40">
        <vehicle id="v0" x="5.31" y="-1.65" angle="90.00" type="t0" speed="1.04" pos="5.31" lane="beg_1" slope="0.00"/>
    </timestep>
    <timestep time="0.50">
        <vehicle id="v0" x="5.42" y="-1.65" angle="90.00" type="t0" speed="1.30" pos="5.42" lane="beg_1" slope="0.00"/>
    </timestep>
    <timestep time="0.60">
        <vehicle id="v0" x="5.57" y="-1.65" angle="90.00" type="t0" speed="1.56" pos="5.57" lane="beg_1" slope="0.00"/>
    </timestep>
    <timestep time="0.70">
        <vehicle id="v0" x="5.74" y="-1.65" angle="90.00" type="t0" speed="1.82" pos="5.74" lane="beg_1" slope="0.00"/>
    </timestep>
    <timestep time="0.80">
        <vehicle id="v0" x="5.93" y="-1.65" angle="90.00" type="t0" speed="2.08" pos="5.93" lane="beg_1" slope="0.00"/>
<truncated after showing first 30 lines>
---------- Missing result in lanechanges ----------
<?xml version="1.0" encoding="UTF-8"?>


<lanechanges>
    <change id="v0" type="t0" time="0.10" from="beg_0" to="beg_1" dir="1" speed="0.26" pos="5.11" reason="traci|urgent" leaderGap="None" leaderSecureGap="None" leaderSpeed="None" followerGap="None" followerSecureGap="None" followerSpeed="None" origLeaderGap="None" origLeaderSecureGap="None" origLeaderSpeed="None"/>
    <change id="v0" type="t0" time="30.60" from="beg_1" to="beg_0" dir="-1" speed="13.89" pos="237.88" reason="traci|urgent" leaderGap="None" leaderSecureGap="None" leaderSpeed="None" followerGap="None" followerSecureGap="None" followerSpeed="None" origLeaderGap="None" origLeaderSecureGap="None" origLeaderSpeed="None"/>
</lanechanges>

TEST FAILED on ts-sim-build-ba : traci pythonApi vehicle_sublane ( Last six runs Jul2019 )

---------- Differences in errors ----------
1,13c1,28
< Warning: New value of emergencyDecel (3.00) is lower than decel (4.50)
< Warning: Automatically setting emergencyDecel to 5.10 for vType 'DEFAULT_VEHTYPE@horiz' to match decel.
< Error: Vehicle 'bla' is not known
< Warning: Vehicle '1' aborts stop.
< Error: Vehicle 'anotherOne' is not known
< Warning: Departure time for vehicle 'departInThePast' is in the past; using current time instead.
< Warning: Vehicle 'parking2' aborts stop.
< Warning: Teleporting vehicle 'collider'; collision with vehicle 'blocker', lane='2fi_0', gap=-5.02', latGap=-1.80, time=117.00 stage=events.
< Warning: Vehicle 'collider' ends teleporting on edge '2si', time 118.00.
< Warning: No connection between edge '3fi' and edge 'disconnected' found.
< Warning: No route for vehicle 'failVeh' found.
< Error: Vehicle 'elVeh' does not support device parameter 'device.foo.bar' (No device of type 'foo' exists).
< Error: Vehicle 'elVeh' does not support device parameter 'device.battery.foobar' (Parameter 'foobar' is not supported for device of type 'battery').
---
> Traceback (most recent call last):
>   File "/home/delphi/extraGcc/sumo/tools/libsumo/libsumo.py", line 14, in swig_import_helper
>     return importlib.import_module(mname)
>   File "/usr/lib/python3.6/importlib/__init__.py", line 126, in import_module
>     return _bootstrap._gcd_import(name[level:], package, level)
>   File "<frozen importlib._bootstrap>", line 994, in _gcd_import
>   File "<frozen importlib._bootstrap>", line 971, in _find_and_load
>   File "<frozen importlib._bootstrap>", line 955, in _find_and_load_unlocked
>   File "<frozen importlib._bootstrap>", line 658, in _load_unlocked
>   File "<frozen importlib._bootstrap>", line 571, in module_from_spec
>   File "<frozen importlib._bootstrap_external>", line 922, in create_module
>   File "<frozen importlib._bootstrap>", line 219, in _call_with_frames_removed
> ImportError: dynamic module does not define module export function (PyInit__libsumo)
> 
> During handling of the above exception, another exception occurred:
<truncated after showing first 30 lines>
---------- Differences in output ----------
1,1021d0
< Loading configuration... done.
< step 0.0
< step 1.0
< step 2.0
< vehicles ('horiz',)
< vehicle count 1
< examining horiz
< speed 4.03334372395
< speedLat 0.0
< speed w/o traci 4.03334372395
< acceleration 2.59949394504
< pos (989.4962096581543, 501.65)
< pos3D (989.4962096581543, 501.65, 0.0)
< angle 270.0
< road 2fi
< lane 2fi_0
< laneIndex 0
< type DEFAULT_VEHTYPE
< routeID horizontal
< routeIndex 0
< route ('2fi', '2si', '1o', '1fi', '1si', '3o', '3fi', '3si', '4o', '4fi', '4si')
< lanePos 10.5671935029
< color (255, 255, 0, 255)
< bestLanes (('2fi_0', 3000.0, 0.0, 0, True, ('2fi_0', '2si_1', '1o_0', '1fi_0', '1si_0', '3o_0', '3fi_0', '3si_1', '4o_0')),)
< CO2 4962.09802901
< CO 148.404394312
< HC 0.793287746206
< PMx 0.106890250159
< NOx 2.197042561
<truncated after showing first 30 lines>
---------- Missing result in vehroutes ----------
<?xml version="1.0" encoding="UTF-8"?>


<routes xmlns:xsi="http://www.w3.org/2001/XMLSchema-instance" xsi:noNamespaceSchemaLocation="http://sumo.dlr.de/xsd/routes_file.xsd">
    <vehicle id="1" depart="6.00" arrival="19.00">
        <routeDistribution>
            <route replacedOnEdge="" reason="traci:changeTarget" replacedAtTime="6.00" probability="0" edges="2fi 2si 1o 1fi 1si 3o 3fi 3si 4o 4fi 4si"/>
            <route edges="2fi 2si 4o 4fi"/>
        </routeDistribution>
        <stop lane="2fi_0" startPos="49.90" endPos="50.00" duration="1.00" parking="1"/>
    </vehicle>

    <vehicle id="movedVeh" depart="125.00" arrival="131.00">
        <routeDistribution>
            <route replacedOnEdge="1si" reason="traci:moveToXY" replacedAtTime="126.00" probability="0" edges="3fi 3si 4o"/>
            <route edges="3fi 3si 4o 1si"/>
        </routeDistribution>
    </vehicle>

</routes>

TEST FAILED on ts-sim-build-ba : traci pythonApi vehicle_sublane_asl ( Last six runs Jul2019 )

---------- Differences in errors ----------
0a1,28
> Traceback (most recent call last):
>   File "/home/delphi/extraGcc/sumo/tools/libsumo/libsumo.py", line 14, in swig_import_helper
>     return importlib.import_module(mname)
>   File "/usr/lib/python3.6/importlib/__init__.py", line 126, in import_module
>     return _bootstrap._gcd_import(name[level:], package, level)
>   File "<frozen importlib._bootstrap>", line 994, in _gcd_import
>   File "<frozen importlib._bootstrap>", line 971, in _find_and_load
>   File "<frozen importlib._bootstrap>", line 955, in _find_and_load_unlocked
>   File "<frozen importlib._bootstrap>", line 658, in _load_unlocked
>   File "<frozen importlib._bootstrap>", line 571, in module_from_spec
>   File "<frozen importlib._bootstrap_external>", line 922, in create_module
>   File "<frozen importlib._bootstrap>", line 219, in _call_with_frames_removed
> ImportError: dynamic module does not define module export function (PyInit__libsumo)
> 
> During handling of the above exception, another exception occurred:
> 
> Traceback (most recent call last):
>   File "/home/delphi/extraGcc/sumo/tests/../tests/complex/traci/pythonApi/vehicle_sublane_asl/runner.py", line 25, in <module>
>     import libsumo as traci  # noqa
>   File "/home/delphi/extraGcc/sumo/tools/libsumo/__init__.py", line 15, in <module>
>     from .libsumo import *  # noqa
>   File "/home/delphi/extraGcc/sumo/tools/libsumo/libsumo.py", line 17, in <module>
>     _libsumo = swig_import_helper()
>   File "/home/delphi/extraGcc/sumo/tools/libsumo/libsumo.py", line 16, in swig_import_helper
>     return importlib.import_module('_libsumo')
>   File "/usr/lib/python3.6/importlib/__init__.py", line 126, in import_module
>     return _bootstrap._gcd_import(name[level:], package, level)
> ModuleNotFoundError: No module named '_libsumo'
---------- Missing result in fcd ----------
<?xml version="1.0" encoding="UTF-8"?>


<fcd-export xmlns:xsi="http://www.w3.org/2001/XMLSchema-instance" xsi:noNamespaceSchemaLocation="http://sumo.dlr.de/xsd/fcd_file.xsd">
    <timestep time="0.00">
        <vehicle id="v0" x="5.10" y="-4.95" angle="90.00" type="t0" speed="0.00" pos="5.10" lane="beg_0" slope="0.00"/>
    </timestep>
    <timestep time="0.10">
        <vehicle id="v0" x="5.11" y="-4.94" angle="89.89" type="t0" speed="0.26" pos="5.11" lane="beg_0" slope="0.00"/>
    </timestep>
    <timestep time="0.20">
        <vehicle id="v0" x="5.15" y="-4.92" angle="89.77" type="t0" speed="0.52" pos="5.15" lane="beg_0" slope="0.00"/>
    </timestep>
    <timestep time="0.30">
        <vehicle id="v0" x="5.22" y="-4.89" angle="89.66" type="t0" speed="0.78" pos="5.22" lane="beg_0" slope="0.00"/>
    </timestep>
    <timestep time="0.40">
        <vehicle id="v0" x="5.31" y="-4.85" angle="89.55" type="t0" speed="1.04" pos="5.31" lane="beg_0" slope="0.00"/>
    </timestep>
    <timestep time="0.50">
        <vehicle id="v0" x="5.42" y="-4.80" angle="89.44" type="t0" speed="1.30" pos="5.42" lane="beg_0" slope="0.00"/>
    </timestep>
    <timestep time="0.60">
        <vehicle id="v0" x="5.57" y="-4.74" angle="89.33" type="t0" speed="1.56" pos="5.57" lane="beg_0" slope="0.00"/>
    </timestep>
    <timestep time="0.70">
        <vehicle id="v0" x="5.74" y="-4.67" angle="89.23" type="t0" speed="1.82" pos="5.74" lane="beg_0" slope="0.00"/>
    </timestep>
    <timestep time="0.80">
        <vehicle id="v0" x="5.93" y="-4.59" angle="89.12" type="t0" speed="2.08" pos="5.93" lane="beg_0" slope="0.00"/>
<truncated after showing first 30 lines>
---------- Missing result in lanechanges ----------
<?xml version="1.0" encoding="UTF-8"?>


<lanechanges>
    <changeStarted id="v0" type="t0" time="0.10" from="beg_0" to="beg_0" dir="0" speed="0.26" pos="5.11" reason="traci|urgent" leaderGap="None" leaderSecureGap="None" leaderSpeed="None" followerGap="None" followerSecureGap="None" followerSpeed="None" origLeaderGap="None" origLeaderSecureGap="None" origLeaderSpeed="None" latGap="None" maneuverDistance="2.50"/>
    <changeStarted id="v0" type="t0" time="0.20" from="beg_0" to="beg_0" dir="0" speed="0.52" pos="5.15" reason="traci|urgent" leaderGap="None" leaderSecureGap="None" leaderSpeed="None" followerGap="None" followerSecureGap="None" followerSpeed="None" origLeaderGap="None" origLeaderSecureGap="None" origLeaderSpeed="None" latGap="None" maneuverDistance="2.49"/>
    <changeStarted id="v0" type="t0" time="0.30" from="beg_0" to="beg_0" dir="0" speed="0.78" pos="5.22" reason="traci|urgent" leaderGap="None" leaderSecureGap="None" leaderSpeed="None" followerGap="None" followerSecureGap="None" followerSpeed="None" origLeaderGap="None" origLeaderSecureGap="None" origLeaderSpeed="None" latGap="None" maneuverDistance="2.47"/>
    <changeStarted id="v0" type="t0" time="0.40" from="beg_0" to="beg_0" dir="0" speed="1.04" pos="5.31" reason="traci|urgent" leaderGap="None" leaderSecureGap="None" leaderSpeed="None" followerGap="None" followerSecureGap="None" followerSpeed="None" origLeaderGap="None" origLeaderSecureGap="None" origLeaderSpeed="None" latGap="None" maneuverDistance="2.44"/>
    <changeStarted id="v0" type="t0" time="0.50" from="beg_0" to="beg_0" dir="0" speed="1.30" pos="5.42" reason="traci|urgent" leaderGap="None" leaderSecureGap="None" leaderSpeed="None" followerGap="None" followerSecureGap="None" followerSpeed="None" origLeaderGap="None" origLeaderSecureGap="None" origLeaderSpeed="None" latGap="None" maneuverDistance="2.40"/>
    <changeStarted id="v0" type="t0" time="0.60" from="beg_0" to="beg_0" dir="0" speed="1.56" pos="5.57" reason="traci|urgent" leaderGap="None" leaderSecureGap="None" leaderSpeed="None" followerGap="None" followerSecureGap="None" followerSpeed="None" origLeaderGap="None" origLeaderSecureGap="None" origLeaderSpeed="None" latGap="None" maneuverDistance="2.35"/>
    <changeStarted id="v0" type="t0" time="0.70" from="beg_0" to="beg_0" dir="0" speed="1.82" pos="5.74" reason="traci|urgent" leaderGap="None" leaderSecureGap="None" leaderSpeed="None" followerGap="None" followerSecureGap="None" followerSpeed="None" origLeaderGap="None" origLeaderSecureGap="None" origLeaderSpeed="None" latGap="None" maneuverDistance="2.29"/>
    <changeStarted id="v0" type="t0" time="0.80" from="beg_0" to="beg_0" dir="0" speed="2.08" pos="5.93" reason="traci|urgent" leaderGap="None" leaderSecureGap="None" leaderSpeed="None" followerGap="None" followerSecureGap="None" followerSpeed="None" origLeaderGap="None" origLeaderSecureGap="None" origLeaderSpeed="None" latGap="None" maneuverDistance="2.22"/>
    <changeStarted id="v0" type="t0" time="0.90" from="beg_0" to="beg_0" dir="0" speed="2.34" pos="6.15" reason="traci|urgent" leaderGap="None" leaderSecureGap="None" leaderSpeed="None" followerGap="None" followerSecureGap="None" followerSpeed="None" origLeaderGap="None" origLeaderSecureGap="None" origLeaderSpeed="None" latGap="None" maneuverDistance="2.14"/>
    <changeStarted id="v0" type="t0" time="1.00" from="beg_0" to="beg_0" dir="0" speed="2.60" pos="6.40" reason="traci|urgent" leaderGap="None" leaderSecureGap="None" leaderSpeed="None" followerGap="None" followerSecureGap="None" followerSpeed="None" origLeaderGap="None" origLeaderSecureGap="None" origLeaderSpeed="None" latGap="None" maneuverDistance="2.05"/>
    <change id="v0" type="t0" time="2.10" from="beg_0" to="beg_1" dir="1" speed="5.46" pos="10.83" reason="traci|sublane" leaderGap="None" leaderSecureGap="None" leaderSpeed="None" followerGap="None" followerSecureGap="None" followerSpeed="None" origLeaderGap="None" origLeaderSecureGap="None" origLeaderSpeed="None" latGap="None"/>
    <change id="v0" type="t0" time="31.90" from="beg_1" to="beg_0" dir="-1" speed="13.89" pos="255.94" reason="traci" leaderGap="None" leaderSecureGap="None" leaderSpeed="None" followerGap="None" followerSecureGap="None" followerSpeed="None" origLeaderGap="None" origLeaderSecureGap="None" origLeaderSpeed="None" latGap="None"/>
    <changeStarted id="v0" type="t0" time="60.60" from="beg_0" to="beg_1" dir="1" speed="13.89" pos="492.78" reason="traci|sublane" leaderGap="None" leaderSecureGap="None" leaderSpeed="None" followerGap="None" followerSecureGap="None" followerSpeed="None" origLeaderGap="None" origLeaderSecureGap="None" origLeaderSpeed="None" latGap="None" maneuverDistance="1.60"/>
    <changeStarted id="v0" type="t0" time="60.70" from="beg_0" to="beg_1" dir="1" speed="13.89" pos="494.17" reason="traci|sublane" leaderGap="None" leaderSecureGap="None" leaderSpeed="None" followerGap="None" followerSecureGap="None" followerSpeed="None" origLeaderGap="None" origLeaderSecureGap="None" origLeaderSpeed="None" latGap="None" maneuverDistance="1.59"/>
    <changeStarted id="v0" type="t0" time="60.80" from="beg_0" to="beg_1" dir="1" speed="13.89" pos="495.56" reason="traci|sublane" leaderGap="None" leaderSecureGap="None" leaderSpeed="None" followerGap="None" followerSecureGap="None" followerSpeed="None" origLeaderGap="None" origLeaderSecureGap="None" origLeaderSpeed="None" latGap="None" maneuverDistance="1.57"/>
    <changeStarted id="v0" type="t0" time="60.90" from="beg_0" to="beg_1" dir="1" speed="13.89" pos="496.95" reason="traci|sublane" leaderGap="None" leaderSecureGap="None" leaderSpeed="None" followerGap="None" followerSecureGap="None" followerSpeed="None" origLeaderGap="None" origLeaderSecureGap="None" origLeaderSpeed="None" latGap="None" maneuverDistance="1.54"/>
    <changeStarted id="v0" type="t0" time="61.00" from="beg_0" to="beg_1" dir="1" speed="13.89" pos="498.34" reason="traci|sublane" leaderGap="None" leaderSecureGap="None" leaderSpeed="None" followerGap="None" followerSecureGap="None" followerSpeed="None" origLeaderGap="None" origLeaderSecureGap="None" origLeaderSpeed="None" latGap="None" maneuverDistance="1.50"/>
    <change id="v0" type="t0" time="61.90" from="beg_0" to="beg_1" dir="1" speed="13.89" pos="510.84" reason="traci|sublane" leaderGap="None" leaderSecureGap="None" leaderSpeed="None" followerGap="None" followerSecureGap="None" followerSpeed="None" origLeaderGap="None" origLeaderSecureGap="None" origLeaderSpeed="None" latGap="None"/>
</lanechanges>

Detailed information for the tests that had known bugs:

TEST had known bugs (#5180) on ts-sim-build-ba : traci pythonApi getNeighborsSublane ( Last six runs Jul2019 )

#5180
(This bug was triggered by text found in file 'errors' matching '.')
---------- Differences in errors ----------
0a1,28
> Traceback (most recent call last):
>   File "/home/delphi/extraGcc/sumo/tools/libsumo/libsumo.py", line 14, in swig_import_helper
>     return importlib.import_module(mname)
>   File "/usr/lib/python3.6/importlib/__init__.py", line 126, in import_module
>     return _bootstrap._gcd_import(name[level:], package, level)
>   File "<frozen importlib._bootstrap>", line 994, in _gcd_import
>   File "<frozen importlib._bootstrap>", line 971, in _find_and_load
>   File "<frozen importlib._bootstrap>", line 955, in _find_and_load_unlocked
>   File "<frozen importlib._bootstrap>", line 658, in _load_unlocked
>   File "<frozen importlib._bootstrap>", line 571, in module_from_spec
>   File "<frozen importlib._bootstrap_external>", line 922, in create_module
>   File "<frozen importlib._bootstrap>", line 219, in _call_with_frames_removed
> ImportError: dynamic module does not define module export function (PyInit__libsumo)
> 
> During handling of the above exception, another exception occurred:
> 
> Traceback (most recent call last):
>   File "/home/delphi/extraGcc/sumo/tests/../tests/complex/traci/pythonApi/getNeighborsSublane/runner.py", line 27, in <module>
>     import libsumo as traci  # noqa
>   File "/home/delphi/extraGcc/sumo/tools/libsumo/__init__.py", line 15, in <module>
>     from .libsumo import *  # noqa
>   File "/home/delphi/extraGcc/sumo/tools/libsumo/libsumo.py", line 17, in <module>
>     _libsumo = swig_import_helper()
>   File "/home/delphi/extraGcc/sumo/tools/libsumo/libsumo.py", line 16, in swig_import_helper
>     return importlib.import_module('_libsumo')
>   File "/usr/lib/python3.6/importlib/__init__.py", line 126, in import_module
>     return _bootstrap._gcd_import(name[level:], package, level)
> ModuleNotFoundError: No module named '_libsumo'
---------- Differences in output ----------
1,706d0
< Loading configuration... done.
< step 0.0
< step 1.0
< step 2.0
< Neigh infos for ego:
<   rightFollowers:
<   [('r0.0', -0.5680975253693763)]
<   rightLeaders:
<   [('r0.1', -2.3628522372338914), ('r1.0', 25.192665661429057)]
<   leftFollowers:
<   [('l0.0', 0.08090834117028756)]
<   leftLeaders:
<   [('l0.1', -3.7208081589313196), ('l1.0', 25.417226821277293)]
<   rightFollowers (only blocking):
<   []
<   rightLeaders (only blocking):
<   []
<   leftFollowers (only blocking):
<   []
<   leftLeaders (only blocking):
<   []
< step 3.0
< Neigh infos for ego:
<   rightFollowers:
<   [('r0.0', 0.6798052937723682)]
<   rightLeaders:
<   [('r0.1', -1.8616628393996493), ('r1.0', 24.503598213125954)]
<   leftFollowers:
<   [('l0.0', 1.264037448237648)]
<truncated after showing first 30 lines>
---------- Missing result in fcd ----------
<?xml version="1.0" encoding="UTF-8"?>


<fcd-export xmlns:xsi="http://www.w3.org/2001/XMLSchema-instance" xsi:noNamespaceSchemaLocation="http://sumo.dlr.de/xsd/fcd_file.xsd">
    <timestep time="0.00">
        <vehicle id="ego" x="5.10" y="-4.80" angle="90.00" type="t2" speed="0.00" pos="5.10" lane="entry_1" slope="0.00"/>
        <vehicle id="l0.0" x="0.00" y="-2.60" angle="90.00" type="t0" speed="0.00" pos="0.00" lane="entry_2" slope="0.00"/>
        <vehicle id="l0.1" x="10.00" y="-0.60" angle="90.00" type="t1" speed="0.00" pos="10.00" lane="entry_2" slope="0.00"/>
        <vehicle id="l1.0" x="40.00" y="-2.60" angle="90.00" type="t0" speed="0.00" pos="40.00" lane="entry_2" slope="0.00"/>
        <vehicle id="l1.1" x="50.00" y="-0.60" angle="90.00" type="t1" speed="0.00" pos="50.00" lane="entry_2" slope="0.00"/>
        <vehicle id="r0.0" x="0.00" y="-9.00" angle="90.00" type="t0" speed="0.00" pos="0.00" lane="entry_0" slope="0.00"/>
        <vehicle id="r0.1" x="10.00" y="-7.00" angle="90.00" type="t1" speed="0.00" pos="10.00" lane="entry_0" slope="0.00"/>
        <vehicle id="r1.0" x="40.00" y="-9.00" angle="90.00" type="t0" speed="0.00" pos="40.00" lane="entry_0" slope="0.00"/>
        <vehicle id="r1.1" x="50.00" y="-7.00" angle="90.00" type="t1" speed="0.00" pos="50.00" lane="entry_0" slope="0.00"/>
    </timestep>
    <timestep time="1.00">
        <vehicle id="ego" x="7.70" y="-4.80" angle="90.00" type="t2" speed="2.60" pos="7.70" lane="entry_1" slope="0.00"/>
        <vehicle id="l0.0" x="1.58" y="-2.60" angle="90.00" type="t0" speed="1.58" pos="1.58" lane="entry_2" slope="0.00"/>
        <vehicle id="l0.1" x="12.09" y="-0.60" angle="90.00" type="t1" speed="2.09" pos="12.09" lane="entry_2" slope="0.00"/>
        <vehicle id="l1.0" x="41.91" y="-2.60" angle="90.00" type="t0" speed="1.91" pos="41.91" lane="entry_2" slope="0.00"/>
        <vehicle id="l1.1" x="51.75" y="-0.60" angle="90.00" type="t1" speed="1.75" pos="1.75" lane="mid_2" slope="0.00"/>
        <vehicle id="r0.0" x="1.96" y="-9.00" angle="90.00" type="t0" speed="1.96" pos="1.96" lane="entry_0" slope="0.00"/>
        <vehicle id="r0.1" x="12.54" y="-7.00" angle="90.00" type="t1" speed="2.54" pos="12.54" lane="entry_0" slope="0.00"/>
        <vehicle id="r1.0" x="41.67" y="-9.00" angle="90.00" type="t0" speed="1.67" pos="41.67" lane="entry_0" slope="0.00"/>
        <vehicle id="r1.1" x="51.44" y="-7.00" angle="90.00" type="t1" speed="1.44" pos="1.44" lane="mid_0" slope="0.00"/>
    </timestep>
    <timestep time="2.00">
        <vehicle id="ego" x="12.49" y="-4.80" angle="90.00" type="t2" speed="4.79" pos="12.49" lane="entry_1" slope="0.00"/>
        <vehicle id="l0.0" x="4.91" y="-2.60" angle="90.00" type="t0" speed="3.32" pos="4.91" lane="entry_2" slope="0.00"/>
        <vehicle id="l0.1" x="16.27" y="-0.60" angle="90.00" type="t1" speed="4.18" pos="16.27" lane="entry_2" slope="0.00"/>
<truncated after showing first 30 lines>

TEST had known bugs (see #5383) on ts-sim-build-ba : traci pythonApi moveToXY permissions ( Last six runs Jul2019 )

mapping failure
(This bug was triggered by text found in file 'output' matching 'failed')
---------- Differences in output ----------
0a1
> shifted to left lane (permissions) failed: mode=2 x=40, x2=40.0,   y=-1.5, y2=-1.5,   lane=beg_1, lane2=, pos=40, pos2=-1073741824.0   posLat=0.0 posLat2=-1073741824.0

Detailed information for the tests that were terminated before completion:

TEST were terminated before completion (TIMEOUT) on ts-sim-build-ba : traci pythonApi bugs ticket1010 ( Last six runs Jul2019 )

Test exceeded wallclock time limit of 900.0 seconds
---------- Differences in errors ----------
0a1,7
> Traceback (most recent call last):
>     raise FatalTraCIError("connection closed by SUMO")
> traci.exceptions.FatalTraCIError: connection closed by SUMO
> Error in sys.excepthook:
> Traceback (most recent call last):
>     raise FatalTraCIError("connection closed by SUMO")
> traci.exceptions.FatalTraCIError: connection closed by SUMO

meso: 286 tests: 267 succeeded 14 known bugs 5 FAILED

Detailed information for the tests that FAILED:

TEST FAILED on ts-sim-build-ba : netconvert opendrive_roundtrip ( Last six runs Jul2019 )

---------- Differences in net ----------
2078c2078
<         <lane id=":68_0_0" index="0" disallow="pedestrian" speed="3.95" length="4.44" width="3.20" shape="-0.01,349.81 -1.34,349.49 -1.96,348.91 -1.86,348.06 -1.05,346.96"/>
---
>         <lane id=":68_0_0" index="0" disallow="pedestrian" speed="3.96" length="4.46" width="3.20" shape="-0.01,349.81 -1.34,349.48 -1.96,348.89 -1.86,348.04 -1.03,346.94"/>
2499c2499
<         <lane id="-834.0.00_0" index="0" disallow="pedestrian" speed="22.22" length="491.76" width="3.20" shape="-1.05,346.96 4.59,342.24 5.60,341.17 6.74,339.65 8.02,337.87 9.41,336.08 10.95,334.49 12.66,333.44 14.50,332.93 16.43,332.58 18.52,332.34 20.73,332.18 22.99,332.10 25.26,332.07 27.46,332.10 29.53,332.16 31.42,332.25 33.06,332.35 179.17,342.89 180.66,343.00 182.34,343.12 184.18,343.25 186.14,343.38 188.17,343.52 190.24,343.65 192.31,343.79 194.35,343.92 196.30,344.05 198.14,344.17 19
9.83,344.27 201.32,344.36 293.62,349.95 295.12,350.05 296.82,350.17 298.66,350.31 300.62,350.46 302.66,350.63 304.73,350.81 306.81,350.99 308.84,351.18 310.80,351.36 312.64,351.54 314.33,351.72 315.83,351.88 376.55,358.78 378.05,358.96 379.75,359.19 381.58,359.45 383.53,359.75 385.55,360.07 387.61,360.41 389.66,360.76 391.68,361.11 393.62,361.47 395.44,361.82 397.11,362.16 398.59,362.47 481.47,380.90"/>
---
>         <lane id="-834.0.00_0" index="0" disallow="pedestrian" speed="22.22" length="491.73" width="3.20" shape="-1.03,346.94 4.59,342.24 5.60,341.17 6.74,339.65 8.02,337.87 9.41,336.08 10.95,334.49 12.66,333.44 14.50,332.93 16.43,332.58 18.52,332.34 20.73,332.18 22.99,332.10 25.26,332.07 27.46,332.10 29.53,332.16 31.42,332.25 33.06,332.35 179.17,342.89 180.66,343.00 182.34,343.12 184.18,343.25 186.14,343.38 188.17,343.52 190.24,343.65 192.31,343.79 194.35,343.92 196.30,344.05 198.14,344.17 19
9.83,344.27 201.32,344.36 293.62,349.95 295.12,350.05 296.82,350.17 298.66,350.31 300.62,350.46 302.66,350.63 304.73,350.81 306.81,350.99 308.84,351.18 310.80,351.36 312.64,351.54 314.33,351.72 315.83,351.88 376.55,358.78 378.05,358.96 379.75,359.19 381.58,359.45 383.53,359.75 385.55,360.07 387.61,360.41 389.66,360.76 391.68,361.11 393.62,361.47 395.44,361.82 397.11,362.16 398.59,362.47 481.47,380.90"/>
3488c3488
<     <junction id="68" type="priority" x="0.00" y="348.21" incLanes="-884.0.00_0" intLanes=":68_0_0" shape="-2.08,345.73 -0.02,351.41 0.00,348.21">
---
>     <junction id="68" type="priority" x="0.01" y="348.18" incLanes="-884.0.00_0" intLanes=":68_0_0" shape="-0.01,348.17 -2.06,345.71 -0.02,351.41 0.00,348.21">

TEST FAILED on ts-sim-build-ba : state flow ( Last six runs Jul2019 )

---------- Differences in vehroutes ----------
41,44c41
<         <routeDistribution>
<             <route replacedOnEdge="" reason="device.rerouting" replacedAtTime="50.00" probability="0" edges="0/1to1/1 3/1to4/1"/>
<             <route edges="0/1to1/1 1/1to2/1 2/1to3/1 3/1to4/1"/>
<         </routeDistribution>
---
>         <route edges="0/1to1/1 1/1to2/1 2/1to3/1 3/1to4/1"/>
48,51c45
<         <routeDistribution>
<             <route replacedOnEdge="" reason="device.rerouting" replacedAtTime="60.00" probability="0" edges="0/1to1/1 3/1to4/1"/>
<             <route edges="0/1to1/1 1/1to2/1 2/1to3/1 3/1to4/1"/>
<         </routeDistribution>
---
>         <route edges="0/1to1/1 1/1to2/1 2/1to3/1 3/1to4/1"/>
55,58c49
<         <routeDistribution>
<             <route replacedOnEdge="" reason="device.rerouting" replacedAtTime="70.00" probability="0" edges="0/1to1/1 3/1to4/1"/>
<             <route edges="0/1to1/1 1/1to2/1 2/1to3/1 3/1to4/1"/>
<         </routeDistribution>
---
>         <route edges="0/1to1/1 1/1to2/1 2/1to3/1 3/1to4/1"/>
62,65c53
<         <routeDistribution>
<             <route replacedOnEdge="" reason="device.rerouting" replacedAtTime="80.00" probability="0" edges="0/1to1/1 3/1to4/1"/>
<             <route edges="0/1to1/1 1/1to2/1 2/1to3/1 3/1to4/1"/>
<         </routeDistribution>
---
>         <route edges="0/1to1/1 1/1to2/1 2/1to3/1 3/1to4/1"/>
69,72c57
<         <routeDistribution>
<truncated after showing first 30 lines>

TEST FAILED on ts-sim-build-ba : state rerouting ( Last six runs Jul2019 )

---------- Differences in vehroutes ----------
6,9c6
<         <routeDistribution>
<             <route replacedOnEdge="" reason="device.rerouting" replacedAtTime="1.00" probability="0" edges="gneE0 gneE3"/>
<             <route edges="gneE0 gneE1 gneE2 gneE3"/>
<         </routeDistribution>
---
>         <route edges="gneE0 gneE1 gneE2 gneE3"/>
13,16c10
<         <routeDistribution>
<             <route replacedOnEdge="" reason="device.rerouting" replacedAtTime="2.00" probability="0" edges="gneE0 gneE3"/>
<             <route edges="gneE0 gneE1 gneE2 gneE3"/>
<         </routeDistribution>
---
>         <route edges="gneE0 gneE1 gneE2 gneE3"/>
20,23c14
<         <routeDistribution>
<             <route replacedOnEdge="" reason="device.rerouting" replacedAtTime="3.00" probability="0" edges="gneE0 gneE3"/>
<             <route edges="gneE0 gneE1 gneE2 gneE3"/>
<         </routeDistribution>
---
>         <route edges="gneE0 gneE1 gneE2 gneE3"/>
27,30c18
<         <routeDistribution>
<             <route replacedOnEdge="" reason="device.rerouting" replacedAtTime="4.00" probability="0" edges="gneE0 gneE3"/>
<             <route edges="gneE0 gneE1 gneE2 gneE3"/>
<         </routeDistribution>
---
>         <route edges="gneE0 gneE1 gneE2 gneE3"/>
34,37c22
<         <routeDistribution>
<truncated after showing first 30 lines>
---------- Differences in vehroutes2 ----------
115d114
<             <route replacedOnEdge="" reason="device.rerouting" replacedAtTime="290.00" probability="0" edges="gneE0 gneE3"/>
123d121
<             <route replacedOnEdge="" reason="device.rerouting" replacedAtTime="292.00" probability="0" edges="gneE0 gneE3"/>
131d128
<             <route replacedOnEdge="" reason="device.rerouting" replacedAtTime="292.00" probability="0" edges="gneE0 gneE3"/>
139d135
<             <route replacedOnEdge="" reason="device.rerouting" replacedAtTime="294.00" probability="0" edges="gneE0 gneE3"/>
147d142
<             <route replacedOnEdge="" reason="device.rerouting" replacedAtTime="294.00" probability="0" edges="gneE0 gneE3"/>
155d149
<             <route replacedOnEdge="" reason="device.rerouting" replacedAtTime="296.00" probability="0" edges="gneE0 gneE3"/>
163d156
<             <route replacedOnEdge="" reason="device.rerouting" replacedAtTime="296.00" probability="0" edges="gneE0 gneE3"/>
171d163
<             <route replacedOnEdge="" reason="device.rerouting" replacedAtTime="297.00" probability="0" edges="gneE0 gneE3"/>
179d170
<             <route replacedOnEdge="" reason="device.rerouting" replacedAtTime="299.00" probability="0" edges="gneE0 gneE3"/>
187d177
<             <route replacedOnEdge="" reason="device.rerouting" replacedAtTime="299.00" probability="0" edges="gneE0 gneE3"/>
194,197c184
<         <routeDistribution>
<             <route replacedOnEdge="" reason="device.rerouting" replacedAtTime="301.00" probability="0" edges="gneE0 gneE3"/>
<             <route edges="gneE0 gneE4 gneE5 gneE3"/>
<         </routeDistribution>
---
>         <route edges="gneE0 gneE4 gneE5 gneE3"/>
201,204c188
<         <routeDistribution>
<             <route replacedOnEdge="" reason="device.rerouting" replacedAtTime="301.00" probability="0" edges="gneE0 gneE3"/>
<truncated after showing first 30 lines>

TEST FAILED on ts-sim-build-ba : traas api ( Last six runs Jul2019 )

---------- Differences in errors ----------
1,2c1,4
< Note: data/APITest.java uses unchecked or unsafe operations.
< Note: Recompile with -Xlint:unchecked for details.
---
> Traceback (most recent call last):
>   File "/home/delphi/extraGcc/sumo/tests/../tests/complex/traas/api/runner.py", line 30, in <module>
>     assert(os.path.exists(traasJar))
> AssertionError
---------- Differences in output ----------
1,63d0
< findRoute result stage:
<   gneE0
<   -gneE2
<   gneE2
< findIntermodalRoute result stages:
<   gneE0
<   gneE2
< Step 1.0, tlsPhase 0 (North-South)
< Step 2.0, tlsPhase 0 (North-South)
< Step 3.0, tlsPhase 0 (North-South)
< Step 4.0, tlsPhase 0 (North-South)
< Step 5.0, tlsPhase 0 (North-South)
< Step 6.0, tlsPhase 0 (North-South)
< Step 7.0, tlsPhase 0 (North-South)
< Step 8.0, tlsPhase 0 (North-South)
< Step 9.0, tlsPhase 0 (North-South)
< Step 10.0, tlsPhase 0 (North-South)
< Step 11.0, tlsPhase 0 (North-South)
< Step 12.0, tlsPhase 0 (North-South)
< Step 13.0, tlsPhase 0 (North-South)
< Step 14.0, tlsPhase 0 (North-South)
< Step 15.0, tlsPhase 0 (North-South)
< Step 16.0, tlsPhase 0 (North-South)
< Step 17.0, tlsPhase 0 (North-South)
< Step 18.0, tlsPhase 0 (North-South)
< Step 19.0, tlsPhase 0 (North-South)
< Step 20.0, tlsPhase 0 (North-South)
< Step 21.0, tlsPhase 0 (North-South)
< Step 22.0, tlsPhase 0 (North-South)
<truncated after showing first 30 lines>

TEST FAILED on ts-sim-build-ba : tutorial city_mobil ( Last six runs Jul2019 )

---------- Differences in output ----------
4c4
< waiting time (max, mean, dev): True True True
---
> waiting time (max, mean, dev): False True False
22c22
< waiting time (max, mean, dev): True True True
---
> waiting time (max, mean, dev): False True False

Detailed information for the tests that had known bugs:

TEST had known bugs (bug 1691 (NONEXISTENT)) on ts-sim-build-ba : netconvert dlr-navteq_roundtrip ( Last six runs Jul2019 )

Failed to open URL 'https://sumo.dlr.de/trac.wsgi/ticket/1691?format=tab': HTTP Error 404: Not Found.

Please make sure that bug 1691 exists
and that the configuration entry 'bug_system_location' points to the correct trac instance.
The current value is 'https://sumo.dlr.de/trac.wsgi/'.
(This bug was triggered by text found in file 'net' matching '.*')
---------- Differences in net ----------
4c4
< <net version="1.1" junctionCornerDetail="5" limitTurnSpeed="5.50" xmlns:xsi="http://www.w3.org/2001/XMLSchema-instance" xsi:noNamespaceSchemaLocation="http://sumo.dlr.de/xsd/net_file.xsd">
---
> <net version="1.3" junctionCornerDetail="5" limitTurnSpeed="5.50" xmlns:xsi="http://www.w3.org/2001/XMLSchema-instance" xsi:noNamespaceSchemaLocation="http://sumo.dlr.de/xsd/net_file.xsd">
2768c2768
<     <connection from="-26816553" to="26816541" fromLane="0" toLane="0" via=":294168098_5_0" dir="L" state="="/>
---
>     <connection from="-26816553" to="26816541" fromLane="0" toLane="0" via=":294168098_5_0" dir="l" state="="/>
2975c2975
<     <connection from="27445116" to="27445117" fromLane="0" toLane="0" via=":294169338_0_0" dir="s" state="="/>
---
>     <connection from="27445116" to="27445117" fromLane="0" toLane="0" via=":294169338_0_0" dir="R" state="="/>
3216c3216
<     <connection from=":294168098_5" to="26816541" fromLane="0" toLane="0" dir="L" state="M"/>
---
>     <connection from=":294168098_5" to="26816541" fromLane="0" toLane="0" dir="l" state="M"/>
3241c3241
<     <connection from=":294169338_0" to="27445117" fromLane="0" toLane="0" dir="s" state="M"/>
---
>     <connection from=":294169338_0" to="27445117" fromLane="0" toLane="0" dir="R" state="M"/>

TEST had known bugs (bug 1691 (NONEXISTENT)) on ts-sim-build-ba : netconvert matsim_roundtrip ( Last six runs Jul2019 )

Failed to open URL 'https://sumo.dlr.de/trac.wsgi/ticket/1691?format=tab': HTTP Error 404: Not Found.

Please make sure that bug 1691 exists
and that the configuration entry 'bug_system_location' points to the correct trac instance.
The current value is 'https://sumo.dlr.de/trac.wsgi/'.
(This bug was triggered by text found in file 'net' matching '.*')
---------- Differences in net ----------
4c4
< <net version="1.1" junctionCornerDetail="5" limitTurnSpeed="5.50" xmlns:xsi="http://www.w3.org/2001/XMLSchema-instance" xsi:noNamespaceSchemaLocation="http://sumo.dlr.de/xsd/net_file.xsd">
---
> <net version="1.3" junctionCornerDetail="5" limitTurnSpeed="5.50" xmlns:xsi="http://www.w3.org/2001/XMLSchema-instance" xsi:noNamespaceSchemaLocation="http://sumo.dlr.de/xsd/net_file.xsd">
880c880
<         <lane id=":294830184_7_0" index="0" speed="5.56" length="14.38" shape="915.07,462.77 918.06,460.17 921.14,459.20 924.29,459.87 927.52,462.17"/>
---
>         <lane id=":294830184_7_0" index="0" speed="5.56" length="13.52" shape="915.07,462.77 917.74,460.95 921.19,460.22 924.69,460.61 927.52,462.17"/>
3708c3708
<     <connection from="-26004787#2" to="26004966#2" fromLane="0" toLane="0" via=":283722837_12_0" dir="s" state="="/>
---
>     <connection from="-26004787#2" to="26004966#2" fromLane="0" toLane="0" via=":283722837_12_0" dir="R" state="="/>
3724c3724
<     <connection from="-26004868#0" to="-5198585#7" fromLane="0" toLane="0" via=":283719736_13_0" dir="R" state="m"/>
---
>     <connection from="-26004868#0" to="-5198585#7" fromLane="0" toLane="0" via=":283719736_13_0" dir="r" state="m"/>
3747c3747
<     <connection from="-26816553" to="-26816413#1" fromLane="0" toLane="0" via=":294168098_4_0" dir="R" state="="/>
---
>     <connection from="-26816553" to="-26816413#1" fromLane="0" toLane="0" via=":294168098_4_0" dir="r" state="="/>
4015c4015
<     <connection from="26816413#1" to="26816553" fromLane="0" toLane="0" via=":294168098_1_0" dir="L" state="="/>
---
>     <connection from="26816413#1" to="26816553" fromLane="0" toLane="0" via=":294168098_1_0" dir="l" state="="/>
4023c4023
<     <connection from="26816590#0" to="26816590#1" fromLane="0" toLane="0" via=":294169338_0_0" dir="s" state="="/>
---
>     <connection from="26816590#0" to="26816590#1" fromLane="0" toLane="0" via=":294169338_0_0" dir="R" state="="/>
4037c4037
<     <connection from="26843038#0" to="26843038#1" fromLane="0" toLane="0" via=":294830184_7_0" dir="L" state="="/>
<truncated after showing first 30 lines>

TEST had known bugs (see #254) on ts-sim-build-ba : sumo output one_vehicle ( Last six runs Jul2019 )

different outputs from detectors which should detect the same
(This bug was triggered by text found in file 'output' matching 'failed')
---------- Differences in output ----------
10c10
< success 0.1 ['--step-length', '.1', '--end', '100'] ['3/1to2/1_0']
---
> failed 0.1 ['--step-length', '.1', '--end', '100'] 3/1to2/1_0 (71.3, 71.4) [('e2', 10.0), ('e3', -1.0), ('edge', -1.0), ('lane', -1.0)]
12c12
< success 1 ['--step-length', '.1', '--end', '100'] ['3/1to2/1_0']
---
> failed 1 ['--step-length', '.1', '--end', '100'] 3/1to2/1_0 (72.0, 73.0) [('e2', 10.0), ('e3', -1.0), ('edge', -1.0), ('lane', -1.0)]
14c14
< success 10 ['--step-length', '.1', '--end', '100'] ['3/1to2/1_0']
---
> failed 10 ['--step-length', '.1', '--end', '100'] 3/1to2/1_0 (80.0, 90.0) [('e2', 10.0), ('e3', -1.0), ('edge', -1.0), ('lane', -1.0)]
18c18
< success 0.1 ['--step-length', '.1', '--end', '1000'] ['3/1to2/1_0']
---
> failed 0.1 ['--step-length', '.1', '--end', '1000'] 3/1to2/1_0 (71.3, 71.4) [('e2', 10.0), ('e3', -1.0), ('edge', -1.0), ('lane', -1.0)]
20c20
< success 1 ['--step-length', '.1', '--end', '1000'] ['3/1to2/1_0']
---
> failed 1 ['--step-length', '.1', '--end', '1000'] 3/1to2/1_0 (72.0, 73.0) [('e2', 10.0), ('e3', -1.0), ('edge', -1.0), ('lane', -1.0)]
22c22
< success 10 ['--step-length', '.1', '--end', '1000'] ['3/1to2/1_0']
---
> failed 10 ['--step-length', '.1', '--end', '1000'] 3/1to2/1_0 (80.0, 90.0) [('e2', 10.0), ('e3', -1.0), ('edge', -1.0), ('lane', -1.0)]
24c24
< success 100 ['--step-length', '.1', '--end', '1000'] ['3/1to2/1_0']
---
> failed 100 ['--step-length', '.1', '--end', '1000'] 3/1to2/1_0 (100.0, 200.0) [('e1', -1.0), ('e2', 10.0), ('e3', -1.0), ('edge', -1.0), ('lane', -1.0)]
34c34
< success 0.1 ['--step-length', '1', '--end', '100'] ['3/1to2/1_0']
<truncated after showing first 30 lines>

TEST had known bugs (see #254) on ts-sim-build-ba : sumo output teleport ( Last six runs Jul2019 )

different outputs from detectors which should detect the same
(This bug was triggered by text found in file 'output' matching 'failed')
---------- Differences in output ----------
2c2
< success ['--step-length', '.1', '--end', '51'] ['2/1to1/1_0']
---
> success 0.1 ['--step-length', '.1', '--end', '51'] ['2/1to1/1_0']
4c4
< success ['--step-length', '.1', '--end', '51'] ['2/1to1/1_0', '1/1to0/1_0']
---
> success 0.1 ['--step-length', '.1', '--end', '51'] ['2/1to1/1_0', '1/1to0/1_0']
6c6
< success ['--step-length', '.1', '--end', '51'] ['2/1to1/1_0']
---
> success 1 ['--step-length', '.1', '--end', '51'] ['2/1to1/1_0']
8c8
< success ['--step-length', '.1', '--end', '51'] ['2/1to1/1_0', '1/1to0/1_0']
---
> success 1 ['--step-length', '.1', '--end', '51'] ['2/1to1/1_0', '1/1to0/1_0']
10c10
< success ['--step-length', '.1', '--end', '51'] ['2/1to1/1_0']
---
> success 10 ['--step-length', '.1', '--end', '51'] ['2/1to1/1_0']
12c12
< success ['--step-length', '.1', '--end', '51'] ['2/1to1/1_0', '1/1to0/1_0']
---
> success 10 ['--step-length', '.1', '--end', '51'] ['2/1to1/1_0', '1/1to0/1_0']
14c14
< success ['--step-length', '.1', '--end', '51'] ['2/1to1/1_0']
---
> success 100 ['--step-length', '.1', '--end', '51'] ['2/1to1/1_0']
16c16
< success ['--step-length', '.1', '--end', '51'] ['2/1to1/1_0', '1/1to0/1_0']
<truncated after showing first 30 lines>

TEST had known bugs (see #254) on ts-sim-build-ba : sumo output teleport_multihop ( Last six runs Jul2019 )

different outputs from detectors which should detect the same
(This bug was triggered by text found in file 'output' matching 'failed')
---------- Differences in output ----------
34c34
< success 0.1 ['--step-length', '.1', '--end', '1000'] 2/1to1/1_0 (230.0, 230.1) [('e2', 9.99), ('e3', 10.0), ('edge', 9.99), ('lane', 9.99)]
---
> failed 0.1 ['--step-length', '.1', '--end', '1000'] 2/1to1/1_0 (149.0, 149.1) [('e2', 9.99), ('e3', 10.0), ('edge', 10.0), ('lane', 10.0)]
36c36
< success 0.1 ['--step-length', '.1', '--end', '1000'] 1/1to0/1_0 (148.1, 148.2) [('e2', 9.99), ('e3', 10.0), ('edge', 9.99), ('lane', 9.99)]
---
> failed 0.1 ['--step-length', '.1', '--end', '1000'] 2/1to1/1_0 (149.0, 149.1) [('e2', 9.99), ('e3', 10.0), ('edge', 10.0), ('lane', 10.0)]
38c38
< success 1 ['--step-length', '.1', '--end', '1000'] 2/1to1/1_0 (230.0, 231.0) [('e2', 9.99), ('e3', 10.0), ('edge', 9.99), ('lane', 9.99)]
---
> failed 1 ['--step-length', '.1', '--end', '1000'] 2/1to1/1_0 (149.0, 150.0) [('e2', 9.93), ('e3', 10.0), ('edge', 10.0), ('lane', 10.0)]
40c40
< success 1 ['--step-length', '.1', '--end', '1000'] 1/1to0/1_0 (148.0, 149.0) [('e2', 9.91), ('e3', 10.0), ('edge', 9.91), ('lane', 9.91)]
---
> failed 1 ['--step-length', '.1', '--end', '1000'] 2/1to1/1_0 (149.0, 150.0) [('e2', 9.93), ('e3', 10.0), ('edge', 10.0), ('lane', 10.0)]
42c42
< success 10 ['--step-length', '.1', '--end', '1000'] 2/1to1/1_0 (230.0, 240.0) [('e2', 9.42), ('e3', 9.9), ('edge', 9.42), ('lane', 9.42)]
---
> failed 10 ['--step-length', '.1', '--end', '1000'] 2/1to1/1_0 (140.0, 150.0) [('e2', 9.99), ('e3', 10.0), ('edge', 10.0), ('lane', 10.0)]
44c44
< success 10 ['--step-length', '.1', '--end', '1000'] 1/1to0/1_0 (140.0, 150.0) [('e2', 9.96), ('e3', 9.99), ('edge', 9.96), ('lane', 9.96)]
---
> failed 10 ['--step-length', '.1', '--end', '1000'] 2/1to1/1_0 (140.0, 150.0) [('e2', 9.99), ('e3', 10.0), ('edge', 10.0), ('lane', 10.0)]
46c46
< success 100 ['--step-length', '.1', '--end', '1000'] 2/1to1/1_0 (200.0, 300.0) [('e1', 10.0), ('e2', 9.22), ('e3', 5.71), ('edge', 9.22), ('lane', 9.22)]
---
> failed 100 ['--step-length', '.1', '--end', '1000'] 2/1to1/1_0 (100.0, 200.0) [('e1', 10.0), ('e2', 7.95), ('e3', 10.0), ('edge', 10.0), ('lane', 10.0)]
48c48
< success 100 ['--step-length', '.1', '--end', '1000'] 1/1to0/1_0 (100.0, 200.0) [('e1', 9.53), ('e2', 5.82), ('e3', 6.93), ('edge', 5.82), ('lane', 5.82)]
<truncated after showing first 30 lines>

TEST had known bugs (see #254) on ts-sim-build-ba : sumo output teleport_multihop_newDefaults ( Last six runs Jul2019 )

different outputs from detectors which should detect the same
(This bug was triggered by text found in file 'output' matching 'failed')
---------- Differences in output ----------
18c18
< success 0.1 ['--step-length', '.1', '--end', '100'] ['2/1to1/1_0']
---
> failed 0.1 ['--step-length', '.1', '--end', '100'] 2/1to1/1_0 (76.2, 76.3) [('e2', 10.49), ('e3', 10.35), ('edge', 10.49), ('lane', 10.49)]
20c20
< success 0.1 ['--step-length', '.1', '--end', '100'] ['2/1to1/1_0', '1/1to0/1_0']
---
> failed 0.1 ['--step-length', '.1', '--end', '100'] 2/1to1/1_0 (76.2, 76.3) [('e2', 10.49), ('e3', 10.35), ('edge', 10.49), ('lane', 10.49)]
22c22
< success 1 ['--step-length', '.1', '--end', '100'] ['2/1to1/1_0']
---
> failed 1 ['--step-length', '.1', '--end', '100'] 2/1to1/1_0 (76.0, 77.0) [('e2', 10.39), ('e3', 10.35), ('edge', 10.39), ('lane', 10.39)]
24c24
< success 1 ['--step-length', '.1', '--end', '100'] ['2/1to1/1_0', '1/1to0/1_0']
---
> failed 1 ['--step-length', '.1', '--end', '100'] 2/1to1/1_0 (76.0, 77.0) [('e2', 10.39), ('e3', 10.35), ('edge', 10.39), ('lane', 10.39)]
26c26
< success 10 ['--step-length', '.1', '--end', '100'] ['2/1to1/1_0']
---
> failed 10 ['--step-length', '.1', '--end', '100'] 2/1to1/1_0 (70.0, 80.0) [('e2', 10.42), ('e3', 10.25), ('edge', 10.42), ('lane', 10.42)]
28c28
< success 10 ['--step-length', '.1', '--end', '100'] ['2/1to1/1_0', '1/1to0/1_0']
---
> failed 10 ['--step-length', '.1', '--end', '100'] 2/1to1/1_0 (70.0, 80.0) [('e2', 10.42), ('e3', 10.25), ('edge', 10.42), ('lane', 10.42)]
30c30
< success 100 ['--step-length', '.1', '--end', '100'] ['2/1to1/1_0']
---
> failed 100 ['--step-length', '.1', '--end', '100'] 2/1to1/1_0 (0.0, 100.0) [('e1', 10.27), ('e2', 10.24), ('e3', 9.59), ('edge', 10.24), ('lane', 10.24)]
32c32
< success 100 ['--step-length', '.1', '--end', '100'] ['2/1to1/1_0', '1/1to0/1_0']
<truncated after showing first 30 lines>

TEST had known bugs (see #254) on ts-sim-build-ba : sumo output two_same_vehicles ( Last six runs Jul2019 )

different outputs from detectors which should detect the same
(This bug was triggered by text found in file 'output' matching 'failed')
---------- Differences in output ----------
10c10
< success 0.1 ['--step-length', '.1', '--end', '100'] ['3/1to2/1_0']
---
> failed 0.1 ['--step-length', '.1', '--end', '100'] 3/1to2/1_0 (75.4, 75.5) [('e2', 10.0), ('e3', -1.0), ('edge', -1.0), ('lane', -1.0)]
12c12
< success 1 ['--step-length', '.1', '--end', '100'] ['3/1to2/1_0']
---
> failed 1 ['--step-length', '.1', '--end', '100'] 3/1to2/1_0 (76.0, 77.0) [('e2', 10.0), ('e3', -1.0), ('edge', -1.0), ('lane', -1.0)]
14c14
< success 10 ['--step-length', '.1', '--end', '100'] ['3/1to2/1_0']
---
> failed 10 ['--step-length', '.1', '--end', '100'] 3/1to2/1_0 (80.0, 90.0) [('e2', 10.0), ('e3', -1.0), ('edge', -1.0), ('lane', -1.0)]
18c18
< success 0.1 ['--step-length', '.1', '--end', '1000'] ['3/1to2/1_0']
---
> failed 0.1 ['--step-length', '.1', '--end', '1000'] 3/1to2/1_0 (75.4, 75.5) [('e2', 10.0), ('e3', -1.0), ('edge', -1.0), ('lane', -1.0)]
20c20
< success 1 ['--step-length', '.1', '--end', '1000'] ['3/1to2/1_0']
---
> failed 1 ['--step-length', '.1', '--end', '1000'] 3/1to2/1_0 (76.0, 77.0) [('e2', 10.0), ('e3', -1.0), ('edge', -1.0), ('lane', -1.0)]
22c22
< success 10 ['--step-length', '.1', '--end', '1000'] ['3/1to2/1_0']
---
> failed 10 ['--step-length', '.1', '--end', '1000'] 3/1to2/1_0 (80.0, 90.0) [('e2', 10.0), ('e3', -1.0), ('edge', -1.0), ('lane', -1.0)]
24c24
< success 100 ['--step-length', '.1', '--end', '1000'] ['3/1to2/1_0']
---
> failed 100 ['--step-length', '.1', '--end', '1000'] 3/1to2/1_0 (100.0, 200.0) [('e1', -1.0), ('e2', 10.0), ('e3', -1.0), ('edge', -1.0), ('lane', -1.0)]
34c34
< success 0.1 ['--step-length', '1', '--end', '100'] ['3/1to2/1_0']
<truncated after showing first 30 lines>

TEST had known bugs (see #254) on ts-sim-build-ba : sumo output two_vehicles_diff_length ( Last six runs Jul2019 )

different outputs from detectors which should detect the same
(This bug was triggered by text found in file 'output' matching 'failed')
---------- Differences in output ----------
10c10
< success 0.1 ['--step-length', '.1', '--end', '100'] ['3/1to2/1_0']
---
> failed 0.1 ['--step-length', '.1', '--end', '100'] 3/1to2/1_0 (76.4, 76.5) [('e2', 10.0), ('e3', -1.0), ('edge', -1.0), ('lane', -1.0)]
12c12
< success 1 ['--step-length', '.1', '--end', '100'] ['3/1to2/1_0']
---
> failed 1 ['--step-length', '.1', '--end', '100'] 3/1to2/1_0 (77.0, 78.0) [('e2', 10.0), ('e3', -1.0), ('edge', -1.0), ('lane', -1.0)]
14c14
< success 10 ['--step-length', '.1', '--end', '100'] ['3/1to2/1_0']
---
> failed 10 ['--step-length', '.1', '--end', '100'] 3/1to2/1_0 (80.0, 90.0) [('e2', 10.0), ('e3', -1.0), ('edge', -1.0), ('lane', -1.0)]
18c18
< success 0.1 ['--step-length', '.1', '--end', '1000'] ['3/1to2/1_0']
---
> failed 0.1 ['--step-length', '.1', '--end', '1000'] 3/1to2/1_0 (76.4, 76.5) [('e2', 10.0), ('e3', -1.0), ('edge', -1.0), ('lane', -1.0)]
20c20
< success 1 ['--step-length', '.1', '--end', '1000'] ['3/1to2/1_0']
---
> failed 1 ['--step-length', '.1', '--end', '1000'] 3/1to2/1_0 (77.0, 78.0) [('e2', 10.0), ('e3', -1.0), ('edge', -1.0), ('lane', -1.0)]
22c22
< success 10 ['--step-length', '.1', '--end', '1000'] ['3/1to2/1_0']
---
> failed 10 ['--step-length', '.1', '--end', '1000'] 3/1to2/1_0 (80.0, 90.0) [('e2', 10.0), ('e3', -1.0), ('edge', -1.0), ('lane', -1.0)]
24c24
< success 100 ['--step-length', '.1', '--end', '1000'] ['3/1to2/1_0']
---
> failed 100 ['--step-length', '.1', '--end', '1000'] 3/1to2/1_0 (100.0, 200.0) [('e1', -1.0), ('e2', 10.0), ('e3', -1.0), ('edge', -1.0), ('lane', -1.0)]
34c34
< success 0.1 ['--step-length', '1', '--end', '100'] ['3/1to2/1_0']
<truncated after showing first 30 lines>

TEST had known bugs (see #254) on ts-sim-build-ba : sumo output two_vehicles_diff_speed ( Last six runs Jul2019 )

different outputs from detectors which should detect the same
(This bug was triggered by text found in file 'output' matching 'failed')
---------- Differences in output ----------
0a1,48
> Loading configuration... done.
> failed 0.1 ['--step-length', '.1', '--end', '51'] 3/1to2/1_0 (38.4, 38.5) [('e2', 9.6), ('e3', 9.5), ('edge', 9.6), ('lane', 9.6)]
> Loading configuration... done.
> failed 1 ['--step-length', '.1', '--end', '51'] 3/1to2/1_0 (38.0, 39.0) [('e2', 9.64), ('e3', 9.5), ('edge', 9.64), ('lane', 9.64)]
> Loading configuration... done.
> failed 10 ['--step-length', '.1', '--end', '51'] 3/1to2/1_0 (30.0, 40.0) [('e2', 9.86), ('e3', 9.5), ('edge', 9.86), ('lane', 9.86)]
> Loading configuration... done.
> failed 100 ['--step-length', '.1', '--end', '51'] 3/1to2/1_0 (0.0, 51.0) [('e2', 9.62), ('e3', 9.5), ('edge', 9.62), ('lane', 9.62)]
> Loading configuration... done.
> failed 0.1 ['--step-length', '.1', '--end', '100'] 3/1to2/1_0 (38.4, 38.5) [('e2', 9.6), ('e3', 9.5), ('edge', 9.6), ('lane', 9.6)]
> Loading configuration... done.
> failed 1 ['--step-length', '.1', '--end', '100'] 3/1to2/1_0 (38.0, 39.0) [('e2', 9.64), ('e3', 9.5), ('edge', 9.64), ('lane', 9.64)]
> Loading configuration... done.
> failed 10 ['--step-length', '.1', '--end', '100'] 3/1to2/1_0 (30.0, 40.0) [('e2', 9.86), ('e3', 9.5), ('edge', 9.86), ('lane', 9.86)]
> Loading configuration... done.
> failed 100 ['--step-length', '.1', '--end', '100'] 3/1to2/1_0 (0.0, 100.0) [('e1', 9.5), ('e2', 9.53), ('e3', 9.5), ('edge', 9.47), ('lane', 9.47)]
> Loading configuration... done.
> failed 0.1 ['--step-length', '.1', '--end', '1000'] 3/1to2/1_0 (38.4, 38.5) [('e2', 9.6), ('e3', 9.5), ('edge', 9.6), ('lane', 9.6)]
> Loading configuration... done.
> failed 1 ['--step-length', '.1', '--end', '1000'] 3/1to2/1_0 (38.0, 39.0) [('e2', 9.64), ('e3', 9.5), ('edge', 9.64), ('lane', 9.64)]
> Loading configuration... done.
> failed 10 ['--step-length', '.1', '--end', '1000'] 3/1to2/1_0 (30.0, 40.0) [('e2', 9.86), ('e3', 9.5), ('edge', 9.86), ('lane', 9.86)]
> Loading configuration... done.
> failed 100 ['--step-length', '.1', '--end', '1000'] 3/1to2/1_0 (0.0, 100.0) [('e1', 9.5), ('e2', 9.53), ('e3', 9.5), ('edge', 9.47), ('lane', 9.47)]
> Loading configuration... done.
> failed 0.1 ['--step-length', '1', '--end', '51'] 3/1to2/1_0 (39.0, 40.0) [('e2', 9.6), ('e3', 9.5), ('edge', 9.6), ('lane', 9.6)]
> Loading configuration... done.
> failed 1 ['--step-length', '1', '--end', '51'] 3/1to2/1_0 (39.0, 40.0) [('e2', 9.6), ('e3', 9.5), ('edge', 9.6), ('lane', 9.6)]
> Loading configuration... done.
<truncated after showing first 30 lines>

TEST had known bugs (#4727) on ts-sim-build-ba : traci ContextSubscriptionFilters leadFollow laneChangeLeft ( Last six runs Jul2019 )

#4727
(This bug was triggered by text found in file 'output' matching '.')
---------- Differences in output ----------
105d104
< lead_straight
106a106
> lead_straight

TEST had known bugs (#4727) on ts-sim-build-ba : traci ContextSubscriptionFilters leadFollow laneChangeNeighbors ( Last six runs Jul2019 )

#4727
(This bug was triggered by text found in file 'output' matching '.')
---------- Differences in output ----------
164a165
> follow_straight
167c168
< lead_left
---
> lead_right
169c170
< follow_straight
---
> lead_left

TEST had known bugs (#4727) on ts-sim-build-ba : traci ContextSubscriptionFilters leadFollow laneChangeRight ( Last six runs Jul2019 )

#4727
(This bug was triggered by text found in file 'output' matching '.')
---------- Differences in output ----------
105d104
< lead_straight
106a106
> lead_straight
119a120
> lead_right

TEST had known bugs (see #3263) on ts-sim-build-ba : traci pythonApi moveToXY keepRoute2 ( Last six runs Jul2019 )

mapping failure
(This bug was triggered by text found in file 'output' matching 'failed')
---------- Differences in output ----------
0a1
> internal corner (inside, segment2) failed: x=198, x2=198.0,   y=1.9, y2=1.9,   lane=middle_0, lane2=middle_0, pos=102, pos2=98.0   posLat=2.0 posLat2=1.9

TEST had known bugs (see #5383) on ts-sim-build-ba : traci pythonApi moveToXY permissions ( Last six runs Jul2019 )

mapping failure
(This bug was triggered by text found in file 'output' matching 'failed')
---------- Differences in output ----------
0a1
> shifted to left lane (permissions) failed: mode=2 x=40, x2=40.0,   y=-1.5, y2=-1.5,   lane=beg_1, lane2=, pos=40, pos2=-1073741824.0   posLat=0.0 posLat2=-1073741824.0

python3: 286 tests: 252 succeeded 20 FAILED 14 known bugs

Detailed information for the tests that FAILED:

TEST FAILED on ts-sim-build-ba : netconvert opendrive_roundtrip ( Last six runs Jul2019 )

---------- Differences in net ----------
2078c2078
<         <lane id=":68_0_0" index="0" disallow="pedestrian" speed="3.95" length="4.44" width="3.20" shape="-0.01,349.81 -1.34,349.49 -1.96,348.91 -1.86,348.06 -1.05,346.96"/>
---
>         <lane id=":68_0_0" index="0" disallow="pedestrian" speed="3.96" length="4.46" width="3.20" shape="-0.01,349.81 -1.34,349.48 -1.96,348.89 -1.86,348.04 -1.03,346.94"/>
2499c2499
<         <lane id="-834.0.00_0" index="0" disallow="pedestrian" speed="22.22" length="491.76" width="3.20" shape="-1.05,346.96 4.59,342.24 5.60,341.17 6.74,339.65 8.02,337.87 9.41,336.08 10.95,334.49 12.66,333.44 14.50,332.93 16.43,332.58 18.52,332.34 20.73,332.18 22.99,332.10 25.26,332.07 27.46,332.10 29.53,332.16 31.42,332.25 33.06,332.35 179.17,342.89 180.66,343.00 182.34,343.12 184.18,343.25 186.14,343.38 188.17,343.52 190.24,343.65 192.31,343.79 194.35,343.92 196.30,344.05 198.14,344.17 19
9.83,344.27 201.32,344.36 293.62,349.95 295.12,350.05 296.82,350.17 298.66,350.31 300.62,350.46 302.66,350.63 304.73,350.81 306.81,350.99 308.84,351.18 310.80,351.36 312.64,351.54 314.33,351.72 315.83,351.88 376.55,358.78 378.05,358.96 379.75,359.19 381.58,359.45 383.53,359.75 385.55,360.07 387.61,360.41 389.66,360.76 391.68,361.11 393.62,361.47 395.44,361.82 397.11,362.16 398.59,362.47 481.47,380.90"/>
---
>         <lane id="-834.0.00_0" index="0" disallow="pedestrian" speed="22.22" length="491.73" width="3.20" shape="-1.03,346.94 4.59,342.24 5.60,341.17 6.74,339.65 8.02,337.87 9.41,336.08 10.95,334.49 12.66,333.44 14.50,332.93 16.43,332.58 18.52,332.34 20.73,332.18 22.99,332.10 25.26,332.07 27.46,332.10 29.53,332.16 31.42,332.25 33.06,332.35 179.17,342.89 180.66,343.00 182.34,343.12 184.18,343.25 186.14,343.38 188.17,343.52 190.24,343.65 192.31,343.79 194.35,343.92 196.30,344.05 198.14,344.17 19
9.83,344.27 201.32,344.36 293.62,349.95 295.12,350.05 296.82,350.17 298.66,350.31 300.62,350.46 302.66,350.63 304.73,350.81 306.81,350.99 308.84,351.18 310.80,351.36 312.64,351.54 314.33,351.72 315.83,351.88 376.55,358.78 378.05,358.96 379.75,359.19 381.58,359.45 383.53,359.75 385.55,360.07 387.61,360.41 389.66,360.76 391.68,361.11 393.62,361.47 395.44,361.82 397.11,362.16 398.59,362.47 481.47,380.90"/>
3488c3488
<     <junction id="68" type="priority" x="0.00" y="348.21" incLanes="-884.0.00_0" intLanes=":68_0_0" shape="-2.08,345.73 -0.02,351.41 0.00,348.21">
---
>     <junction id="68" type="priority" x="0.01" y="348.18" incLanes="-884.0.00_0" intLanes=":68_0_0" shape="-0.01,348.17 -2.06,345.71 -0.02,351.41 0.00,348.21">

TEST FAILED on ts-sim-build-ba : netconvert osm_roundtrip ( Last six runs Jul2019 )

---------- Differences in errors ----------
1,58c1,4
< Warning: Discarding unusable type 'waterway.riverbank' (first occurence for edge '4616435').
< Warning: Discarding unusable type 'waterway.canal' (first occurence for edge '5363708').
< Warning: Discarding unknown compound 'cycleway.opposite_track' in type 'cycleway.opposite_track|highway.primary' (first occurence for edge '7216737').
< Warning: Discarding unusable type 'railway.construction' (first occurence for edge '11390634').
< Warning: Discarding unusable type 'highway.construction' (first occurence for edge '24154002').
< Warning: Discarding unknown compound 'cycleway.track' in type 'cycleway.track|highway.primary' (first occurence for edge '24214693').
< Warning: Reducing junction cluster 283018817,38919652,38919712,38919808 (5 incoming edges)
< Warning: Minor green from edge '7216737#3' to edge '24214694' exceeds 19.44m/s. Maybe a left-turn lane is missing.
< Warning: Minor green from edge '-24214693#0' to edge '-7727483#3' exceeds 19.44m/s. Maybe a left-turn lane is missing.
< Warning: Minor green from edge '7727483#1' to edge '-7216737#3' exceeds 19.44m/s. Maybe a left-turn lane is missing.
< Warning: Minor green from edge '-24214694' to edge '24214693#0' exceeds 19.44m/s. Maybe a left-turn lane is missing.
< --- 
< +++ 
< @@ -219,7 +219,7 @@
<          <lane id="-7216737#3_1" index="1" disallow="tram rail_urban rail rail_electric rail_fast ship" speed="27.78" length="162.74" shape="486.04,118.77 633.84,105.16"/>
<      </edge>
<      <edge id="-7727483#0" from="294169342" to="38920501" priority="10" type="highway.tertiary">
< -        <lane id="-7727483#0_0" index="0" disallow="tram rail_urban rail rail_electric rail_fast ship" speed="22.22" length="4.46" shape="496.86,309.53 496.88,309.73"/>
< +        <lane id="-7727483#0_0" index="0" disallow="tram rail_urban rail rail_electric rail_fast ship" speed="22.22" length="4.46" shape="497.05,311.65 497.06,311.85"/>
<      </edge>
<      <edge id="-7727483#3" from="32266935" to="294169342" priority="10" type="highway.tertiary" shape="478.98,121.02 482.98,167.40 484.69,187.19 488.69,233.50 492.80,281.09 495.08,307.55">
<          <lane id="-7727483#3_0" index="0" disallow="tram rail_urban rail rail_electric rail_fast ship" speed="22.22" length="187.22" shape="481.48,131.37 484.58,167.26 486.29,187.05 490.29,233.36 494.40,280.95 496.27,302.68"/>
< @@ -981,7 +981,7 @@
<      <junction id="38919927" type="priority" x="297.39" y="446.01" incLanes="-6137233#0_0" intLanes="" shape="297.39,446.01 296.76,449.15 297.39,446.01">
<          <request index="0" response="0" foes="0"/>
<      </junction>
< -    <junction id="38920501" type="priority" x="495.47" y="311.99" incLanes="27441289_0 -7727483#0_0" intLanes="" shape="492.27,312.15 498.66,311.83 498.65,311.60">
< +    <junction id="38920501" type="priority" x="495.47" y="311.99" incLanes="27441289_0 -7727483#0_0" intLanes="" shape="492.27,312.13 498.66,311.82 498.65,311.57">
<          <request index="0" response="00" foes="00"/>
<truncated after showing first 30 lines>
---------- Differences in output ----------
1,2d0
< Success.
< Success.
---------- Missing result in net ----------
<?xml version="1.0" encoding="UTF-8"?>


<net version="1.3" junctionCornerDetail="5" limitTurnSpeed="5.50" xmlns:xsi="http://www.w3.org/2001/XMLSchema-instance" xsi:noNamespaceSchemaLocation="http://sumo.dlr.de/xsd/net_file.xsd">

    <location netOffset="-399345.66,-5809365.64" convBoundary="-1.27,0.00,1737.68,767.39" origBoundary="13.364829,52.424764,13.574340,52.459643" projParameter="+proj=utm +zone=33 +ellps=WGS84 +datum=WGS84 +units=m +no_defs"/>

    <type id="highway.bridleway" priority="1" numLanes="1" speed="2.78" allow="pedestrian" oneway="1" width="2.00"/>
    <type id="highway.bus_guideway" priority="1" numLanes="1" speed="27.78" allow="bus" oneway="1"/>
    <type id="highway.cycleway" priority="1" numLanes="1" speed="8.33" allow="bicycle" oneway="0" width="1.00"/>
    <type id="highway.footway" priority="1" numLanes="1" speed="2.78" allow="pedestrian" oneway="1" width="2.00"/>
    <type id="highway.ford" priority="1" numLanes="1" speed="2.78" allow="army" oneway="0"/>
    <type id="highway.living_street" priority="2" numLanes="1" speed="2.78" disallow="tram rail_urban rail rail_electric rail_fast ship" oneway="0"/>
    <type id="highway.motorway" priority="14" numLanes="2" speed="39.44" allow="private emergency authority army vip passenger hov taxi bus coach delivery truck trailer motorcycle evehicle custom1 custom2" oneway="1"/>
    <type id="highway.motorway_link" priority="9" numLanes="1" speed="22.22" allow="private emergency authority army vip passenger hov taxi bus coach delivery truck trailer motorcycle evehicle custom1 custom2" oneway="1"/>
    <type id="highway.path" priority="1" numLanes="1" speed="2.78" allow="pedestrian bicycle" oneway="1" width="2.00"/>
    <type id="highway.pedestrian" priority="1" numLanes="1" speed="2.78" allow="pedestrian" oneway="1" width="2.00"/>
    <type id="highway.primary" priority="12" numLanes="2" speed="27.78" disallow="tram rail_urban rail rail_electric rail_fast ship" oneway="0"/>
    <type id="highway.primary_link" priority="7" numLanes="1" speed="22.22" disallow="tram rail_urban rail rail_electric rail_fast ship" oneway="0"/>
    <type id="highway.raceway" priority="15" numLanes="2" speed="83.33" allow="vip" oneway="0"/>
    <type id="highway.residential" priority="3" numLanes="1" speed="13.89" disallow="tram rail_urban rail rail_electric rail_fast ship" oneway="0"/>
    <type id="highway.secondary" priority="11" numLanes="2" speed="27.78" disallow="tram rail_urban rail rail_electric rail_fast ship" oneway="0"/>
    <type id="highway.secondary_link" priority="6" numLanes="1" speed="22.22" disallow="tram rail_urban rail rail_electric rail_fast ship" oneway="0"/>
    <type id="highway.service" priority="1" numLanes="1" speed="5.56" allow="pedestrian delivery bicycle" oneway="0"/>
    <type id="highway.stairs" priority="1" numLanes="1" speed="1.39" allow="pedestrian" oneway="1" width="2.00"/>
    <type id="highway.step" priority="1" numLanes="1" speed="1.39" allow="pedestrian" oneway="1" width="2.00"/>
    <type id="highway.steps" priority="1" numLanes="1" speed="1.39" allow="pedestrian" oneway="1" width="2.00"/>
    <type id="highway.tertiary" priority="10" numLanes="1" speed="22.22" disallow="tram rail_urban rail rail_electric rail_fast ship" oneway="0"/>
    <type id="highway.tertiary_link" priority="5" numLanes="1" speed="22.22" disallow="tram rail_urban rail rail_electric rail_fast ship" oneway="0"/>
    <type id="highway.track" priority="1" numLanes="1" speed="5.56" disallow="tram rail_urban rail rail_electric rail_fast ship" oneway="0"/>
<truncated after showing first 30 lines>

TEST FAILED on ts-sim-build-ba : simpla openGap ( Last six runs Jul2019 )

---------- Differences in output ----------
259,260c259,260
< # gap = 19.601
< # speedDiff = -2.48689957516e-14
---
> # gap = 19.601000000000084
> # speedDiff = -2.4868995751603507e-14
266,268c266,268
< speed 19.6
< speed w/o traci 19.6
< acceleration -7.1054273576e-15
---
> speed 19.60000000000002
> speed w/o traci 19.60000000000002
> acceleration -7.105427357601002e-15
270c270
< lanePos 160.169
---
> lanePos 160.16899999999993
277c277
< lanePos 187.27
---
> lanePos 187.26999999999998
279,280c279,280
< # gap = 19.601
< # speedDiff = -1.7763568394e-14
---
> # gap = 19.601000000000056
> # speedDiff = -1.7763568394002505e-14
286,288c286,288
< speed 19.6
<truncated after showing first 30 lines>

TEST FAILED on ts-sim-build-ba : sumo lane_change best_lanes ( Last six runs Jul2019 )

---------- Differences in output ----------
9c9
< lane 0 ok
---
> lane 0 mismatches
30,32c30,32
< lane 0 ok
< lane 1 ok
< lane 2 ok
---
> lane 0 mismatches
> lane 1 mismatches
> lane 2 mismatches
53,55c53,55
< lane 0 ok
< lane 1 ok
< lane 2 ok
---
> lane 0 mismatches
> lane 1 mismatches
> lane 2 mismatches
76,78c76,78
< lane 0 ok
< lane 1 ok
< lane 2 ok
---
> lane 0 mismatches
> lane 1 mismatches
> lane 2 mismatches
99,101c99,101
< lane 0 ok
<truncated after showing first 30 lines>

TEST FAILED on ts-sim-build-ba : sumo socketout ( Last six runs Jul2019 )

---------- Differences in errors ----------
1,2d0
< Error: send failed: Software caused tcpip::Socket abort
< Quitting (on error).
5d2
< Error: Error on closing output devices.
6a4,14
> Quitting (on error).
> Exception in thread Thread-1:
> Traceback (most recent call last):
>   File "/usr/lib/python3.6/threading.py", line 916, in _bootstrap_inner
>     self.run()
>   File "/usr/lib/python3.6/threading.py", line 864, in run
>     self._target(*self._args, **self._kwargs)
>   File "/home/delphi/extraGcc/sumo/tests/../tests/complex/sumo/socketout/runner.py", line 50, in main
>     msg = msg + chunk
> TypeError: must be str, not bytes
> 
---------- Differences in output ----------
2,30d1
< <?xml version="1.0" encoding="UTF-8"?>
< 
< 
< <meandata xmlns:xsi="http://www.w3.org/2001/XMLSchema-instance" xsi:noNamespaceSchemaLocation="http://sumo.dlr.de/xsd/meandata_file.xsd">
<     <interval begin="0.00" end="60.00" id="dump_60">
<         <edge id="3/1to2/1" sampledSeconds="54.90" CO_abs="1056.825000" CO2_abs="115961.000000" HC_abs="7.304750" PMx_abs="0.684725" NOx_abs="38.170750" fuel_abs="49.848181" electricity_abs="0"
<             CO_normed="162.380282" CO2_normed="17817.311140" HC_normed="1.122369" PMx_normed="0.105207" NOx_normed="5.864904" fuel_normed="7.659131" electricity_normed="0"
<             traveltime="39.05" CO_perVeh="751.712500" CO2_perVeh="82482.277778" HC_perVeh="5.195819" PMx_perVeh="0.487040" NOx_perVeh="27.150597" fuel_perVeh="35.456675" electricity_perVeh="0"/>
<         <edge id="4/1to3/1" sampledSeconds="58.70" CO_abs="1129.975000" CO2_abs="123987.444444" HC_abs="7.810361" PMx_abs="0.732119" NOx_abs="40.812806" fuel_abs="53.298510" electricity_abs="0"
<             CO_normed="173.619718" CO2_normed="19050.567648" HC_normed="1.200055" PMx_normed="0.112490" NOx_normed="6.270854" fuel_normed="8.189272" electricity_normed="0"
<             traveltime="39.05" CO_perVeh="751.712500" CO2_perVeh="82482.277778" HC_perVeh="5.195819" PMx_perVeh="0.487040" NOx_perVeh="27.150597" fuel_perVeh="35.456675" electricity_perVeh="0"/>
<     </interval>
<     <interval begin="60.00" end="120.00" id="dump_60">
<         <edge id="1/1to0/1" sampledSeconds="18.70" CO_abs="359.975000" CO2_abs="39498.555556" HC_abs="2.488139" PMx_abs="0.233231" NOx_abs="13.001694" fuel_abs="16.979253" electricity_abs="0"
<             CO_normed="55.309859" CO2_normed="6068.920188" HC_normed="0.382300" PMx_normed="0.035836" NOx_normed="1.997700" fuel_normed="2.608848" electricity_normed="0"
<             traveltime="39.05" CO_perVeh="751.712500" CO2_perVeh="82482.277778" HC_perVeh="5.195819" PMx_perVeh="0.487040" NOx_perVeh="27.150597" fuel_perVeh="35.456675" electricity_perVeh="0"/>
<         <edge id="2/1to1/1" sampledSeconds="78.70" CO_abs="1514.975000" CO2_abs="166231.888889" HC_abs="10.471472" PMx_abs="0.981564" NOx_abs="54.718361" fuel_abs="71.458139" electricity_abs="0"
<             CO_normed="232.774648" CO2_normed="25541.391379" HC_normed="1.608933" PMx_normed="0.150816" NOx_normed="8.407431" fuel_normed="10.979484" electricity_normed="0"
<             traveltime="39.05" CO_perVeh="751.712500" CO2_perVeh="82482.277778" HC_perVeh="5.195819" PMx_perVeh="0.487040" NOx_perVeh="27.150597" fuel_perVeh="35.456675" electricity_perVeh="0"/>
<         <edge id="3/1to2/1" sampledSeconds="23.80" CO_abs="458.150000" CO2_abs="50270.888889" HC_abs="3.166722" PMx_abs="0.296839" NOx_abs="16.547611" fuel_abs="21.609958" electricity_abs="0"
<             CO_normed="70.394366" CO2_normed="7724.080239" HC_normed="0.486564" PMx_normed="0.045609" NOx_normed="2.542527" fuel_normed="3.320352" electricity_normed="0"
<             traveltime="39.05" CO_perVeh="751.712500" CO2_perVeh="82482.277778" HC_perVeh="5.195819" PMx_perVeh="0.487040" NOx_perVeh="27.150597" fuel_perVeh="35.456675" electricity_perVeh="0"/>
<     </interval>
<     <interval begin="120.00" end="150.00" id="dump_60">
<         <edge id="1/1to0/1" sampledSeconds="57.50" CO_abs="1106.875000" CO2_abs="121452.777778" HC_abs="7.650694" PMx_abs="0.717153" NOx_abs="39.978472" fuel_abs="52.208932" electricity_abs="0"
<             CO_normed="340.140845" CO2_normed="37322.236449" HC_normed="2.351046" PMx_normed="0.220380" NOx_normed="12.285318" fuel_normed="16.043718" electricity_normed="0"
<             traveltime="39.05" CO_perVeh="751.712500" CO2_perVeh="82482.277778" HC_perVeh="5.195819" PMx_perVeh="0.487040" NOx_perVeh="27.150597" fuel_perVeh="35.456675" electricity_perVeh="0"/>
<     </interval>
< </meandata>
<truncated after showing first 30 lines>

TEST FAILED on ts-sim-build-ba : sumo speedMap ( Last six runs Jul2019 )

---------- Differences in errors ----------
1,36c1,4
< Warning: Teleporting vehicle '8'; collision with vehicle '7', lane='1/1to2/1_0', gap=-0.49, time=1.00 stage=move.
< Warning: Teleporting vehicle '14'; collision with vehicle '13', lane='1/1to2/1_0', gap=-0.14, time=1.00 stage=move.
< Warning: Teleporting vehicle '18'; collision with vehicle '17', lane='1/1to2/1_0', gap=-0.19, time=1.00 stage=move.
< Warning: Vehicle '8' ends teleporting on edge '2/1to3/1', time 1.00.
< Warning: Vehicle '14' ends teleporting on edge '2/1to3/1', time 1.00.
< Warning: Vehicle '18' ends teleporting on edge '2/1to3/1', time 1.00.
< Warning: Teleporting vehicle '5'; collision with vehicle '4', lane='1/1to2/1_0', gap=-0.26, time=2.00 stage=move.
< Warning: Teleporting vehicle '12'; collision with vehicle '11', lane='1/1to2/1_0', gap=-0.38, time=2.00 stage=move.
< Warning: Teleporting vehicle '21'; collision with vehicle '20', lane='1/1to2/1_0', gap=-0.30, time=2.00 stage=move.
< Warning: Vehicle '5' ends teleporting on edge '2/1to3/1', time 2.00.
< Warning: Vehicle '12' ends teleporting on edge '2/1to3/1', time 2.00.
< Warning: Vehicle '21' ends teleporting on edge '2/1to3/1', time 2.00.
< Warning: Teleporting vehicle '3'; collision with vehicle '2', lane='1/1to2/1_0', gap=-0.44, time=3.00 stage=move.
< Warning: Teleporting vehicle '11'; collision with vehicle '10', lane='1/1to2/1_0', gap=-0.37, time=3.00 stage=move.
< Warning: Vehicle '3' ends teleporting on edge '2/1to3/1', time 3.00.
< Warning: Vehicle '11' ends teleporting on edge '2/1to3/1', time 3.00.
< Warning: Teleporting vehicle '23'; collision with vehicle '22', lane='1/1to2/1_0', gap=-0.20, time=4.00 stage=move.
< Warning: Vehicle '23' ends teleporting on edge '2/1to3/1', time 4.00.
< Warning: Teleporting vehicle '13'; collision with vehicle '10', lane='1/1to2/1_0', gap=-0.49, time=6.00 stage=move.
< Warning: Vehicle '13' ends teleporting on edge '2/1to3/1', time 6.00.
< Warning: Teleporting vehicle '4'; collision with vehicle '2', lane='1/1to2/1_0', gap=-0.03, time=7.00 stage=move.
< Warning: Vehicle '4' ends teleporting on edge '2/1to3/1', time 7.00.
< Warning: Teleporting vehicle '15'; collision with vehicle '10', lane='1/1to2/1_0', gap=-0.74, time=8.00 stage=move.
< Warning: Vehicle '15' ends teleporting on edge '2/1to3/1', time 8.00.
< Warning: Teleporting vehicle '22'; collision with vehicle '20', lane='1/1to2/1_0', gap=-0.08, time=12.00 stage=move.
< Warning: Vehicle '22' ends teleporting on edge '2/1to3/1', time 12.00.
< Warning: Teleporting vehicle '9'; collision with vehicle '7', lane='1/1to2/1_0', gap=-1.53, time=13.00 stage=move.
< Warning: Teleporting vehicle '17'; collision with vehicle '16', lane='1/1to2/1_0', gap=-0.92, time=13.00 stage=move.
< Warning: Vehicle '9' ends teleporting on edge '2/1to3/1', time 13.00.
<truncated after showing first 30 lines>
---------- Differences in output ----------
2,10d1
< Loading configuration... done.
< Loading configuration... done.
< Loading configuration... done.
< Loading configuration... done.
< Loading configuration... done.
< Loading configuration... done.
< Loading configuration... done.
< Loading configuration... done.
< Loading configuration... done.
---------- Differences in state ----------
39,63c39,63
<                 <vehicle id="24" pos="308.00" speed="0.00"/>
<                 <vehicle id="23" pos="316.00" speed="0.00"/>
<                 <vehicle id="22" pos="324.00" speed="0.00"/>
<                 <vehicle id="21" pos="332.00" speed="0.00"/>
<                 <vehicle id="20" pos="340.00" speed="0.00"/>
<                 <vehicle id="19" pos="348.00" speed="0.00"/>
<                 <vehicle id="18" pos="356.00" speed="0.00"/>
<                 <vehicle id="17" pos="364.00" speed="0.00"/>
<                 <vehicle id="16" pos="372.00" speed="0.00"/>
<                 <vehicle id="15" pos="380.00" speed="0.00"/>
<                 <vehicle id="14" pos="388.00" speed="0.00"/>
<                 <vehicle id="13" pos="396.00" speed="0.00"/>
<                 <vehicle id="12" pos="404.00" speed="0.00"/>
<                 <vehicle id="11" pos="412.00" speed="0.00"/>
<                 <vehicle id="10" pos="420.00" speed="0.00"/>
<                 <vehicle id="9" pos="428.00" speed="0.00"/>
<                 <vehicle id="8" pos="436.00" speed="0.00"/>
<                 <vehicle id="7" pos="444.00" speed="0.00"/>
<                 <vehicle id="6" pos="452.00" speed="0.00"/>
<                 <vehicle id="5" pos="460.00" speed="0.00"/>
<                 <vehicle id="4" pos="468.00" speed="0.00"/>
<                 <vehicle id="3" pos="476.00" speed="0.00"/>
<                 <vehicle id="2" pos="484.00" speed="0.00"/>
<                 <vehicle id="1" pos="492.00" speed="0.00"/>
<                 <vehicle id="0" pos="502.60" speed="2.60"/>
---
>                 <vehicle id="24" pos="308.45" speed="0.45"/>
>                 <vehicle id="23" pos="316.37" speed="0.37"/>
>                 <vehicle id="22" pos="324.33" speed="0.33"/>
<truncated after showing first 30 lines>

TEST FAILED on ts-sim-build-ba : traas api ( Last six runs Jul2019 )

---------- Differences in errors ----------
1,2c1,4
< Note: data/APITest.java uses unchecked or unsafe operations.
< Note: Recompile with -Xlint:unchecked for details.
---
> Traceback (most recent call last):
>   File "/home/delphi/extraGcc/sumo/tests/../tests/complex/traas/api/runner.py", line 30, in <module>
>     assert(os.path.exists(traasJar))
> AssertionError
---------- Differences in output ----------
1,63d0
< findRoute result stage:
<   gneE0
<   -gneE2
<   gneE2
< findIntermodalRoute result stages:
<   gneE0
<   gneE2
< Step 1.0, tlsPhase 0 (North-South)
< Step 2.0, tlsPhase 0 (North-South)
< Step 3.0, tlsPhase 0 (North-South)
< Step 4.0, tlsPhase 0 (North-South)
< Step 5.0, tlsPhase 0 (North-South)
< Step 6.0, tlsPhase 0 (North-South)
< Step 7.0, tlsPhase 0 (North-South)
< Step 8.0, tlsPhase 0 (North-South)
< Step 9.0, tlsPhase 0 (North-South)
< Step 10.0, tlsPhase 0 (North-South)
< Step 11.0, tlsPhase 0 (North-South)
< Step 12.0, tlsPhase 0 (North-South)
< Step 13.0, tlsPhase 0 (North-South)
< Step 14.0, tlsPhase 0 (North-South)
< Step 15.0, tlsPhase 0 (North-South)
< Step 16.0, tlsPhase 0 (North-South)
< Step 17.0, tlsPhase 0 (North-South)
< Step 18.0, tlsPhase 0 (North-South)
< Step 19.0, tlsPhase 0 (North-South)
< Step 20.0, tlsPhase 0 (North-South)
< Step 21.0, tlsPhase 0 (North-South)
< Step 22.0, tlsPhase 0 (North-South)
<truncated after showing first 30 lines>

TEST FAILED on ts-sim-build-ba : traci multipleConnections concurringSubscriptions sumo ( Last six runs Jul2019 )

---------- Differences in output ----------
44d43
<    1 vehicle subscription results: {'horiz': {64: 0.01613915640426617, 70: 2.6}}
46,47d44
<    1 vehicle subscription results: {'horiz': {64: 0.5315016328959228, 70: 2.6}}
<    1 vehicle subscription results: {'horiz': {64: 1.4338497789110989, 70: 2.6}}
50,51d46
<    1 vehicle subscription results: {'horiz': {64: 1.4893398348105495, 70: 2.6}}
<    1 vehicle subscription results: {'horiz': {64: 10.523440164644573, 70: 2.6}}
54,55d48
<    1 vehicle subscription results: {'horiz': {64: 10.526434975504245, 70: 2.6}}
<    1 vehicle subscription results: {'horiz': {64: 10.532165719699416, 70: 2.6}}
58d50
<    1 vehicle subscription results: {'horiz': {64: 10.535951593392829, 70: 2.6}}
60,61d51
<    1 vehicle subscription results: {'horiz': {64: 10.536626112382228, 70: 2.6}}
<    1 vehicle subscription results: {'horiz': {64: 10.54520899990138, 70: 2.6}}
64,65d53
<    1 vehicle subscription results: {'horiz': {64: 10.618038373291794, 70: 2.6}}
<    1 vehicle subscription results: {'horiz': {64: 10.638090702719357, 70: 2.6}}
68,69d55
<    1 vehicle subscription results: {'horiz': {64: 10.650777486912276, 70: 2.6}}
<    1 vehicle subscription results: {'horiz': {64: 10.66834688889794, 70: 2.6}}
72d57
<    1 vehicle subscription results: {'horiz': {64: 10.673222782849635, 70: 2.6}}
74,75d58
<    1 vehicle subscription results: {'horiz': {64: 10.689824454989585, 70: 2.6}}
<    1 vehicle subscription results: {'horiz': {64: 10.70680370327581, 70: 2.6}}
78,79d60
<    1 vehicle subscription results: {'horiz': {64: 10.715621645297224, 70: 2.6}}
<    1 vehicle subscription results: {'horiz': {64: 10.725812634164768, 70: 2.6}}
<truncated after showing first 30 lines>

TEST FAILED on ts-sim-build-ba : traci pythonApi bugs ticket5114 ( Last six runs Jul2019 )

---------- Differences in output ----------
1,8c1,8
< ('getDistanceRoad (no connection):', -1073741824.0)
< ('getDistanceRoad (normal to normal):', 110.66999999999999)
< ('getDistanceRoad (normal to 1st internal):', 41.8)
< ('getDistanceRoad (normal to 2nd internal):', 49.65)
< ('getDistanceRoad (1st internal to normal):', 52.85)
< ('getDistanceRoad (1st internal to 2nd internal):', 7.85)
< ('getDistanceRoad (2nd internal to normal):', 61.019999999999996)
< ('getDistanceRoad (2nd internal to 1st internal):', -1073741824.0)
---
> getDistanceRoad (no connection): -1073741824.0
> getDistanceRoad (normal to normal): 110.66999999999999
> getDistanceRoad (normal to 1st internal): 41.8
> getDistanceRoad (normal to 2nd internal): 49.65
> getDistanceRoad (1st internal to normal): 52.85
> getDistanceRoad (1st internal to 2nd internal): 7.85
> getDistanceRoad (2nd internal to normal): 61.019999999999996
> getDistanceRoad (2nd internal to 1st internal): -1073741824.0

TEST FAILED on ts-sim-build-ba : traci pythonApi lateralCollision laneChanging leftLane ( Last six runs Jul2019 )

---------- Differences in errors ----------
1,2c1,10
< Warning: Teleporting vehicle 'left'; collision with vehicle 'collider', lane='e2_2', gap=-7.50, time=6.00 stage=laneChange.
< Warning: Vehicle 'left' ends teleporting on edge 'e3', time 6.00.
---
> Traceback (most recent call last):
>   File "/home/delphi/extraGcc/sumo/tests/../tests/complex/traci/pythonApi/lateralCollision/laneChanging/runner.py", line 75, in <module>
>     runSingle(50, float(sys.argv[2]), "collider")
>   File "/home/delphi/extraGcc/sumo/tests/../tests/complex/traci/pythonApi/lateralCollision/laneChanging/runner.py", line 54, in runSingle
>     traci.vehicle.changeLane(vehID, laneIndex, traciEndTime)
>   File "/home/delphi/extraGcc/sumo/tools/traci/_vehicle.py", line 1019, in changeLane
>     "!BiBBBd", tc.TYPE_COMPOUND, 2, tc.TYPE_BYTE, laneIndex, tc.TYPE_DOUBLE, duration)
> struct.error: required argument is not an integer
> Error: tcpip::Socket::recvAndCheck @ recv: peer shutdown
> Quitting (on error).
---------- Differences in output ----------
12,28d11
< [005] lane 1, lateral pos: 0.00
< [006] lane 2, lateral pos: 0.00
< [007] lane 2, lateral pos: 0.00
< [008] lane 2, lateral pos: 0.00
< [009] lane 2, lateral pos: 0.00
< [010] lane 2, lateral pos: 0.00
< [011] lane 2, lateral pos: 0.00
< [012] lane 2, lateral pos: 0.00
< [013] lane 2, lateral pos: 0.00
< [014] lane 2, lateral pos: 0.00
< [015] lane 2, lateral pos: 0.00
< [016] lane 2, lateral pos: 0.00
< [017] lane 2, lateral pos: 0.00
< [018] lane 2, lateral pos: 0.00
< [019] lane 2, lateral pos: 0.00
< [020] Vehicle 'collider' has arrived at destination
< Print ended at step 21

TEST FAILED on ts-sim-build-ba : traci pythonApi lateralCollision laneChanging rightLane ( Last six runs Jul2019 )

---------- Differences in errors ----------
1,2c1,10
< Warning: Teleporting vehicle 'collider'; collision with vehicle 'right', lane='e2_0', gap=-7.50, time=6.00 stage=laneChange.
< Warning: Vehicle 'collider' ends teleporting on edge 'e3', time 6.00.
---
> Traceback (most recent call last):
>   File "/home/delphi/extraGcc/sumo/tests/../tests/complex/traci/pythonApi/lateralCollision/laneChanging/runner.py", line 75, in <module>
>     runSingle(50, float(sys.argv[2]), "collider")
>   File "/home/delphi/extraGcc/sumo/tests/../tests/complex/traci/pythonApi/lateralCollision/laneChanging/runner.py", line 54, in runSingle
>     traci.vehicle.changeLane(vehID, laneIndex, traciEndTime)
>   File "/home/delphi/extraGcc/sumo/tools/traci/_vehicle.py", line 1019, in changeLane
>     "!BiBBBd", tc.TYPE_COMPOUND, 2, tc.TYPE_BYTE, laneIndex, tc.TYPE_DOUBLE, duration)
> struct.error: required argument is not an integer
> Error: tcpip::Socket::recvAndCheck @ recv: peer shutdown
> Quitting (on error).
---------- Differences in output ----------
12,24d11
< [005] lane 1, lateral pos: 0.00
< [006] lane 0, lateral pos: 0.00
< [007] lane 0, lateral pos: 0.00
< [008] lane 0, lateral pos: 0.00
< [009] lane 0, lateral pos: 0.00
< [010] lane 0, lateral pos: 0.00
< [011] lane 0, lateral pos: 0.00
< [012] lane 0, lateral pos: 0.00
< [013] lane 0, lateral pos: 0.00
< [014] lane 0, lateral pos: 0.00
< [015] lane 0, lateral pos: 0.00
< [016] Vehicle 'collider' has arrived at destination
< Print ended at step 17

TEST FAILED on ts-sim-build-ba : traci pythonApi moveToXY elevation_sublane ( Last six runs Jul2019 )

---------- Differences in errors ----------
1c1,10
< Warning: Vehicle 'v0' performs emergency braking with decel=-9.00 wished=4.50 severity=1.00, time=4.00.
---
> Traceback (most recent call last):
>   File "/home/delphi/extraGcc/sumo/tests/../tests/complex/traci/pythonApi/moveToXY/elevation_sublane/runner.py", line 60, in <module>
>     check(50, 0, ANGLE_UNDEF, 5,        "ascending beg")
>   File "/home/delphi/extraGcc/sumo/tests/../tests/complex/traci/pythonApi/moveToXY/elevation_sublane/runner.py", line 44, in check
>     traci.vehicle.moveToXY(vehID, "", angle, x, y, keepRoute=2)
>   File "/home/delphi/extraGcc/sumo/tools/traci/_vehicle.py", line 1619, in moveToXY
>     self._connection._string += struct.pack("!Bi", tc.TYPE_INTEGER, lane)
> struct.error: required argument is not an integer
> Error: tcpip::Socket::recvAndCheck @ recv: peer shutdown
> Quitting (on error).

TEST FAILED on ts-sim-build-ba : traci pythonApi moveToXY keepRoute2 ( Last six runs Jul2019 )

---------- Differences in errors ----------
0a1,10
> Traceback (most recent call last):
>   File "/home/delphi/extraGcc/sumo/tests/../tests/complex/traci/pythonApi/moveToXY/keepRoute2/runner.py", line 69, in <module>
>     check(-1,  0,   ANGLE_UNDEF, "",         None, None,       "1m before the start of the edge")
>   File "/home/delphi/extraGcc/sumo/tests/../tests/complex/traci/pythonApi/moveToXY/keepRoute2/runner.py", line 47, in check
>     traci.vehicle.moveToXY(vehID, "", angle, x, y, keepRoute=2)
>   File "/home/delphi/extraGcc/sumo/tools/traci/_vehicle.py", line 1619, in moveToXY
>     self._connection._string += struct.pack("!Bi", tc.TYPE_INTEGER, lane)
> struct.error: required argument is not an integer
> Error: tcpip::Socket::recvAndCheck @ recv: peer shutdown
> Quitting (on error).
---------- Differences in output ----------
1d0
< vehicleList ('v0',)

TEST FAILED on ts-sim-build-ba : traci pythonApi moveToXY multi_lane ( Last six runs Jul2019 )

---------- Differences in errors ----------
0a1,10
> Traceback (most recent call last):
>   File "/home/delphi/extraGcc/sumo/tests/../tests/complex/traci/pythonApi/moveToXY/multi_lane/runner.py", line 77, in <module>
>     check(104.95, 20,   ANGLE_UNDEF, None,         None, None,       "correct lane")
>   File "/home/delphi/extraGcc/sumo/tests/../tests/complex/traci/pythonApi/moveToXY/multi_lane/runner.py", line 46, in check
>     traci.vehicle.moveToXY(vehID, "", angle, x, y)
>   File "/home/delphi/extraGcc/sumo/tools/traci/_vehicle.py", line 1619, in moveToXY
>     self._connection._string += struct.pack("!Bi", tc.TYPE_INTEGER, lane)
> struct.error: required argument is not an integer
> Error: tcpip::Socket::recvAndCheck @ recv: peer shutdown
> Quitting (on error).
---------- Differences in output ----------
1,7d0
< 2.0  lane=SC_0  right=[], []  left=[], []  accel=0.0  nextTLS=('C', 10, 71.95, 'G')  leader=None
< 3.0  lane=SC_0  right=[], []  left=['stay', 'strategic'], ['stay', 'strategic']  accel=10.0  nextTLS=('C', 10, 61.95, 'G')  leader=None
< 4.0  lane=SC_0  right=[], []  left=['stay', 'strategic'], ['stay', 'strategic']  accel=0.0  nextTLS=('C', 10, 51.95, 'G')  leader=None
< 5.0  lane=SC_1  right=[], []  left=['stay', 'strategic'], ['stay', 'strategic']  accel=7.1054273576e-15  nextTLS=('C', 10, 41.949999999999996, 'G')  leader=None
< 6.0  lane=SC_1  right=['right', 'strategic', 'urgent'], ['right', 'strategic', 'urgent']  left=[], []  accel=-1.42108547152e-14  nextTLS=('C', 10, 31.950000000000003, 'G')  leader=None
< 7.0  lane=SC_1  right=['right', 'strategic', 'urgent'], ['right', 'strategic', 'urgent']  left=[], []  accel=2.13162820728e-14  nextTLS=('C', 10, 21.94999999999999, 'G')  leader=None
< 8.0  lane=SC_1  right=['right', 'strategic', 'urgent'], ['right', 'strategic', 'urgent']  left=[], []  accel=-2.84217094304e-14  nextTLS=('C', 10, 11.950000000000003, 'G')  leader=None

TEST FAILED on ts-sim-build-ba : traci pythonApi moveToXY multi_lane_sublane ( Last six runs Jul2019 )

---------- Differences in errors ----------
0a1,10
> Traceback (most recent call last):
>   File "/home/delphi/extraGcc/sumo/tests/../tests/complex/traci/pythonApi/moveToXY/multi_lane_sublane/runner.py", line 78, in <module>
>     check(104.95, 20,   ANGLE_UNDEF, None,         None, None,       "correct lane")
>   File "/home/delphi/extraGcc/sumo/tests/../tests/complex/traci/pythonApi/moveToXY/multi_lane_sublane/runner.py", line 47, in check
>     traci.vehicle.moveToXY(vehID, "", angle, x, y)
>   File "/home/delphi/extraGcc/sumo/tools/traci/_vehicle.py", line 1619, in moveToXY
>     self._connection._string += struct.pack("!Bi", tc.TYPE_INTEGER, lane)
> struct.error: required argument is not an integer
> Error: tcpip::Socket::recvAndCheck @ recv: peer shutdown
> Quitting (on error).
---------- Differences in output ----------
1,7d0
< 2.0  lane=SC_0  right=[], []  left=[], []  accel=0.0  nextTLS=('C', 10, 71.95, 'G')  leader=None
< 3.0  lane=SC_0  right=[], []  left=['stay', 'strategic'], ['stay', 'strategic']  accel=10.0  nextTLS=('C', 10, 61.95, 'G')  leader=None
< 4.0  lane=SC_0  right=[], []  left=['stay', 'strategic'], ['stay', 'strategic']  accel=0.0  nextTLS=('C', 10, 51.95, 'G')  leader=None
< 5.0  lane=SC_1  right=[], []  left=['stay', 'strategic'], ['stay', 'strategic']  accel=7.1054273576e-15  nextTLS=('C', 10, 41.949999999999996, 'G')  leader=None
< 6.0  lane=SC_1  right=['right', 'strategic', 'urgent'], ['right', 'strategic', 'urgent']  left=[], []  accel=-1.42108547152e-14  nextTLS=('C', 10, 31.950000000000003, 'G')  leader=None
< 7.0  lane=SC_1  right=['right', 'strategic', 'urgent'], ['right', 'strategic', 'urgent']  left=[], []  accel=2.13162820728e-14  nextTLS=('C', 10, 21.94999999999999, 'G')  leader=None
< 8.0  lane=SC_1  right=['right', 'strategic', 'urgent'], ['right', 'strategic', 'urgent']  left=[], []  accel=-2.84217094304e-14  nextTLS=('C', 10, 11.950000000000003, 'G')  leader=None

TEST FAILED on ts-sim-build-ba : traci pythonApi moveToXY short_edges ( Last six runs Jul2019 )

---------- Differences in errors ----------
0a1,10
> Traceback (most recent call last):
>   File "/home/delphi/extraGcc/sumo/tests/../tests/complex/traci/pythonApi/moveToXY/short_edges/runner.py", line 71, in <module>
>     check(6.54, -1.50,  ANGLE_UNDEF, "A0toB0_0",         None, None,       "middle of the first edge")
>   File "/home/delphi/extraGcc/sumo/tests/../tests/complex/traci/pythonApi/moveToXY/short_edges/runner.py", line 50, in check
>     traci.vehicle.moveToXY(vehID, "", angle, x, y, keepRoute=2)
>   File "/home/delphi/extraGcc/sumo/tools/traci/_vehicle.py", line 1619, in moveToXY
>     self._connection._string += struct.pack("!Bi", tc.TYPE_INTEGER, lane)
> struct.error: required argument is not an integer
> Error: tcpip::Socket::recvAndCheck @ recv: peer shutdown
> Quitting (on error).

TEST FAILED on ts-sim-build-ba : traci pythonApi nextTLS ( Last six runs Jul2019 )

---------- Differences in output ----------
1,100c1,100
< (1.0, (('C', 13, 86.85000000000001, 'g'), ('C', 15, 270.75, 'r'), ('C', 10, 454.65, 'G')))
< (2.0, (('C', 13, 84.25, 'g'), ('C', 15, 268.15, 'r'), ('C', 10, 452.04999999999995, 'G')))
< (3.0, (('C', 13, 79.05000000000001, 'g'), ('C', 15, 283.41, 'r'), ('C', 10, 467.31, 'G')))
< (4.0, (('C', 13, 71.25, 'g'), ('C', 15, 275.61, 'r'), ('C', 10, 459.51, 'G')))
< (5.0, (('C', 13, 60.85, 'g'), ('C', 15, 265.21, 'r'), ('C', 10, 449.10999999999996, 'G')))
< (6.0, (('C', 13, 47.85, 'g'), ('C', 15, 252.20999999999998, 'r'), ('C', 10, 436.10999999999996, 'G')))
< (7.0, (('C', 13, 33.96, 'g'), ('C', 15, 238.32, 'r'), ('C', 10, 422.21999999999997, 'G')))
< (8.0, (('C', 13, 20.070000000000007, 'g'), ('C', 15, 224.43, 'r'), ('C', 10, 408.33, 'G')))
< (9.0, (('C', 13, 6.777000000000001, 'g'), ('C', 15, 211.137, 'r'), ('C', 10, 395.037, 'G')))
< (10.0, (('C', 15, 202.344, 'r'), ('C', 10, 386.24399999999997, 'G')))
< (11.0, (('C', 15, 190.95100000000002, 'r'), ('C', 10, 374.851, 'G')))
< (12.0, (('C', 15, 177.06099999999998, 'r'), ('C', 10, 360.96099999999996, 'G')))
< (13.0, (('C', 15, 163.171, 'r'), ('C', 10, 347.07099999999997, 'G')))
< (14.0, (('C', 15, 149.281, 'r'), ('C', 10, 333.181, 'G')))
< (15.0, (('C', 15, 135.391, 'r'), ('C', 10, 319.291, 'G')))
< (16.0, (('C', 15, 121.501, 'r'), ('C', 10, 305.401, 'G')))
< (17.0, (('C', 15, 107.61099999999999, 'r'), ('C', 10, 291.51099999999997, 'G')))
< (18.0, (('C', 15, 93.721, 'r'), ('C', 10, 277.621, 'G')))
< (19.0, (('C', 15, 79.83099999999999, 'r'), ('C', 10, 268.731, 'G')))
< (20.0, (('C', 15, 65.941, 'r'), ('C', 10, 254.841, 'G')))
< (21.0, (('C', 15, 52.050999999999995, 'r'), ('C', 10, 240.95100000000002, 'G')))
< (22.0, (('C', 15, 38.160999999999994, 'r'), ('C', 10, 227.06099999999998, 'G')))
< (23.0, (('C', 15, 24.271, 'r'), ('C', 10, 213.171, 'G')))
< (24.0, (('C', 15, 12.01433333333334, 'r'), ('C', 10, 200.91433333333333, 'G')))
< (25.0, (('C', 15, 4.257666666666665, 'r'), ('C', 10, 193.15766666666667, 'G')))
< (26.0, (('C', 15, 1.0010000000000048, 'r'), ('C', 10, 189.901, 'G')))
< (27.0, (('C', 15, 1.0010000000000048, 'r'), ('C', 10, 189.901, 'G')))
< (28.0, (('C', 15, 1.0010000000000048, 'r'), ('C', 10, 189.901, 'G')))
< (29.0, (('C', 15, 1.0010000000000048, 'r'), ('C', 10, 189.901, 'G')))
<truncated after showing first 30 lines>

2 TESTS FAILED on ts-sim-build-ba :

---------- Differences in output ----------
1000c1000
< {57: (1000.0, 501.65, 0.0), 66: (1000.0, 501.65)}
---
> {66: (1000.0, 501.65), 57: (1000.0, 501.65, 0.0)}
1002c1002
< {57: (998.686161554213, 501.65, 0.0), 66: (998.686161554213, 501.65)}
---
> {66: (998.686161554213, 501.65), 57: (998.686161554213, 501.65, 0.0)}
1004c1004
< {57: (995.9729486886459, 501.65, 0.0), 66: (995.9729486886459, 501.65)}
---
> {66: (995.9729486886459, 501.65), 57: (995.9729486886459, 501.65, 0.0)}
1006c1006
< {57: (990.7472347931362, 501.65, 0.0), 66: (990.7472347931362, 501.65)}
---
> {66: (990.7472347931362, 501.65), 57: (990.7472347931362, 501.65, 0.0)}
1008c1008
< {57: (983.5553037305922, 501.65, 0.0), 66: (983.5553037305922, 501.65)}
---
> {66: (983.5553037305922, 501.65), 57: (983.5553037305922, 501.65, 0.0)}
1010c1010
< {57: (974.0921273312639, 501.65, 0.0), 66: (974.0921273312639, 501.65)}
---
> {66: (974.0921273312639, 501.65), 57: (974.0921273312639, 501.65, 0.0)}
1012c1012
< {57: (965.346108895656, 501.65, 0.0), 66: (965.346108895656, 501.65)}
---
> {66: (965.346108895656, 501.65), 57: (965.346108895656, 501.65, 0.0)}
1014c1014
< {57: (956.4367434207072, 501.65, 0.0), 66: (956.4367434207072, 501.65)}
<truncated after showing first 30 lines>
traci pythonApi vehicle ( Last six runs Jul2019 )
traci pythonApi vehicle_sublane ( Last six runs Jul2019 )

TEST FAILED on ts-sim-build-ba : tutorial city_mobil ( Last six runs Jul2019 )

---------- Differences in output ----------
4c4
< waiting time (max, mean, dev): True True True
---
> waiting time (max, mean, dev): False True False
22c22
< waiting time (max, mean, dev): True True True
---
> waiting time (max, mean, dev): False True False

Detailed information for the tests that had known bugs:

TEST had known bugs (bug 1691 (NONEXISTENT)) on ts-sim-build-ba : netconvert dlr-navteq_roundtrip ( Last six runs Jul2019 )

Failed to open URL 'https://sumo.dlr.de/trac.wsgi/ticket/1691?format=tab': HTTP Error 404: Not Found.

Please make sure that bug 1691 exists
and that the configuration entry 'bug_system_location' points to the correct trac instance.
The current value is 'https://sumo.dlr.de/trac.wsgi/'.
(This bug was triggered by text found in file 'net' matching '.*')
---------- Differences in net ----------
4c4
< <net version="1.1" junctionCornerDetail="5" limitTurnSpeed="5.50" xmlns:xsi="http://www.w3.org/2001/XMLSchema-instance" xsi:noNamespaceSchemaLocation="http://sumo.dlr.de/xsd/net_file.xsd">
---
> <net version="1.3" junctionCornerDetail="5" limitTurnSpeed="5.50" xmlns:xsi="http://www.w3.org/2001/XMLSchema-instance" xsi:noNamespaceSchemaLocation="http://sumo.dlr.de/xsd/net_file.xsd">
2768c2768
<     <connection from="-26816553" to="26816541" fromLane="0" toLane="0" via=":294168098_5_0" dir="L" state="="/>
---
>     <connection from="-26816553" to="26816541" fromLane="0" toLane="0" via=":294168098_5_0" dir="l" state="="/>
2975c2975
<     <connection from="27445116" to="27445117" fromLane="0" toLane="0" via=":294169338_0_0" dir="s" state="="/>
---
>     <connection from="27445116" to="27445117" fromLane="0" toLane="0" via=":294169338_0_0" dir="R" state="="/>
3216c3216
<     <connection from=":294168098_5" to="26816541" fromLane="0" toLane="0" dir="L" state="M"/>
---
>     <connection from=":294168098_5" to="26816541" fromLane="0" toLane="0" dir="l" state="M"/>
3241c3241
<     <connection from=":294169338_0" to="27445117" fromLane="0" toLane="0" dir="s" state="M"/>
---
>     <connection from=":294169338_0" to="27445117" fromLane="0" toLane="0" dir="R" state="M"/>

TEST had known bugs (bug 1691 (NONEXISTENT)) on ts-sim-build-ba : netconvert matsim_roundtrip ( Last six runs Jul2019 )

Failed to open URL 'https://sumo.dlr.de/trac.wsgi/ticket/1691?format=tab': HTTP Error 404: Not Found.

Please make sure that bug 1691 exists
and that the configuration entry 'bug_system_location' points to the correct trac instance.
The current value is 'https://sumo.dlr.de/trac.wsgi/'.
(This bug was triggered by text found in file 'net' matching '.*')
---------- Differences in net ----------
4c4
< <net version="1.1" junctionCornerDetail="5" limitTurnSpeed="5.50" xmlns:xsi="http://www.w3.org/2001/XMLSchema-instance" xsi:noNamespaceSchemaLocation="http://sumo.dlr.de/xsd/net_file.xsd">
---
> <net version="1.3" junctionCornerDetail="5" limitTurnSpeed="5.50" xmlns:xsi="http://www.w3.org/2001/XMLSchema-instance" xsi:noNamespaceSchemaLocation="http://sumo.dlr.de/xsd/net_file.xsd">
880c880
<         <lane id=":294830184_7_0" index="0" speed="5.56" length="14.38" shape="915.07,462.77 918.06,460.17 921.14,459.20 924.29,459.87 927.52,462.17"/>
---
>         <lane id=":294830184_7_0" index="0" speed="5.56" length="13.52" shape="915.07,462.77 917.74,460.95 921.19,460.22 924.69,460.61 927.52,462.17"/>
3708c3708
<     <connection from="-26004787#2" to="26004966#2" fromLane="0" toLane="0" via=":283722837_12_0" dir="s" state="="/>
---
>     <connection from="-26004787#2" to="26004966#2" fromLane="0" toLane="0" via=":283722837_12_0" dir="R" state="="/>
3724c3724
<     <connection from="-26004868#0" to="-5198585#7" fromLane="0" toLane="0" via=":283719736_13_0" dir="R" state="m"/>
---
>     <connection from="-26004868#0" to="-5198585#7" fromLane="0" toLane="0" via=":283719736_13_0" dir="r" state="m"/>
3747c3747
<     <connection from="-26816553" to="-26816413#1" fromLane="0" toLane="0" via=":294168098_4_0" dir="R" state="="/>
---
>     <connection from="-26816553" to="-26816413#1" fromLane="0" toLane="0" via=":294168098_4_0" dir="r" state="="/>
4015c4015
<     <connection from="26816413#1" to="26816553" fromLane="0" toLane="0" via=":294168098_1_0" dir="L" state="="/>
---
>     <connection from="26816413#1" to="26816553" fromLane="0" toLane="0" via=":294168098_1_0" dir="l" state="="/>
4023c4023
<     <connection from="26816590#0" to="26816590#1" fromLane="0" toLane="0" via=":294169338_0_0" dir="s" state="="/>
---
>     <connection from="26816590#0" to="26816590#1" fromLane="0" toLane="0" via=":294169338_0_0" dir="R" state="="/>
4037c4037
<     <connection from="26843038#0" to="26843038#1" fromLane="0" toLane="0" via=":294830184_7_0" dir="L" state="="/>
<truncated after showing first 30 lines>

TEST had known bugs (see #254) on ts-sim-build-ba : sumo output one_vehicle ( Last six runs Jul2019 )

different outputs from detectors which should detect the same
(This bug was triggered by text found in file 'output' matching 'failed')
---------- Differences in output ----------
10c10
< success 0.1 ['--step-length', '.1', '--end', '100'] ['3/1to2/1_0']
---
> failed 0.1 ['--step-length', '.1', '--end', '100'] 3/1to2/1_0 (71.3, 71.4) <zip object at 0x7f89fc44ffc8>
12c12
< success 1 ['--step-length', '.1', '--end', '100'] ['3/1to2/1_0']
---
> failed 1 ['--step-length', '.1', '--end', '100'] 3/1to2/1_0 (72.0, 73.0) <zip object at 0x7f89fd2c7548>
14c14
< success 10 ['--step-length', '.1', '--end', '100'] ['3/1to2/1_0']
---
> failed 10 ['--step-length', '.1', '--end', '100'] 3/1to2/1_0 (80.0, 90.0) <zip object at 0x7f89fdac0988>
18c18
< success 0.1 ['--step-length', '.1', '--end', '1000'] ['3/1to2/1_0']
---
> failed 0.1 ['--step-length', '.1', '--end', '1000'] 3/1to2/1_0 (71.3, 71.4) <zip object at 0x7f89fc162fc8>
20c20
< success 1 ['--step-length', '.1', '--end', '1000'] ['3/1to2/1_0']
---
> failed 1 ['--step-length', '.1', '--end', '1000'] 3/1to2/1_0 (72.0, 73.0) <zip object at 0x7f89fc43c148>
22c22
< success 10 ['--step-length', '.1', '--end', '1000'] ['3/1to2/1_0']
---
> failed 10 ['--step-length', '.1', '--end', '1000'] 3/1to2/1_0 (80.0, 90.0) <zip object at 0x7f89fdac0988>
24c24
< success 100 ['--step-length', '.1', '--end', '1000'] ['3/1to2/1_0']
---
> failed 100 ['--step-length', '.1', '--end', '1000'] 3/1to2/1_0 (100.0, 200.0) <zip object at 0x7f89fc43c608>
34c34
< success 0.1 ['--step-length', '1', '--end', '100'] ['3/1to2/1_0']
<truncated after showing first 30 lines>

TEST had known bugs (see #254) on ts-sim-build-ba : sumo output teleport ( Last six runs Jul2019 )

different outputs from detectors which should detect the same
(This bug was triggered by text found in file 'output' matching 'failed')
---------- Differences in output ----------
2c2
< success ['--step-length', '.1', '--end', '51'] ['2/1to1/1_0']
---
> success 0.1 ['--step-length', '.1', '--end', '51'] ['2/1to1/1_0']
4c4
< success ['--step-length', '.1', '--end', '51'] ['2/1to1/1_0', '1/1to0/1_0']
---
> success 0.1 ['--step-length', '.1', '--end', '51'] ['2/1to1/1_0', '1/1to0/1_0']
6c6
< success ['--step-length', '.1', '--end', '51'] ['2/1to1/1_0']
---
> success 1 ['--step-length', '.1', '--end', '51'] ['2/1to1/1_0']
8c8
< success ['--step-length', '.1', '--end', '51'] ['2/1to1/1_0', '1/1to0/1_0']
---
> success 1 ['--step-length', '.1', '--end', '51'] ['2/1to1/1_0', '1/1to0/1_0']
10c10
< success ['--step-length', '.1', '--end', '51'] ['2/1to1/1_0']
---
> success 10 ['--step-length', '.1', '--end', '51'] ['2/1to1/1_0']
12c12
< success ['--step-length', '.1', '--end', '51'] ['2/1to1/1_0', '1/1to0/1_0']
---
> success 10 ['--step-length', '.1', '--end', '51'] ['2/1to1/1_0', '1/1to0/1_0']
14c14
< success ['--step-length', '.1', '--end', '51'] ['2/1to1/1_0']
---
> success 100 ['--step-length', '.1', '--end', '51'] ['2/1to1/1_0']
16c16
< success ['--step-length', '.1', '--end', '51'] ['2/1to1/1_0', '1/1to0/1_0']
<truncated after showing first 30 lines>

TEST had known bugs (see #254) on ts-sim-build-ba : sumo output teleport_multihop ( Last six runs Jul2019 )

different outputs from detectors which should detect the same
(This bug was triggered by text found in file 'output' matching 'failed')
---------- Differences in output ----------
34c34
< success 0.1 ['--step-length', '.1', '--end', '1000'] 2/1to1/1_0 (230.0, 230.1) [('e2', 9.99), ('e3', 10.0), ('edge', 9.99), ('lane', 9.99)]
---
> failed 0.1 ['--step-length', '.1', '--end', '1000'] 2/1to1/1_0 (149.0, 149.1) <zip object at 0x7f26961a2fc8>
36c36
< success 0.1 ['--step-length', '.1', '--end', '1000'] 1/1to0/1_0 (148.1, 148.2) [('e2', 9.99), ('e3', 10.0), ('edge', 9.99), ('lane', 9.99)]
---
> failed 0.1 ['--step-length', '.1', '--end', '1000'] 2/1to1/1_0 (149.0, 149.1) <zip object at 0x7f2695e51148>
38c38
< success 1 ['--step-length', '.1', '--end', '1000'] 2/1to1/1_0 (230.0, 231.0) [('e2', 9.99), ('e3', 10.0), ('edge', 9.99), ('lane', 9.99)]
---
> failed 1 ['--step-length', '.1', '--end', '1000'] 2/1to1/1_0 (149.0, 150.0) <zip object at 0x7f269616e108>
40c40
< success 1 ['--step-length', '.1', '--end', '1000'] 1/1to0/1_0 (148.0, 149.0) [('e2', 9.91), ('e3', 10.0), ('edge', 9.91), ('lane', 9.91)]
---
> failed 1 ['--step-length', '.1', '--end', '1000'] 2/1to1/1_0 (149.0, 150.0) <zip object at 0x7f269656eb08>
42c42
< success 10 ['--step-length', '.1', '--end', '1000'] 2/1to1/1_0 (230.0, 240.0) [('e2', 9.42), ('e3', 9.9), ('edge', 9.42), ('lane', 9.42)]
---
> failed 10 ['--step-length', '.1', '--end', '1000'] 2/1to1/1_0 (140.0, 150.0) <zip object at 0x7f2697c399c8>
44c44
< success 10 ['--step-length', '.1', '--end', '1000'] 1/1to0/1_0 (140.0, 150.0) [('e2', 9.96), ('e3', 9.99), ('edge', 9.96), ('lane', 9.96)]
---
> failed 10 ['--step-length', '.1', '--end', '1000'] 2/1to1/1_0 (140.0, 150.0) <zip object at 0x7f2697c399c8>
46c46
< success 100 ['--step-length', '.1', '--end', '1000'] 2/1to1/1_0 (200.0, 300.0) [('e1', 10.0), ('e2', 9.22), ('e3', 5.71), ('edge', 9.22), ('lane', 9.22)]
---
> failed 100 ['--step-length', '.1', '--end', '1000'] 2/1to1/1_0 (100.0, 200.0) <zip object at 0x7f269744a048>
48c48
< success 100 ['--step-length', '.1', '--end', '1000'] 1/1to0/1_0 (100.0, 200.0) [('e1', 9.53), ('e2', 5.82), ('e3', 6.93), ('edge', 5.82), ('lane', 5.82)]
<truncated after showing first 30 lines>

TEST had known bugs (see #254) on ts-sim-build-ba : sumo output teleport_multihop_newDefaults ( Last six runs Jul2019 )

different outputs from detectors which should detect the same
(This bug was triggered by text found in file 'output' matching 'failed')
---------- Differences in output ----------
18c18
< success 0.1 ['--step-length', '.1', '--end', '100'] ['2/1to1/1_0']
---
> failed 0.1 ['--step-length', '.1', '--end', '100'] 2/1to1/1_0 (76.2, 76.3) <zip object at 0x7fd4964d16c8>
20c20
< success 0.1 ['--step-length', '.1', '--end', '100'] ['2/1to1/1_0', '1/1to0/1_0']
---
> failed 0.1 ['--step-length', '.1', '--end', '100'] 2/1to1/1_0 (76.2, 76.3) <zip object at 0x7fd496495308>
22c22
< success 1 ['--step-length', '.1', '--end', '100'] ['2/1to1/1_0']
---
> failed 1 ['--step-length', '.1', '--end', '100'] 2/1to1/1_0 (76.0, 77.0) <zip object at 0x7fd497c3f3c8>
24c24
< success 1 ['--step-length', '.1', '--end', '100'] ['2/1to1/1_0', '1/1to0/1_0']
---
> failed 1 ['--step-length', '.1', '--end', '100'] 2/1to1/1_0 (76.0, 77.0) <zip object at 0x7fd497af2c48>
26c26
< success 10 ['--step-length', '.1', '--end', '100'] ['2/1to1/1_0']
---
> failed 10 ['--step-length', '.1', '--end', '100'] 2/1to1/1_0 (70.0, 80.0) <zip object at 0x7fd49739f608>
28c28
< success 10 ['--step-length', '.1', '--end', '100'] ['2/1to1/1_0', '1/1to0/1_0']
---
> failed 10 ['--step-length', '.1', '--end', '100'] 2/1to1/1_0 (70.0, 80.0) <zip object at 0x7fd49739f608>
30c30
< success 100 ['--step-length', '.1', '--end', '100'] ['2/1to1/1_0']
---
> failed 100 ['--step-length', '.1', '--end', '100'] 2/1to1/1_0 (0.0, 100.0) <zip object at 0x7fd49739f608>
32c32
< success 100 ['--step-length', '.1', '--end', '100'] ['2/1to1/1_0', '1/1to0/1_0']
<truncated after showing first 30 lines>

TEST had known bugs (see #254) on ts-sim-build-ba : sumo output two_same_vehicles ( Last six runs Jul2019 )

different outputs from detectors which should detect the same
(This bug was triggered by text found in file 'output' matching 'failed')
---------- Differences in output ----------
10c10
< success 0.1 ['--step-length', '.1', '--end', '100'] ['3/1to2/1_0']
---
> failed 0.1 ['--step-length', '.1', '--end', '100'] 3/1to2/1_0 (75.4, 75.5) <zip object at 0x7f2cb29bbfc8>
12c12
< success 1 ['--step-length', '.1', '--end', '100'] ['3/1to2/1_0']
---
> failed 1 ['--step-length', '.1', '--end', '100'] 3/1to2/1_0 (76.0, 77.0) <zip object at 0x7f2cb4029988>
14c14
< success 10 ['--step-length', '.1', '--end', '100'] ['3/1to2/1_0']
---
> failed 10 ['--step-length', '.1', '--end', '100'] 3/1to2/1_0 (80.0, 90.0) <zip object at 0x7f2cb4029988>
18c18
< success 0.1 ['--step-length', '.1', '--end', '1000'] ['3/1to2/1_0']
---
> failed 0.1 ['--step-length', '.1', '--end', '1000'] 3/1to2/1_0 (75.4, 75.5) <zip object at 0x7f2cb26cffc8>
20c20
< success 1 ['--step-length', '.1', '--end', '1000'] ['3/1to2/1_0']
---
> failed 1 ['--step-length', '.1', '--end', '1000'] 3/1to2/1_0 (76.0, 77.0) <zip object at 0x7f2cb29ca608>
22c22
< success 10 ['--step-length', '.1', '--end', '1000'] ['3/1to2/1_0']
---
> failed 10 ['--step-length', '.1', '--end', '1000'] 3/1to2/1_0 (80.0, 90.0) <zip object at 0x7f2cb29ca608>
24c24
< success 100 ['--step-length', '.1', '--end', '1000'] ['3/1to2/1_0']
---
> failed 100 ['--step-length', '.1', '--end', '1000'] 3/1to2/1_0 (100.0, 200.0) <zip object at 0x7f2cb29a6888>
34c34
< success 0.1 ['--step-length', '1', '--end', '100'] ['3/1to2/1_0']
<truncated after showing first 30 lines>

TEST had known bugs (see #254) on ts-sim-build-ba : sumo output two_vehicles_diff_length ( Last six runs Jul2019 )

different outputs from detectors which should detect the same
(This bug was triggered by text found in file 'output' matching 'failed')
---------- Differences in output ----------
10c10
< success 0.1 ['--step-length', '.1', '--end', '100'] ['3/1to2/1_0']
---
> failed 0.1 ['--step-length', '.1', '--end', '100'] 3/1to2/1_0 (76.4, 76.5) <zip object at 0x7f91b4d91fc8>
12c12
< success 1 ['--step-length', '.1', '--end', '100'] ['3/1to2/1_0']
---
> failed 1 ['--step-length', '.1', '--end', '100'] 3/1to2/1_0 (77.0, 78.0) <zip object at 0x7f91b6400988>
14c14
< success 10 ['--step-length', '.1', '--end', '100'] ['3/1to2/1_0']
---
> failed 10 ['--step-length', '.1', '--end', '100'] 3/1to2/1_0 (80.0, 90.0) <zip object at 0x7f91b5c074c8>
18c18
< success 0.1 ['--step-length', '.1', '--end', '1000'] ['3/1to2/1_0']
---
> failed 0.1 ['--step-length', '.1', '--end', '1000'] 3/1to2/1_0 (76.4, 76.5) <zip object at 0x7f91b4aa5fc8>
20c20
< success 1 ['--step-length', '.1', '--end', '1000'] ['3/1to2/1_0']
---
> failed 1 ['--step-length', '.1', '--end', '1000'] 3/1to2/1_0 (77.0, 78.0) <zip object at 0x7f91b4dbb188>
22c22
< success 10 ['--step-length', '.1', '--end', '1000'] ['3/1to2/1_0']
---
> failed 10 ['--step-length', '.1', '--end', '1000'] 3/1to2/1_0 (80.0, 90.0) <zip object at 0x7f91b4dbbc88>
24c24
< success 100 ['--step-length', '.1', '--end', '1000'] ['3/1to2/1_0']
---
> failed 100 ['--step-length', '.1', '--end', '1000'] 3/1to2/1_0 (100.0, 200.0) <zip object at 0x7f91b4dd7e08>
34c34
< success 0.1 ['--step-length', '1', '--end', '100'] ['3/1to2/1_0']
<truncated after showing first 30 lines>

TEST had known bugs (see #254) on ts-sim-build-ba : sumo output two_vehicles_diff_speed ( Last six runs Jul2019 )

different outputs from detectors which should detect the same
(This bug was triggered by text found in file 'output' matching 'failed')
---------- Differences in output ----------
0a1,48
> Loading configuration... done.
> failed 0.1 ['--step-length', '.1', '--end', '51'] 3/1to2/1_0 (38.4, 38.5) <zip object at 0x7f8fd5879908>
> Loading configuration... done.
> failed 1 ['--step-length', '.1', '--end', '51'] 3/1to2/1_0 (38.0, 39.0) <zip object at 0x7f8fd5879088>
> Loading configuration... done.
> failed 10 ['--step-length', '.1', '--end', '51'] 3/1to2/1_0 (30.0, 40.0) <zip object at 0x7f8fd5879088>
> Loading configuration... done.
> failed 100 ['--step-length', '.1', '--end', '51'] 3/1to2/1_0 (0.0, 51.0) <zip object at 0x7f8fd58790c8>
> Loading configuration... done.
> failed 0.1 ['--step-length', '.1', '--end', '100'] 3/1to2/1_0 (38.4, 38.5) <zip object at 0x7f8fd582bfc8>
> Loading configuration... done.
> failed 1 ['--step-length', '.1', '--end', '100'] 3/1to2/1_0 (38.0, 39.0) <zip object at 0x7f8fd6f2a6c8>
> Loading configuration... done.
> failed 10 ['--step-length', '.1', '--end', '100'] 3/1to2/1_0 (30.0, 40.0) <zip object at 0x7f8fd6f2a6c8>
> Loading configuration... done.
> failed 100 ['--step-length', '.1', '--end', '100'] 3/1to2/1_0 (0.0, 100.0) <zip object at 0x7f8fd6f923c8>
> Loading configuration... done.
> failed 0.1 ['--step-length', '.1', '--end', '1000'] 3/1to2/1_0 (38.4, 38.5) <zip object at 0x7f8fd54c1fc8>
> Loading configuration... done.
> failed 1 ['--step-length', '.1', '--end', '1000'] 3/1to2/1_0 (38.0, 39.0) <zip object at 0x7f8fd5838608>
> Loading configuration... done.
> failed 10 ['--step-length', '.1', '--end', '1000'] 3/1to2/1_0 (30.0, 40.0) <zip object at 0x7f8fd58141c8>
> Loading configuration... done.
> failed 100 ['--step-length', '.1', '--end', '1000'] 3/1to2/1_0 (0.0, 100.0) <zip object at 0x7f8fd5864e08>
> Loading configuration... done.
> failed 0.1 ['--step-length', '1', '--end', '51'] 3/1to2/1_0 (39.0, 40.0) <zip object at 0x7f8fd5864e08>
> Loading configuration... done.
> failed 1 ['--step-length', '1', '--end', '51'] 3/1to2/1_0 (39.0, 40.0) <zip object at 0x7f8fd5864dc8>
> Loading configuration... done.
<truncated after showing first 30 lines>

TEST had known bugs (#4727) on ts-sim-build-ba : traci ContextSubscriptionFilters leadFollow carFollowing ( Last six runs Jul2019 )

#4727
(This bug was triggered by text found in file 'output' matching '.')
---------- Differences in output ----------
4d3
< lead_straight
6d4
< [002] Context results for vehicle 'ego':
7a6
> [002] Context results for vehicle 'ego':
9d7
< [003] Context results for vehicle 'ego':
10a9
> [003] Context results for vehicle 'ego':
12d10
< [004] Context results for vehicle 'ego':
13a12
> [004] Context results for vehicle 'ego':
15d13
< [005] Context results for vehicle 'ego':
16a15
> [005] Context results for vehicle 'ego':
18d16
< [006] Context results for vehicle 'ego':
19a18
> [006] Context results for vehicle 'ego':
21d19
< [007] Context results for vehicle 'ego':
22a21
> [007] Context results for vehicle 'ego':
24d22
< [008] Context results for vehicle 'ego':
25a24
> [008] Context results for vehicle 'ego':
<truncated after showing first 30 lines>

2 TESTS had known bugs (#4727) on ts-sim-build-ba :

#4727
(This bug was triggered by text found in file 'output' matching '.')
---------- Differences in output ----------
4a5
> follow_straight
7d7
< follow_straight
9a10
> follow_straight
12d12
< follow_straight
14a15
> follow_straight
17d17
< follow_straight
19a20
> follow_straight
22d22
< follow_straight
24a25
> follow_straight
27d27
< follow_straight
29a30
> follow_straight
32d32
< follow_straight
34a35
> follow_straight
37d37
< follow_straight
39a40
> follow_straight
<truncated after showing first 30 lines>
traci ContextSubscriptionFilters leadFollow laneChangeLeft ( Last six runs Jul2019 )
traci ContextSubscriptionFilters leadFollow laneChangeRight ( Last six runs Jul2019 )

TEST had known bugs (#4727) on ts-sim-build-ba : traci ContextSubscriptionFilters leadFollow laneChangeNeighbors ( Last six runs Jul2019 )

#4727
(This bug was triggered by text found in file 'output' matching '.')
---------- Differences in output ----------
4,5d3
< follow_straight
< follow_right
6a5,7
> follow_right
> follow_straight
> lead_left
9d9
< lead_left
11,12d10
< follow_straight
< follow_right
13a12,14
> follow_right
> follow_straight
> lead_left
16d16
< lead_left
18,19d17
< follow_straight
< follow_right
20a19,21
> follow_right
> follow_straight
> lead_left
23d23
< lead_left
25,26d24
< follow_straight
< follow_right
<truncated after showing first 30 lines>

TEST had known bugs (see #5383) on ts-sim-build-ba : traci pythonApi moveToXY permissions ( Last six runs Jul2019 )

mapping failure
(This bug was triggered by text found in file 'output' matching 'failed')
---------- Differences in output ----------
0a1
> shifted to left lane (permissions) failed: mode=2 x=40, x2=40.0,   y=-1.5, y2=-1.5,   lane=beg_1, lane2=, pos=40, pos2=-1073741824.0   posLat=0.0 posLat2=-1073741824.0