26Sep2020 - detailed test results for COMPLEX

To reconnect the TextTest GUI to these results, run:

texttest -a complex -d /home/delphi/extraGcc/sumo/tests -reconnect /home/delphi/extraGcc/texttesttmp/extra_gcc4_64.02Oct060543.29876 -g

To start TextTest for these tests, run:

texttest -a complex -d /home/delphi/extraGcc/sumo/tests

Total: 854 tests: 699 succeeded 132 FAILED 23 known bugs


libsumo.python3: 244 tests: 222 succeeded 15 FAILED 7 known bugs

Detailed information for the tests that FAILED:

TEST FAILED on ts-sim-build-ba : traci bugs ticket4432 ( Last six runs Oct2020 Sep2020 )

---------- Differences in output ----------
19a20,38
> Loading net-file from 'input_net.net.xml' ... done ((TIME)).
> Loading done.
> Simulation started with time: 0.00
> Reason: Libsumo requested termination.
> Performance: 
> Vehicles: 
>  Inserted: 100
>  Running: 0
>  Waiting: 0
> Statistics (avg):
>  RouteLength: 189.19
>  Speed: 5.45
>  Duration: 42.78
>  WaitingTime: 17.44
>  TimeLoss: 28.61
>  DepartDelay: 1.04
> 
> DijkstraRouter answered 100 queries and explored 3.52 edges on average.
> DijkstraRouter spent (TIME) answering queries ((TIME) on average).
23c42,43
< logfile after load: None
---
> logfile after load: DijkstraRouter spent (TIME) answering queries ((TIME) on average).
> 
30c50,51
< Simulation ended at time: 161.00
---
> Simulation ended at time: 160.00
> Simulation ended at time: 160.00
<truncated after showing first 30 lines>

TEST FAILED on ts-sim-build-ba : traci bugs ticket5561 ( Last six runs Oct2020 Sep2020 )

---------- Differences in errors ----------
1,4c1,4
< Warning: Ignoring unordered stop at 'busStop1' until -0.00  for vehicle 'bus'.
< Warning: Ignoring unordered stop at 'busStop2' until -0.00  for vehicle 'bus'.
< Warning: Ignoring unordered stop at 'busStop3' until -0.00  for vehicle 'bus'.
< Warning: Not using public transport line 'line' for routing persons. It has less than two usable stops.
---
> Traceback (most recent call last):
>   File "/home/delphi/extraGcc/sumo/tests/../tests/complex/traci/bugs/ticket5561/runner.py", line 39, in <module>
>     bus_stop_pos = stop[1]
> TypeError: 'TraCINextStopData' object does not support indexing
---------- Differences in output ----------
2d1
< abort stop at busStop2 at t=49.0

TEST FAILED on ts-sim-build-ba : traci bugs ticket7057 ( Last six runs Oct2020 Sep2020 )

---------- Differences in output ----------
1c1
< pois in range {'poi0': {}}
---
> pois in range {'poi0': {0: ('poi0',)}}
3c3
< pois in range {'poi0': {}, 'poi1': {}}
---
> pois in range {'poi0': {0: ('poi0', 'poi1')}, 'poi1': {0: ('poi0', 'poi1')}}
5,6c5,6
< pois in range {'poi1': {}}
< polys in range {'poly0': {}}
---
> pois in range {'poi1': {0: ('poi1',)}}
> polys in range {'poly0': {0: ('poly0',)}}
8c8
< polys in range [('poly0', {}), ('poly1', {})]
---
> polys in range [('poly0', {0: ('poly0', 'poly1')}), ('poly1', {0: ('poly0', 'poly1')})]
10c10
< polys in range {'poly0': {}}
---
> polys in range {'poly0': {0: ('poly0',)}}

TEST FAILED on ts-sim-build-ba : traci meandata meandata ( Last six runs Oct2020 Sep2020 )

---------- Differences in detector ----------
2a3,4
> <!-- generated on Sun Sep 27 06:14:51 2020 by 
> <configuration xmlns:xsi="http://www.w3.org/2001/XMLSchema-instance" xsi:noNamespaceSchemaLocation="http://sumo.dlr.de/xsd/Configuration.xsd">
4,19c6,27
< <meandata xmlns:xsi="http://www.w3.org/2001/XMLSchema-instance" xsi:noNamespaceSchemaLocation="http://sumo.dlr.de/xsd/meandata_file.xsd">
<     <interval begin="0.00" end="3.00" id="meandata_ID">
<         <edge id="1fi" sampledSeconds="0.00" departed="0" arrived="0" entered="0" left="0" laneChangedFrom="0" laneChangedTo="0"/>
<         <edge id="1o" sampledSeconds="0.00" departed="0" arrived="0" entered="0" left="0" laneChangedFrom="0" laneChangedTo="0"/>
<         <edge id="1si" sampledSeconds="0.00" departed="0" arrived="0" entered="0" left="0" laneChangedFrom="0" laneChangedTo="0"/>
<         <edge id="2fi" sampledSeconds="0.00" departed="0" arrived="0" entered="0" left="0" laneChangedFrom="0" laneChangedTo="0"/>
<         <edge id="2o" sampledSeconds="0.00" departed="0" arrived="0" entered="0" left="0" laneChangedFrom="0" laneChangedTo="0"/>
<         <edge id="2si" sampledSeconds="0.00" departed="0" arrived="0" entered="0" left="0" laneChangedFrom="0" laneChangedTo="0"/>
<         <edge id="3fi" sampledSeconds="0.00" departed="0" arrived="0" entered="0" left="0" laneChangedFrom="0" laneChangedTo="0"/>
<         <edge id="3o" sampledSeconds="0.00" departed="0" arrived="0" entered="0" left="0" laneChangedFrom="0" laneChangedTo="0"/>
<         <edge id="3si" sampledSeconds="0.00" departed="0" arrived="0" entered="0" left="0" laneChangedFrom="0" laneChangedTo="0"/>
<         <edge id="4fi" sampledSeconds="0.00" departed="0" arrived="0" entered="0" left="0" laneChangedFrom="0" laneChangedTo="0"/>
<         <edge id="4o" sampledSeconds="0.00" departed="0" arrived="0" entered="0" left="0" laneChangedFrom="0" laneChangedTo="0"/>
<         <edge id="4si" sampledSeconds="0.00" departed="0" arrived="0" entered="0" left="0" laneChangedFrom="0" laneChangedTo="0"/>
<     </interval>
< </meandata>
---
>     <input>
>         <net-file value="input_net.net.xml"/>
>         <route-files value="input_routes.rou.xml"/>
>         <additional-files value="input_additional2.add.xml"/>
>     </input>
> 
>     <processing>
>         <time-to-teleport value="-1"/>
>         <default.speeddev value="0"/>
<truncated after showing first 30 lines>
---------- Differences in errors ----------
0a1,4
> Traceback (most recent call last):
>   File "/home/delphi/extraGcc/sumo/tests/../tests/complex/traci/meandata/meandata/runner.py", line 35, in <module>
>     print("meandata", traci.meandata.getIDList())
> AttributeError: module 'traci' has no attribute 'meandata'
---------- Differences in output ----------
5,7d4
< meandata ('meandata_ID',)
< meandata count 1
< examining meandata_ID

TEST FAILED on ts-sim-build-ba : traci misc rerouting routingMode rerouteTraveltime_default ( Last six runs Oct2020 Sep2020 )

---------- Differences in vehroutes ----------
19,20c19,30
<     <vehicle id="flow.2" depart="20.00" arrival="80.00">
<         <route edges="beg detour end"/>
---
>     <vehicle id="flow.2" depart="20.00" arrival="52.00">
>         <routeDistribution>
>             <route replacedOnEdge="beg" reason="traci:rerouteTraveltime" replacedAtTime="21.00" probability="0" edges="beg detour end"/>
>             <route edges="beg middle middle2 end"/>
>         </routeDistribution>
>     </vehicle>
> 
>     <vehicle id="flow.3" depart="30.00" arrival="81.00">
>         <routeDistribution>
>             <route replacedOnEdge="beg" reason="traci:rerouteTraveltime" replacedAtTime="31.00" probability="0" edges="beg detour end"/>
>             <route edges="beg middle middle2 end"/>
>         </routeDistribution>
23c33
<     <vehicle id="flow.4" depart="40.00" arrival="81.00">
---
>     <vehicle id="flow.4" depart="40.00" arrival="83.00">
30c40
<     <vehicle id="flow.5" depart="50.00" arrival="83.00">
---
>     <vehicle id="flow.5" depart="50.00" arrival="85.00">
37,38c47,51
<     <vehicle id="flow.3" depart="30.00" arrival="90.00">
<         <route edges="beg detour end"/>
---
>     <vehicle id="flow.6" depart="60.00" arrival="114.00">
>         <routeDistribution>
<truncated after showing first 30 lines>

TEST FAILED on ts-sim-build-ba : traci person moveToXY leaveRoute_jaywalk ( Last six runs Oct2020 Sep2020 )

---------- Differences in vehroutes ----------
5c5
<     <person id="p0" type="DEFAULT_PEDTYPE@p0" depart="0.00" departPos="40.00" arrival="111.00">
---
>     <person id="p0" depart="0.00" departPos="40.00" arrival="111.00">

TEST FAILED on ts-sim-build-ba : traci rerouter rerouter ( Last six runs Oct2020 Sep2020 )

---------- Differences in errors ----------
0a1,4
> Traceback (most recent call last):
>   File "/home/delphi/extraGcc/sumo/tests/../tests/complex/traci/rerouter/rerouter/runner.py", line 35, in <module>
>     print("rerouters", traci.rerouter.getIDList())
> AttributeError: module 'traci' has no attribute 'rerouter'
---------- Differences in output ----------
5,6d4
< rerouters ('rerouter_0',)
< rerouter count 1

TEST FAILED on ts-sim-build-ba : traci routeprobe routeprobe ( Last six runs Oct2020 Sep2020 )

---------- Differences in errors ----------
1,129c1,4
< Error: RouteProbe '0' did not collect any routes yet
< Error: RouteProbe '0' did not collect any routes yet
< Error: RouteProbe '0' did not collect any routes yet
< Error: RouteProbe '0' did not collect any routes yet
< Error: RouteProbe '0' did not collect any routes yet
< Error: RouteProbe '0' did not collect any routes yet
< Error: RouteProbe '0' did not collect any routes yet
< Error: RouteProbe '0' did not collect any routes yet
< Error: RouteProbe '0' did not collect any routes yet
< Error: RouteProbe '0' did not collect any routes yet
< Error: RouteProbe '0' did not collect any routes yet
< Error: RouteProbe '0' did not collect any routes yet
< Error: RouteProbe '0' did not collect any routes yet
< Error: RouteProbe '0' did not collect any routes yet
< Error: RouteProbe '0' did not collect any routes yet
< Error: RouteProbe '0' did not collect any routes yet
< Error: RouteProbe '0' did not collect any routes yet
< Error: RouteProbe '0' did not collect any routes yet
< Error: RouteProbe '0' did not collect any routes yet
< Error: RouteProbe '0' did not collect any routes yet
< Error: RouteProbe '0' did not collect any routes yet
< Error: RouteProbe '0' did not collect any routes yet
< Error: RouteProbe '0' did not collect any routes yet
< Error: RouteProbe '0' did not collect any routes yet
< Error: RouteProbe '0' did not collect any routes yet
< Error: RouteProbe '0' did not collect any routes yet
< Error: RouteProbe '0' did not collect any routes yet
< Error: RouteProbe '0' did not collect any routes yet
< Error: RouteProbe '0' did not collect any routes yet
<truncated after showing first 30 lines>
---------- Differences in output ----------
5,280d4
< routeprobes ('0',)
< routeprobe count 1
< edge 2fi
< 3.0 last=!1 cur=!1
< 4.0 last=!1 cur=!1
< 5.0 last=!1 cur=!1
< 6.0 last=!1 cur=!1
< 7.0 last=!1 cur=!1
< 8.0 last=!1 cur=!1
< 9.0 last=!1 cur=!1
< 10.0 last=!1 cur=!1
< 11.0 last=!1 cur=!1
< 12.0 last=!1 cur=!11
< 13.0 last=!1 cur=!11
< 14.0 last=!1 cur=!11
< 15.0 last=!11 cur=!11
< 16.0 last=!11 cur=!1
< 17.0 last=!11 cur=!1
< 18.0 last=!1 cur=!1
< 19.0 last=!11 cur=!1
< 20.0 last=!11 cur=!1
< 21.0 last=!11 cur=!1
< 22.0 last=!1 cur=!1
< 23.0 last=!1 cur=!11
< 24.0 last=!1 cur=!1
< 25.0 last=!1 cur=!11
< 26.0 last=!1 cur=!25
< 27.0 last=!1 cur=!25
< 28.0 last=!25 cur=!11
<truncated after showing first 30 lines>

TEST FAILED on ts-sim-build-ba : traci simulation load ( Last six runs Oct2020 Sep2020 )

---------- Differences in log ----------
5c5
< Simulation ended at time: 4.00
---
> Simulation ended at time: 3.00
7,13d6
< Loading configuration ... done.
< Loading net-file from 'input_net.net.xml' ... done ((TIME)).
< Loading additional-files from 'input_additional2.add.xml' ... done ((TIME)).
< Loading done.
< Simulation started with time: 0.00
< Simulation ended at time: 361.00
< Reason: Libsumo requested termination.
---------- Differences in output ----------
2a3,4
> Loading configuration ... done.
> Loading configuration ... done.

TEST FAILED on ts-sim-build-ba : traci trafficlight getBlocking_reroute ( Last six runs Oct2020 Sep2020 )

---------- Differences in output ----------
1,2c1,2
< ('blocker1',)
< ('blocker2',)
---
> ()
> ()

TEST FAILED on ts-sim-build-ba : traci trafficlight railsignal_state ( Last six runs Oct2020 Sep2020 )

---------- Differences in output ----------
6c6
< 3.0 N2_0 b=() r=('rail3',) p=('rail3',)
---
> 3.0 N2_0 b=() r=() p=()
8c8
< 4.0 N2_0 b=() r=('rail3',) p=('rail3',)
---
> 4.0 N2_0 b=() r=() p=()
10c10
< 5.0 N2_0 b=() r=('rail3',) p=('rail3',)
---
> 5.0 N2_0 b=() r=() p=()
12c12
< 6.0 N2_0 b=() r=('rail3',) p=('rail3',)
---
> 6.0 N2_0 b=() r=() p=()
14c14
< 7.0 N2_0 b=() r=('rail3',) p=('rail3',)
---
> 7.0 N2_0 b=() r=() p=()
16c16
< 8.0 N2_0 b=() r=('rail3',) p=('rail3',)
---
> 8.0 N2_0 b=() r=() p=()
18c18
< 9.0 N2_0 b=() r=('rail3',) p=('rail3',)
---
> 9.0 N2_0 b=() r=() p=()
20c20
< 10.0 N2_0 b=() r=('rail3',) p=('rail3',)
<truncated after showing first 30 lines>

TEST FAILED on ts-sim-build-ba : traci variablespeedsign variablespeedsign ( Last six runs Oct2020 Sep2020 )

---------- Differences in errors ----------
0a1,4
> Traceback (most recent call last):
>   File "/home/delphi/extraGcc/sumo/tests/../tests/complex/traci/variablespeedsign/variablespeedsign/runner.py", line 35, in <module>
>     print("variablespeedsign", traci.variablespeedsign.getIDList())
> AttributeError: module 'traci' has no attribute 'variablespeedsign'
---------- Differences in output ----------
5,8d4
< variablespeedsign ('VSS_ID',)
< variablespeedsign count 1
< examining VSS_ID
< lanes ('2si_1', '1si_1')

TEST FAILED on ts-sim-build-ba : traci vehicle getFollower ( Last six runs Oct2020 Sep2020 )

---------- Differences in errors ----------
1d0
< Error: Vehicle 'ego' is not known.

2 TESTS FAILED on ts-sim-build-ba :

---------- Differences in output ----------
255c255
< (('2fi_0', 55.0, '', 2, 2.0, -1073741824.0),)
---
> (StopData(lane=2fi_0, startPos=54.9, endPos=55.0, stopFlags=1, duration=2.0),)
258c258
< (('2fi_0', 55.0, '', 2, 2.0, -1073741824.0),)
---
> (StopData(lane=2fi_0, startPos=54.9, endPos=55.0, stopFlags=1, duration=2.0),)
261c261
< (('2fi_0', 55.0, '', 3, 2.0, -1073741824.0),)
---
> (StopData(lane=2fi_0, startPos=54.9, endPos=55.0, stopFlags=1, duration=2.0, arrival=9.0),)
264c264
< (('2fi_0', 55.0, '', 3, 1.0, -1073741824.0),)
---
> (StopData(lane=2fi_0, startPos=54.9, endPos=55.0, stopFlags=1, duration=1.0, arrival=9.0),)
506c506
< nextStop: (('2fi_0', 20.0, '', 2, 10.0, -1073741824.0),)
---
> nextStop: (StopData(lane=2fi_0, startPos=19.9, endPos=20.0, stopFlags=1, duration=10.0),)
traci vehicle vehicle ( Last six runs Oct2020 Sep2020 )
traci vehicle vehicle_sublane ( Last six runs Oct2020 Sep2020 )

Detailed information for the tests that had known bugs:

TEST had known bugs (#4727) on ts-sim-build-ba : traci ContextSubscriptionFilters leadFollow carFollowing ( Last six runs Oct2020 Sep2020 )

#4727
(This bug was triggered by text found in file 'output' matching '.')
---------- Differences in output ----------
4d3
< lead_straight
6d4
< [002] Context results for vehicle 'ego':
7a6
> [002] Context results for vehicle 'ego':
9d7
< [003] Context results for vehicle 'ego':
10a9
> [003] Context results for vehicle 'ego':
12d10
< [004] Context results for vehicle 'ego':
13a12
> [004] Context results for vehicle 'ego':
15d13
< [005] Context results for vehicle 'ego':
16a15
> [005] Context results for vehicle 'ego':
18d16
< [006] Context results for vehicle 'ego':
19a18
> [006] Context results for vehicle 'ego':
21d19
< [007] Context results for vehicle 'ego':
22a21
> [007] Context results for vehicle 'ego':
24d22
< [008] Context results for vehicle 'ego':
25a24
> [008] Context results for vehicle 'ego':
<truncated after showing first 30 lines>

2 TESTS had known bugs (#4727) on ts-sim-build-ba :

#4727
(This bug was triggered by text found in file 'output' matching '.')
---------- Differences in output ----------
4a5
> follow_straight
7d7
< follow_straight
9a10
> follow_straight
12d12
< follow_straight
14a15
> follow_straight
17d17
< follow_straight
19a20
> follow_straight
22d22
< follow_straight
24a25
> follow_straight
27d27
< follow_straight
29a30
> follow_straight
32d32
< follow_straight
34a35
> follow_straight
37d37
< follow_straight
39a40
> follow_straight
<truncated after showing first 30 lines>
traci ContextSubscriptionFilters leadFollow laneChangeLeft ( Last six runs Oct2020 Sep2020 )
traci ContextSubscriptionFilters leadFollow laneChangeRight ( Last six runs Oct2020 Sep2020 )

TEST had known bugs (#4727) on ts-sim-build-ba : traci ContextSubscriptionFilters leadFollow laneChangeNeighbors ( Last six runs Oct2020 Sep2020 )

#4727
(This bug was triggered by text found in file 'output' matching '.')
---------- Differences in output ----------
4,5d3
< follow_straight
< follow_right
6a5,7
> follow_right
> follow_straight
> lead_left
9d9
< lead_left
11,12d10
< follow_straight
< follow_right
13a12,14
> follow_right
> follow_straight
> lead_left
16d16
< lead_left
18,19d17
< follow_straight
< follow_right
20a19,21
> follow_right
> follow_straight
> lead_left
23d23
< lead_left
25,26d24
< follow_straight
< follow_right
<truncated after showing first 30 lines>

TEST had known bugs (see #3263) on ts-sim-build-ba : traci vehicle moveToXY keepRoute2 ( Last six runs Oct2020 Sep2020 )

mapping failure
(This bug was triggered by text found in file 'output' matching 'failed')
---------- Differences in output ----------
0a1,2
> internal corner (inside, segment2) failed: x=198, x2=198.0,   y=1.9, y2=1.9,   lane=middle_0, lane2=middle_0, pos=102, pos2=98.0   posLat=2.0 posLat2=1.9
> internal corner (outside, far) failed: x=203, x2=203.0,   y=-4, y2=-4.0,   lane=, lane2=middle_0, pos=-1073741824.0, pos2=100.0   posLat=-1073741824.0 posLat2=-1.4142135623730951

TEST had known bugs (see #5383) on ts-sim-build-ba : traci vehicle moveToXY permissions ( Last six runs Oct2020 Sep2020 )

mapping failure
(This bug was triggered by text found in file 'output' matching 'failed')
---------- Differences in output ----------
0a1
> right lane (ignore permissions) failed: mode=6 x=40, x2=40.0,   y=-1.6, y2=-1.6,   lane=beg_0, lane2=, pos=40, pos2=-1073741824.0   posLat=0.0 posLat2=-1073741824.0

TEST had known bugs (see #6192) on ts-sim-build-ba : traci vehicle openGap with_low_maxDecel_fast_CACC ( Last six runs Oct2020 Sep2020 )

not even failing as intended
(This bug was triggered by text found in file 'errors' matching 'Error')
---------- Differences in errors ----------
0a1,6
> Traceback (most recent call last):
>   File "/home/delphi/extraGcc/sumo/tests/../tests/complex/traci/vehicle/openGap/runner.py", line 155, in <module>
>     runSingle(targetTimeHeadway, targetSpaceHeadway, duration, changeRate, maxDecel, refVehID)
>   File "/home/delphi/extraGcc/sumo/tests/../tests/complex/traci/vehicle/openGap/runner.py", line 82, in runSingle
>     leaderSpeed = traci.vehicle.getSubscriptionResults(leaderID)[tc.VAR_SPEED]
> KeyError: 64
---------- Differences in output ----------
4,103c4,103
< Time 2.0: Gap 'follower'->'leader' = 5.938 (headway=0.367)
< 'follower' speed = 16.161582708
< Time 3.0: Gap 'follower'->'leader' = 8.966 (headway=0.528)
< 'follower' speed = 16.9836198736
< Time 4.0: Gap 'follower'->'leader' = 11.281 (headway=0.641)
< 'follower' speed = 17.5863190784
< Time 5.0: Gap 'follower'->'leader' = 13.069 (headway=0.725)
< 'follower' speed = 18.0379935645
< Time 6.0: Gap 'follower'->'leader' = 14.459 (headway=0.787)
< 'follower' speed = 18.3815472225
< Time 7.0: Gap 'follower'->'leader' = 15.545 (headway=0.834)
< 'follower' speed = 18.6456171431
< Time 8.0: Gap 'follower'->'leader' = 16.397 (headway=0.870)
< 'follower' speed = 18.8501483763
< Time 9.0: Gap 'follower'->'leader' = 17.068 (headway=0.898)
< 'follower' speed = 19.0094667411
< Time 10.0: Gap 'follower'->'leader' = 17.596 (headway=0.920)
< 'follower' speed = 19.1340998278
< Time 11.0: Gap 'follower'->'leader' = 18.013 (headway=0.937)
< 'follower' speed = 19.231918606
< Time 12.0: Gap 'follower'->'leader' = 18.342 (headway=0.950)
< 'follower' speed = 19.3088858604
< Time 13.0: Gap 'follower'->'leader' = 18.603 (headway=0.960)
< 'follower' speed = 19.3695649077
< Time 14.0: Gap 'follower'->'leader' = 18.810 (headway=0.969)
< 'follower' speed = 19.4174756866
< Time 15.0: Gap 'follower'->'leader' = 18.973 (headway=0.975)
< 'follower' speed = 19.4553500651
< Time 16.0: Gap 'follower'->'leader' = 19.103 (headway=0.980)
<truncated after showing first 30 lines>

meso: 221 tests: 116 succeeded 104 FAILED 1 known bugs

Detailed information for the tests that FAILED:

TEST FAILED on ts-sim-build-ba : state dists_xml ( Last six runs Oct2020 Sep2020 )

---------- Differences in state ----------
10,12d9
<     <vType id="DEFAULT_BIKETYPE" vClass="bicycle"/>
<     <vType id="DEFAULT_CONTAINERTYPE" vClass="ignoring"/>
<     <vType id="DEFAULT_PEDTYPE" vClass="pedestrian"/>

TEST FAILED on ts-sim-build-ba : state flow ( Last six runs Oct2020 Sep2020 )

---------- Differences in state ----------
13,15d12
<     <vType id="DEFAULT_BIKETYPE" vClass="bicycle"/>
<     <vType id="DEFAULT_CONTAINERTYPE" vClass="ignoring"/>
<     <vType id="DEFAULT_PEDTYPE" vClass="pedestrian"/>

TEST FAILED on ts-sim-build-ba : state multique ( Last six runs Oct2020 Sep2020 )

---------- Differences in state ----------
8,10d7
<     <vType id="DEFAULT_BIKETYPE" vClass="bicycle"/>
<     <vType id="DEFAULT_CONTAINERTYPE" vClass="ignoring"/>
<     <vType id="DEFAULT_PEDTYPE" vClass="pedestrian"/>
12c9
<     <vehicle id="0.2" type="DEFAULT_VEHTYPE" depart="00:00:20" route="!0" speedFactor="1.01" state="20000 0 0 0 1 26384 20000 9223372036854775807">
---
>     <vehicle id="0.2" type="DEFAULT_VEHTYPE" depart="00:00:20" route="!0" speedFactor="1.01" state="20000 0 0 0 0 26384 20000 9223372036854775807">
25a23,106
>         <vehicles time="-1" value=""/>
>     </segment>
>     <segment>
>         <vehicles time="-1" value=""/>
>     </segment>
>     <segment>
>         <vehicles time="-1" value=""/>
>     </segment>
>     <segment>
>         <vehicles time="-1" value=""/>
>     </segment>
>     <segment>
>         <vehicles time="-1" value=""/>
>     </segment>
>     <segment>
>         <vehicles time="-1" value=""/>
>     </segment>
>     <segment>
>         <vehicles time="-1" value=""/>
>     </segment>
>     <segment>
<truncated after showing first 30 lines>

TEST FAILED on ts-sim-build-ba : state rerouting ( Last six runs Oct2020 Sep2020 )

---------- Differences in state ----------
6c6
<     <route id="!veh276!var#1" state="0" edges="gneE0 gneE4 gneE5 gneE3"/>
---
>     <route id="!veh276!var#1" state="0" edges="gneE0 gneE1 gneE2 gneE3"/>
15d14
<     <route id="!veh280!var#2" state="0" edges="gneE0 gneE4 gneE5 gneE3"/>
22d20
<     <route id="!veh283!var#2" state="0" edges="gneE0 gneE4 gneE5 gneE3"/>
30c28
<     <route id="!veh287!var#1" state="0" edges="gneE0 gneE4 gneE5 gneE3"/>
---
>     <route id="!veh287!var#1" state="0" edges="gneE0 gneE1 gneE2 gneE3"/>
52c50
<     <route id="!veh298!var#1" state="0" edges="gneE0 gneE4 gneE5 gneE3"/>
---
>     <route id="!veh298!var#1" state="0" edges="gneE0 gneE1 gneE2 gneE3"/>
54c52
<     <route id="!veh299!var#1" state="0" edges="gneE0 gneE4 gneE5 gneE3"/>
---
>     <route id="!veh299!var#1" state="0" edges="gneE0 gneE1 gneE2 gneE3"/>
62c60
<     <route id="!veh303!var#1" state="0" edges="gneE0 gneE4 gneE5 gneE3"/>
---
>     <route id="!veh303!var#1" state="0" edges="gneE0 gneE1 gneE2 gneE3"/>
66c64
<     <route id="!veh305!var#1" state="0" edges="gneE0 gneE4 gneE5 gneE3"/>
---
>     <route id="!veh305!var#1" state="0" edges="gneE0 gneE1 gneE2 gneE3"/>
72c70
<     <route id="!veh308!var#1" state="0" edges="gneE0 gneE4 gneE5 gneE3"/>
<truncated after showing first 30 lines>
---------- Differences in vehroutes ----------
446,449c446
<         <routeDistribution>
<             <route replacedOnEdge="gneE0" reason="device.rerouting" replacedAtTime="188.00" probability="0" edges="gneE0 gneE1 gneE2 gneE3"/>
<             <route edges="gneE0 gneE4 gneE5 gneE3"/>
<         </routeDistribution>
---
>         <route edges="gneE0 gneE1 gneE2 gneE3"/>
469,472c466
<         <routeDistribution>
<             <route replacedOnEdge="gneE0" reason="device.rerouting" replacedAtTime="196.00" probability="0" edges="gneE0 gneE1 gneE2 gneE3"/>
<             <route edges="gneE0 gneE4 gneE5 gneE3"/>
<         </routeDistribution>
---
>         <route edges="gneE0 gneE1 gneE2 gneE3"/>
580,583c574
<         <routeDistribution>
<             <route replacedOnEdge="gneE0" reason="device.rerouting" replacedAtTime="243.00" probability="0" edges="gneE0 gneE4 gneE5 gneE3"/>
<             <route edges="gneE0 gneE1 gneE2 gneE3"/>
<         </routeDistribution>
---
>         <route edges="gneE0 gneE4 gneE5 gneE3"/>
607,610c598
<         <routeDistribution>
<             <route replacedOnEdge="gneE0" reason="device.rerouting" replacedAtTime="253.00" probability="0" edges="gneE0 gneE4 gneE5 gneE3"/>
<             <route edges="gneE0 gneE1 gneE2 gneE3"/>
<         </routeDistribution>
---
>         <route edges="gneE0 gneE4 gneE5 gneE3"/>
618,621c606
<         <routeDistribution>
<truncated after showing first 30 lines>
---------- Differences in vehroutes2 ----------
8c8
<             <route edges="gneE0 gneE4 gneE5 gneE3"/>
---
>             <route edges="gneE0 gneE1 gneE2 gneE3"/>
36,37c36
<             <route replacedOnEdge="gneE0" reason="device.rerouting" replacedAtTime="483.00" probability="0" edges="gneE0 gneE1 gneE2 gneE3"/>
<             <route edges="gneE0 gneE4 gneE5 gneE3"/>
---
>             <route edges="gneE0 gneE1 gneE2 gneE3"/>
58,59c57
<             <route replacedOnEdge="gneE0" reason="device.rerouting" replacedAtTime="488.00" probability="0" edges="gneE0 gneE1 gneE2 gneE3"/>
<             <route edges="gneE0 gneE4 gneE5 gneE3"/>
---
>             <route edges="gneE0 gneE1 gneE2 gneE3"/>
87c85
<             <route edges="gneE0 gneE4 gneE5 gneE3"/>
---
>             <route edges="gneE0 gneE1 gneE2 gneE3"/>
91c89
<     <vehicle id="veh288" type="default" depart="497.00" departPos="0.00" arrivalPos="80.00" arrivalSpeed="0.00" speedFactor="0.89" arrival="524.00">
---
>     <vehicle id="veh289" type="default" depart="498.00" departPos="0.00" arrivalPos="80.00" arrivalSpeed="0.00" speedFactor="1.10" arrival="524.00">
94c92
<             <route edges="gneE0 gneE1 gneE2 gneE3"/>
---
>             <route edges="gneE0 gneE4 gneE5 gneE3"/>
98c96
<     <vehicle id="veh289" type="default" depart="498.00" departPos="0.00" arrivalPos="80.00" arrivalSpeed="0.00" speedFactor="1.10" arrival="526.00">
---
>     <vehicle id="veh288" type="default" depart="497.00" departPos="0.00" arrivalPos="80.00" arrivalSpeed="0.00" speedFactor="0.89" arrival="526.00">
<truncated after showing first 30 lines>

TEST FAILED on ts-sim-build-ba : state xml ( Last six runs Oct2020 Sep2020 )

---------- Differences in state ----------
7,9d6
<     <vType id="DEFAULT_BIKETYPE" vClass="bicycle"/>
<     <vType id="DEFAULT_CONTAINERTYPE" vClass="ignoring"/>
<     <vType id="DEFAULT_PEDTYPE" vClass="pedestrian"/>

TEST FAILED on ts-sim-build-ba : traci ContextSubscriptionFilters fieldOfVision incompatible_filter ( Last six runs Oct2020 Sep2020 )

---------- Differences in errors ----------
1c1
< Warning: Ignoring field of vision subscription filter due to incompatibility with other filter(s).
---
> 
---------- Differences in output ----------
1,8c1
< Subscribing to context of vehicle 'ego' (range=50.0)
< Adding field of vision subscription filter ... (openingAngle=90.0)
< Context results for veh 'ego':
< ego
< v8
< v9
< Ok: Unsubscribe successful
< Print ended at step 3.0
---
> Usage: runner <sumo/sumo-gui> <range> <openingAngle> <testWithIncompatibleFilter (0/1)>

TEST FAILED on ts-sim-build-ba : traci ContextSubscriptionFilters fieldOfVision persons range_50_angle_90 ( Last six runs Oct2020 Sep2020 )

---------- Differences in errors ----------
0a1
> 
---------- Differences in output ----------
1,6c1
< Subscribing to context of vehicle 'ego' (range=50.0)
< Adding field of vision subscription filter ... (openingAngle=90.0)
< Context results for veh 'ego':
< p9
< Ok: Unsubscribe successful
< Print ended at step 3.0
---
> Usage: runner <sumo/sumo-gui> <range> <openingAngle> <testWithIncompatibleFilter (0/1)>

TEST FAILED on ts-sim-build-ba : traci ContextSubscriptionFilters fieldOfVision range_0_angle_90 ( Last six runs Oct2020 Sep2020 )

---------- Differences in errors ----------
0a1
> 
---------- Differences in output ----------
1,6c1
< Subscribing to context of vehicle 'ego' (range=0.0)
< Adding field of vision subscription filter ... (openingAngle=90.0)
< Context results for veh 'ego':
< ego
< Ok: Unsubscribe successful
< Print ended at step 3.0
---
> Usage: runner <sumo/sumo-gui> <range> <openingAngle> <testWithIncompatibleFilter (0/1)>

TEST FAILED on ts-sim-build-ba : traci ContextSubscriptionFilters fieldOfVision range_50_angle_0 ( Last six runs Oct2020 Sep2020 )

---------- Differences in errors ----------
1c1
< Warning: Field of vision opening angle ('0.00') should be within interval (0, 360), ignoring filter...
---
> 
---------- Differences in output ----------
1,9c1
< Subscribing to context of vehicle 'ego' (range=50.0)
< Adding field of vision subscription filter ... (openingAngle=0.0)
< Context results for veh 'ego':
< ego
< v10
< v8
< v9
< Ok: Unsubscribe successful
< Print ended at step 3.0
---
> Usage: runner <sumo/sumo-gui> <range> <openingAngle> <testWithIncompatibleFilter (0/1)>

TEST FAILED on ts-sim-build-ba : traci ContextSubscriptionFilters fieldOfVision range_50_angle_270 ( Last six runs Oct2020 Sep2020 )

---------- Differences in errors ----------
0a1
> 
---------- Differences in output ----------
1,8c1
< Subscribing to context of vehicle 'ego' (range=50.0)
< Adding field of vision subscription filter ... (openingAngle=270.0)
< Context results for veh 'ego':
< ego
< v10
< v9
< Ok: Unsubscribe successful
< Print ended at step 3.0
---
> Usage: runner <sumo/sumo-gui> <range> <openingAngle> <testWithIncompatibleFilter (0/1)>

TEST FAILED on ts-sim-build-ba : traci ContextSubscriptionFilters fieldOfVision range_50_angle_360 ( Last six runs Oct2020 Sep2020 )

---------- Differences in errors ----------
1c1
< Warning: Field of vision opening angle ('360.00') should be within interval (0, 360), ignoring filter...
---
> 
---------- Differences in output ----------
1,9c1
< Subscribing to context of vehicle 'ego' (range=50.0)
< Adding field of vision subscription filter ... (openingAngle=360.0)
< Context results for veh 'ego':
< ego
< v10
< v8
< v9
< Ok: Unsubscribe successful
< Print ended at step 3.0
---
> Usage: runner <sumo/sumo-gui> <range> <openingAngle> <testWithIncompatibleFilter (0/1)>

TEST FAILED on ts-sim-build-ba : traci ContextSubscriptionFilters fieldOfVision range_50_angle_90 ( Last six runs Oct2020 Sep2020 )

---------- Differences in errors ----------
0a1
> 
---------- Differences in output ----------
1,7c1
< Subscribing to context of vehicle 'ego' (range=50.0)
< Adding field of vision subscription filter ... (openingAngle=90.0)
< Context results for veh 'ego':
< ego
< v9
< Ok: Unsubscribe successful
< Print ended at step 3.0
---
> Usage: runner <sumo/sumo-gui> <range> <openingAngle> <testWithIncompatibleFilter (0/1)>

TEST FAILED on ts-sim-build-ba : traci ContextSubscriptionFilters lanesUpDownDistance lanesLeftOpposite ( Last six runs Oct2020 Sep2020 )

---------- Differences in errors ----------
0a1,4
> Traceback (most recent call last):
>   File "/home/delphi/extraGcc/sumo/tests/../tests/complex/traci/ContextSubscriptionFilters/lanesUpDownDistance/runner.py", line 81, in <module>
>     runSingle(100, float(sys.argv[2]), "ego")
> ValueError: could not convert string to float: sumo
---------- Differences in output ----------
1,202d0
< Loading configuration ... done.
< Subscribing to vehicle context of object 'ego'
< [001] Context results for vehicle 'ego':
< follow_left
< follow_left2
< lead_left
< lead_left2
< [002] Context results for vehicle 'ego':
< follow_left
< follow_left2
< lead_left
< lead_left2
< [003] Context results for vehicle 'ego':
< follow_left
< follow_left2
< lead_left
< lead_left2
< [004] Context results for vehicle 'ego':
< follow_left
< follow_left2
< lead_left
< lead_left2
< [005] Context results for vehicle 'ego':
< follow_left
< follow_left2
< lead_left
< lead_left2
< [006] Context results for vehicle 'ego':
< follow_left
<truncated after showing first 30 lines>

TEST FAILED on ts-sim-build-ba : traci ContextSubscriptionFilters lanesUpDownDistance lanesLeftOppositeDownDistZero ( Last six runs Oct2020 Sep2020 )

---------- Differences in errors ----------
0a1,4
> Traceback (most recent call last):
>   File "/home/delphi/extraGcc/sumo/tests/../tests/complex/traci/ContextSubscriptionFilters/lanesUpDownDistance/runner.py", line 81, in <module>
>     runSingle(100, float(sys.argv[2]), "ego")
> ValueError: could not convert string to float: sumo
---------- Differences in output ----------
1,133d0
< Loading configuration ... done.
< Subscribing to vehicle context of object 'ego'
< [001] Context results for vehicle 'ego':
< follow_left
< follow_left2
< [002] Context results for vehicle 'ego':
< follow_left
< follow_left2
< [003] Context results for vehicle 'ego':
< follow_left
< follow_left2
< [004] Context results for vehicle 'ego':
< follow_left
< follow_left2
< [005] Context results for vehicle 'ego':
< follow_left
< follow_left2
< [006] Context results for vehicle 'ego':
< follow_left
< follow_left2
< [007] Context results for vehicle 'ego':
< follow_left
< follow_left2
< [008] Context results for vehicle 'ego':
< follow_left
< follow_left2
< [009] Context results for vehicle 'ego':
< follow_left
< follow_left2
<truncated after showing first 30 lines>

TEST FAILED on ts-sim-build-ba : traci ContextSubscriptionFilters lanesUpDownDistance lanesLeftOppositeUpDistZero ( Last six runs Oct2020 Sep2020 )

---------- Differences in errors ----------
0a1,4
> Traceback (most recent call last):
>   File "/home/delphi/extraGcc/sumo/tests/../tests/complex/traci/ContextSubscriptionFilters/lanesUpDownDistance/runner.py", line 81, in <module>
>     runSingle(100, float(sys.argv[2]), "ego")
> ValueError: could not convert string to float: sumo
---------- Differences in output ----------
1,112d0
< Loading configuration ... done.
< Subscribing to vehicle context of object 'ego'
< [001] Context results for vehicle 'ego':
< lead_left
< lead_left2
< [002] Context results for vehicle 'ego':
< lead_left
< lead_left2
< [003] Context results for vehicle 'ego':
< lead_left
< lead_left2
< [004] Context results for vehicle 'ego':
< lead_left
< lead_left2
< [005] Context results for vehicle 'ego':
< lead_left
< lead_left2
< [006] Context results for vehicle 'ego':
< lead_left
< lead_left2
< [007] Context results for vehicle 'ego':
< lead_left
< lead_left2
< opposite_lead_left
< [008] Context results for vehicle 'ego':
< lead_left
< lead_left2
< opposite_lead_left
< opposite_lead_left2
<truncated after showing first 30 lines>

TEST FAILED on ts-sim-build-ba : traci ContextSubscriptionFilters lanesUpDownDistance lanesOppositeAll ( Last six runs Oct2020 Sep2020 )

---------- Differences in errors ----------
0a1,4
> Traceback (most recent call last):
>   File "/home/delphi/extraGcc/sumo/tests/../tests/complex/traci/ContextSubscriptionFilters/lanesUpDownDistance/runner.py", line 81, in <module>
>     runSingle(100, float(sys.argv[2]), "ego")
> ValueError: could not convert string to float: sumo
---------- Differences in output ----------
1,180d0
< Loading configuration ... done.
< Subscribing to vehicle context of object 'ego'
< [001] Context results for vehicle 'ego':
< [002] Context results for vehicle 'ego':
< [003] Context results for vehicle 'ego':
< [004] Context results for vehicle 'ego':
< [005] Context results for vehicle 'ego':
< [006] Context results for vehicle 'ego':
< [007] Context results for vehicle 'ego':
< opposite_lead_left
< opposite_lead_middle
< opposite_lead_right
< [008] Context results for vehicle 'ego':
< opposite_lead_left
< opposite_lead_left2
< opposite_lead_middle
< opposite_lead_right
< opposite_lead_right2
< [009] Context results for vehicle 'ego':
< opposite_lead_left
< opposite_lead_left2
< opposite_lead_middle
< opposite_lead_middle2
< opposite_lead_right
< opposite_lead_right2
< [010] Context results for vehicle 'ego':
< opposite_follow_left2
< opposite_follow_middle2
< opposite_follow_right2
<truncated after showing first 30 lines>

TEST FAILED on ts-sim-build-ba : traci ContextSubscriptionFilters lanesUpDownDistance lanesOppositeAllDownDistZero ( Last six runs Oct2020 Sep2020 )

---------- Differences in errors ----------
0a1,4
> Traceback (most recent call last):
>   File "/home/delphi/extraGcc/sumo/tests/../tests/complex/traci/ContextSubscriptionFilters/lanesUpDownDistance/runner.py", line 81, in <module>
>     runSingle(100, float(sys.argv[2]), "ego")
> ValueError: could not convert string to float: sumo
---------- Differences in output ----------
1,111d0
< Loading configuration ... done.
< Subscribing to vehicle context of object 'ego'
< [001] Context results for vehicle 'ego':
< [002] Context results for vehicle 'ego':
< [003] Context results for vehicle 'ego':
< [004] Context results for vehicle 'ego':
< [005] Context results for vehicle 'ego':
< [006] Context results for vehicle 'ego':
< [007] Context results for vehicle 'ego':
< [008] Context results for vehicle 'ego':
< [009] Context results for vehicle 'ego':
< [010] Context results for vehicle 'ego':
< [011] Context results for vehicle 'ego':
< [012] Context results for vehicle 'ego':
< opposite_lead_right
< [013] Context results for vehicle 'ego':
< opposite_lead_left
< opposite_lead_middle
< opposite_lead_right
< [014] Context results for vehicle 'ego':
< opposite_lead_left
< opposite_lead_left2
< opposite_lead_middle
< opposite_lead_middle2
< opposite_lead_right
< opposite_lead_right2
< [015] Context results for vehicle 'ego':
< opposite_follow_right2
< opposite_lead_left
<truncated after showing first 30 lines>

TEST FAILED on ts-sim-build-ba : traci ContextSubscriptionFilters lanesUpDownDistance lanesOppositeAllUpDistZero ( Last six runs Oct2020 Sep2020 )

---------- Differences in errors ----------
0a1,4
> Traceback (most recent call last):
>   File "/home/delphi/extraGcc/sumo/tests/../tests/complex/traci/ContextSubscriptionFilters/lanesUpDownDistance/runner.py", line 81, in <module>
>     runSingle(100, float(sys.argv[2]), "ego")
> ValueError: could not convert string to float: sumo
---------- Differences in output ----------
1,109d0
< Loading configuration ... done.
< Subscribing to vehicle context of object 'ego'
< [001] Context results for vehicle 'ego':
< [002] Context results for vehicle 'ego':
< [003] Context results for vehicle 'ego':
< [004] Context results for vehicle 'ego':
< [005] Context results for vehicle 'ego':
< [006] Context results for vehicle 'ego':
< [007] Context results for vehicle 'ego':
< opposite_lead_left
< opposite_lead_middle
< opposite_lead_right
< [008] Context results for vehicle 'ego':
< opposite_lead_left
< opposite_lead_left2
< opposite_lead_middle
< opposite_lead_right
< opposite_lead_right2
< [009] Context results for vehicle 'ego':
< opposite_lead_left
< opposite_lead_left2
< opposite_lead_middle
< opposite_lead_middle2
< opposite_lead_right
< opposite_lead_right2
< [010] Context results for vehicle 'ego':
< opposite_follow_left2
< opposite_follow_middle2
< opposite_follow_right2
<truncated after showing first 30 lines>

3 TESTS FAILED on ts-sim-build-ba :

---------- Differences in errors ----------
0a1,4
> Traceback (most recent call last):
>   File "/home/delphi/extraGcc/sumo/tests/../tests/complex/traci/ContextSubscriptionFilters/lanesUpDownDistance/runner.py", line 81, in <module>
>     runSingle(100, float(sys.argv[2]), "ego")
> ValueError: could not convert string to float: sumo
---------- Differences in output ----------
1,34d0
< Loading configuration ... done.
< Subscribing to vehicle context of object 'ego'
< [001] Context results for vehicle 'ego':
< [002] Context results for vehicle 'ego':
< [003] Context results for vehicle 'ego':
< [004] Context results for vehicle 'ego':
< [005] Context results for vehicle 'ego':
< [006] Context results for vehicle 'ego':
< [007] Context results for vehicle 'ego':
< [008] Context results for vehicle 'ego':
< [009] Context results for vehicle 'ego':
< [010] Context results for vehicle 'ego':
< [011] Context results for vehicle 'ego':
< [012] Context results for vehicle 'ego':
< [013] Context results for vehicle 'ego':
< [014] Context results for vehicle 'ego':
< [015] Context results for vehicle 'ego':
< [016] Context results for vehicle 'ego':
< [017] Context results for vehicle 'ego':
< [018] Context results for vehicle 'ego':
< [019] Context results for vehicle 'ego':
< [020] Context results for vehicle 'ego':
< [021] Context results for vehicle 'ego':
< [022] Context results for vehicle 'ego':
< [023] Context results for vehicle 'ego':
< [024] Context results for vehicle 'ego':
< [025] Context results for vehicle 'ego':
< [026] Context results for vehicle 'ego':
< [027] Context results for vehicle 'ego':
<truncated after showing first 30 lines>
traci ContextSubscriptionFilters lanesUpDownDistance lanesOutOfBounds ( Last six runs Oct2020 Sep2020 )
traci ContextSubscriptionFilters lanesUpDownDistance lanesOutOfBoundsDownDistZero ( Last six runs Oct2020 Sep2020 )
traci ContextSubscriptionFilters lanesUpDownDistance lanesOutOfBoundsUpDistZero ( Last six runs Oct2020 Sep2020 )

TEST FAILED on ts-sim-build-ba : traci ContextSubscriptionFilters lanesUpDownDistance lanesRight ( Last six runs Oct2020 Sep2020 )

---------- Differences in errors ----------
0a1,4
> Traceback (most recent call last):
>   File "/home/delphi/extraGcc/sumo/tests/../tests/complex/traci/ContextSubscriptionFilters/lanesUpDownDistance/runner.py", line 81, in <module>
>     runSingle(100, float(sys.argv[2]), "ego")
> ValueError: could not convert string to float: sumo
---------- Differences in output ----------
1,144d0
< Loading configuration ... done.
< Subscribing to vehicle context of object 'ego'
< [001] Context results for vehicle 'ego':
< follow_right
< follow_right2
< lead_right
< lead_right2
< [002] Context results for vehicle 'ego':
< follow_right
< follow_right2
< lead_right
< lead_right2
< [003] Context results for vehicle 'ego':
< follow_right
< follow_right2
< lead_right
< lead_right2
< [004] Context results for vehicle 'ego':
< follow_right
< follow_right2
< lead_right
< lead_right2
< [005] Context results for vehicle 'ego':
< follow_right
< follow_right2
< lead_right
< lead_right2
< [006] Context results for vehicle 'ego':
< follow_right
<truncated after showing first 30 lines>

TEST FAILED on ts-sim-build-ba : traci ContextSubscriptionFilters lanesUpDownDistance lanesRightDownDistZero ( Last six runs Oct2020 Sep2020 )

---------- Differences in errors ----------
0a1,4
> Traceback (most recent call last):
>   File "/home/delphi/extraGcc/sumo/tests/../tests/complex/traci/ContextSubscriptionFilters/lanesUpDownDistance/runner.py", line 81, in <module>
>     runSingle(100, float(sys.argv[2]), "ego")
> ValueError: could not convert string to float: sumo
---------- Differences in output ----------
1,94d0
< Loading configuration ... done.
< Subscribing to vehicle context of object 'ego'
< [001] Context results for vehicle 'ego':
< follow_right
< follow_right2
< [002] Context results for vehicle 'ego':
< follow_right
< follow_right2
< [003] Context results for vehicle 'ego':
< follow_right
< follow_right2
< [004] Context results for vehicle 'ego':
< follow_right
< follow_right2
< [005] Context results for vehicle 'ego':
< follow_right
< follow_right2
< [006] Context results for vehicle 'ego':
< follow_right
< follow_right2
< [007] Context results for vehicle 'ego':
< follow_right
< follow_right2
< [008] Context results for vehicle 'ego':
< follow_right
< follow_right2
< [009] Context results for vehicle 'ego':
< follow_right
< follow_right2
<truncated after showing first 30 lines>

TEST FAILED on ts-sim-build-ba : traci ContextSubscriptionFilters lanesUpDownDistance lanesRightUpDistZero ( Last six runs Oct2020 Sep2020 )

---------- Differences in errors ----------
0a1,4
> Traceback (most recent call last):
>   File "/home/delphi/extraGcc/sumo/tests/../tests/complex/traci/ContextSubscriptionFilters/lanesUpDownDistance/runner.py", line 81, in <module>
>     runSingle(100, float(sys.argv[2]), "ego")
> ValueError: could not convert string to float: sumo
---------- Differences in output ----------
1,84d0
< Loading configuration ... done.
< Subscribing to vehicle context of object 'ego'
< [001] Context results for vehicle 'ego':
< lead_right
< lead_right2
< [002] Context results for vehicle 'ego':
< lead_right
< lead_right2
< [003] Context results for vehicle 'ego':
< lead_right
< lead_right2
< [004] Context results for vehicle 'ego':
< lead_right
< lead_right2
< [005] Context results for vehicle 'ego':
< lead_right
< lead_right2
< [006] Context results for vehicle 'ego':
< lead_right
< lead_right2
< [007] Context results for vehicle 'ego':
< lead_right
< lead_right2
< [008] Context results for vehicle 'ego':
< lead_right
< lead_right2
< [009] Context results for vehicle 'ego':
< lead_right
< lead_right2
<truncated after showing first 30 lines>

TEST FAILED on ts-sim-build-ba : traci ContextSubscriptionFilters lateralDistance incompatible_filter ( Last six runs Oct2020 Sep2020 )

---------- Differences in errors ----------
1c1
< Warning: Ignoring field of vision subscription filter due to incompatibility with other filter(s).
---
> 
---------- Differences in output ----------
1,9c1
< Subscribing to context of vehicle 'ego' (range=50.0)
< Adding lateral distance subscription filter ... (lateralDistance=50.0, downstreamDistance=50.0, upstreamDistance=50.0)
< Context results for veh 'ego':
< ego
< v10
< v8
< v9
< Ok: Unsubscribe successful
< Print ended at step 3.0
---
> Usage: runner <sumo/sumo-gui> <range> <lateralDistance> <downstreamDistance> <upstreamDistance> <testWithIncompatibleFilter (0/1)>

TEST FAILED on ts-sim-build-ba : traci ContextSubscriptionFilters lateralDistance internal_edges ( Last six runs Oct2020 Sep2020 )

---------- Differences in errors ----------
0a1
> 
---------- Differences in output ----------
1,46c1
< Subscribing to context of vehicle 'ego' (range=50.0)
< Adding lateral distance subscription filter ... (lateralDistance=50.0, downstreamDistance=50.0, upstreamDistance=50.0)
< Context results for veh 'ego' (step = 1):
< ego
< v2
< Context results for veh 'ego' (step = 2):
< ego
< v2
< Context results for veh 'ego' (step = 3):
< ego
< v1
< v2
< Context results for veh 'ego' (step = 4):
< ego
< v1
< v2
< Context results for veh 'ego' (step = 5):
< ego
< v1
< v2
< Context results for veh 'ego' (step = 6):
< ego
< v1
< v2
< Context results for veh 'ego' (step = 7):
< ego
< v1
< v2
< Context results for veh 'ego' (step = 8):
<truncated after showing first 30 lines>

TEST FAILED on ts-sim-build-ba : traci ContextSubscriptionFilters lateralDistance persons range_50_lateralDist_50 ( Last six runs Oct2020 Sep2020 )

---------- Differences in errors ----------
0a1
> 
---------- Differences in output ----------
1,8c1
< Subscribing to context of vehicle 'ego' (range=50.0)
< Adding lateral distance subscription filter ... (lateralDistance=50.0, downstreamDistance=50.0, upstreamDistance=50.0)
< Context results for veh 'ego':
< p10
< p8
< p9
< Ok: Unsubscribe successful
< Print ended at step 3.0
---
> Usage: runner <sumo/sumo-gui> <range> <lateralDistance> <downstreamDistance> <upstreamDistance> <testWithIncompatibleFilter (0/1)>

TEST FAILED on ts-sim-build-ba : traci ContextSubscriptionFilters lateralDistance range_50_lateralDist_50 ( Last six runs Oct2020 Sep2020 )

---------- Differences in errors ----------
0a1
> 
---------- Differences in output ----------
1,9c1
< Subscribing to context of vehicle 'ego' (range=50.0)
< Adding lateral distance subscription filter ... (lateralDistance=50.0, downstreamDistance=50.0, upstreamDistance=50.0)
< Context results for veh 'ego':
< ego
< v10
< v8
< v9
< Ok: Unsubscribe successful
< Print ended at step 3.0
---
> Usage: runner <sumo/sumo-gui> <range> <lateralDistance> <downstreamDistance> <upstreamDistance> <testWithIncompatibleFilter (0/1)>

TEST FAILED on ts-sim-build-ba : traci ContextSubscriptionFilters leadFollow carFollowing ( Last six runs Oct2020 Sep2020 )

---------- Differences in errors ----------
0a1,4
> Traceback (most recent call last):
>   File "/home/delphi/extraGcc/sumo/tests/../tests/complex/traci/ContextSubscriptionFilters/leadFollow/carFollowing/runner.py", line 76, in <module>
>     runSingle(100, float(sys.argv[2]), "ego")
> ValueError: could not convert string to float: sumo
---------- Differences in output ----------
1,86d0
< Loading configuration ... done.
< Subscribing to vehicle context of object 'ego'
< [001] Context results for vehicle 'ego':
< lead_straight
< follow_straight
< [002] Context results for vehicle 'ego':
< lead_straight
< follow_straight
< [003] Context results for vehicle 'ego':
< lead_straight
< follow_straight
< [004] Context results for vehicle 'ego':
< lead_straight
< follow_straight
< [005] Context results for vehicle 'ego':
< lead_straight
< follow_straight
< [006] Context results for vehicle 'ego':
< lead_straight
< follow_straight
< [007] Context results for vehicle 'ego':
< lead_straight
< follow_straight
< [008] Context results for vehicle 'ego':
< lead_straight
< follow_straight
< [009] Context results for vehicle 'ego':
< lead_straight
< follow_straight
<truncated after showing first 30 lines>

TEST FAILED on ts-sim-build-ba : traci ContextSubscriptionFilters leadFollow laneChangeLeft ( Last six runs Oct2020 Sep2020 )

---------- Differences in errors ----------
0a1,4
> Traceback (most recent call last):
>   File "/home/delphi/extraGcc/sumo/tests/../tests/complex/traci/ContextSubscriptionFilters/leadFollow/laneChangeLeft/runner.py", line 76, in <module>
>     runSingle(100, float(sys.argv[2]), "ego")
> ValueError: could not convert string to float: sumo
---------- Differences in output ----------
1,139d0
< Loading configuration ... done.
< Subscribing to vehicle context of object 'ego'
< [001] Context results for vehicle 'ego':
< follow_left
< lead_left
< lead_straight
< follow_straight
< [002] Context results for vehicle 'ego':
< follow_left
< lead_left
< lead_straight
< follow_straight
< [003] Context results for vehicle 'ego':
< follow_left
< lead_left
< lead_straight
< follow_straight
< [004] Context results for vehicle 'ego':
< follow_left
< lead_left
< lead_straight
< follow_straight
< [005] Context results for vehicle 'ego':
< follow_left
< lead_left
< lead_straight
< follow_straight
< [006] Context results for vehicle 'ego':
< follow_left
<truncated after showing first 30 lines>

TEST FAILED on ts-sim-build-ba : traci ContextSubscriptionFilters leadFollow laneChangeNeighbors ( Last six runs Oct2020 Sep2020 )

---------- Differences in errors ----------
0a1,4
> Traceback (most recent call last):
>   File "/home/delphi/extraGcc/sumo/tests/../tests/complex/traci/ContextSubscriptionFilters/leadFollow/laneChangeNeighbors/runner.py", line 75, in <module>
>     runSingle(100, float(sys.argv[2]), "ego")
> ValueError: could not convert string to float: sumo
---------- Differences in output ----------
1,190d0
< Loading configuration ... done.
< Subscribing to vehicle context of object 'ego'
< [001] Context results for vehicle 'ego':
< follow_straight
< follow_right
< follow_left
< lead_right
< lead_straight
< lead_left
< [002] Context results for vehicle 'ego':
< follow_straight
< follow_right
< follow_left
< lead_right
< lead_straight
< lead_left
< [003] Context results for vehicle 'ego':
< follow_straight
< follow_right
< follow_left
< lead_right
< lead_straight
< lead_left
< [004] Context results for vehicle 'ego':
< follow_straight
< follow_right
< follow_left
< lead_right
< lead_straight
<truncated after showing first 30 lines>

TEST FAILED on ts-sim-build-ba : traci ContextSubscriptionFilters leadFollow laneChangeRight ( Last six runs Oct2020 Sep2020 )

---------- Differences in errors ----------
0a1,4
> Traceback (most recent call last):
>   File "/home/delphi/extraGcc/sumo/tests/../tests/complex/traci/ContextSubscriptionFilters/leadFollow/laneChangeRight/runner.py", line 76, in <module>
>     runSingle(100, float(sys.argv[2]), "ego")
> ValueError: could not convert string to float: sumo
---------- Differences in output ----------
1,137d0
< Loading configuration ... done.
< Subscribing to vehicle context of object 'ego'
< [001] Context results for vehicle 'ego':
< follow_right
< lead_right
< lead_straight
< follow_straight
< [002] Context results for vehicle 'ego':
< follow_right
< lead_right
< lead_straight
< follow_straight
< [003] Context results for vehicle 'ego':
< follow_right
< lead_right
< lead_straight
< follow_straight
< [004] Context results for vehicle 'ego':
< follow_right
< lead_right
< lead_straight
< follow_straight
< [005] Context results for vehicle 'ego':
< follow_right
< lead_right
< lead_straight
< follow_straight
< [006] Context results for vehicle 'ego':
< follow_right
<truncated after showing first 30 lines>

TEST FAILED on ts-sim-build-ba : traci ContextSubscriptionFilters leadFollowOpposite laneChangeOpposite ( Last six runs Oct2020 Sep2020 )

---------- Differences in errors ----------
0a1,4
> Traceback (most recent call last):
>   File "/home/delphi/extraGcc/sumo/tests/../tests/complex/traci/ContextSubscriptionFilters/leadFollowOpposite/laneChangeOpposite/runner.py", line 72, in <module>
>     runSingle(100, float(sys.argv[2]), "ego")
> ValueError: could not convert string to float: sumo
---------- Differences in output ----------
1,96d0
< Loading configuration ... done.
< Subscribing to vehicle context of object 'ego'
< [001] Context results for vehicle 'ego':
< snail_leader
< [002] Context results for vehicle 'ego':
< snail_leader
< [003] Context results for vehicle 'ego':
< snail_leader
< [004] Context results for vehicle 'ego':
< snail_leader
< [005] Context results for vehicle 'ego':
< snail_leader
< [006] Context results for vehicle 'ego':
< snail_leader
< [007] Context results for vehicle 'ego':
< snail_leader
< [008] Context results for vehicle 'ego':
< snail_leader
< [009] Context results for vehicle 'ego':
< snail_leader
< [010] Context results for vehicle 'ego':
< opposite.0
< snail_leader
< [011] Context results for vehicle 'ego':
< opposite.0
< snail_leader
< [012] Context results for vehicle 'ego':
< opposite.0
< snail_leader
<truncated after showing first 30 lines>

TEST FAILED on ts-sim-build-ba : traci ContextSubscriptionFilters noOpposite lanesInclOpposite ( Last six runs Oct2020 Sep2020 )

---------- Differences in errors ----------
0a1,4
> Traceback (most recent call last):
>   File "/home/delphi/extraGcc/sumo/tests/../tests/complex/traci/ContextSubscriptionFilters/noOpposite/lanesInclOpposite/runner.py", line 72, in <module>
>     runSingle(100, float(sys.argv[2]), "ego")
> ValueError: could not convert string to float: sumo
---------- Differences in output ----------
1,46d0
< Loading configuration ... done.
< Subscribing to vehicle context of object 'ego'
< [001] Context results for vehicle 'ego':
< ego
< [002] Context results for vehicle 'ego':
< ego
< [003] Context results for vehicle 'ego':
< ego
< [004] Context results for vehicle 'ego':
< ego
< [005] Context results for vehicle 'ego':
< ego
< [006] Context results for vehicle 'ego':
< ego
< [007] Context results for vehicle 'ego':
< ego
< opp1
< [008] Context results for vehicle 'ego':
< ego
< opp1
< [009] Context results for vehicle 'ego':
< ego
< opp1
< [010] Context results for vehicle 'ego':
< ego
< opp1
< [011] Context results for vehicle 'ego':
< ego
< opp1
<truncated after showing first 30 lines>

TEST FAILED on ts-sim-build-ba : traci ContextSubscriptionFilters roadnetSearch_noOpposite dist_10 ( Last six runs Oct2020 Sep2020 )

---------- Differences in errors ----------
0a1,4
> Traceback (most recent call last):
>   File "/home/delphi/extraGcc/sumo/tests/../tests/complex/traci/ContextSubscriptionFilters/roadnetSearch_noOpposite/runner.py", line 87, in <module>
>     runSingle(1, float(sys.argv[2]), float(sys.argv[3]), lanes, opposite)
> ValueError: could not convert string to float: sumo
---------- Differences in output ----------
1,7d0
< Subscribing to context of vehicle 'ego'
< Adding subscription filters ... 
< (downstreamDist=10.0, upstreamDist=10.0, lanes=[0], opposite=False)
< Context results for veh 'ego':
< ego
< Ok: Unsubscribe successful
< Print ended at step 3.0

TEST FAILED on ts-sim-build-ba : traci ContextSubscriptionFilters roadnetSearch_noOpposite dist_10_disregard_opposite ( Last six runs Oct2020 Sep2020 )

---------- Differences in errors ----------
0a1,4
> Traceback (most recent call last):
>   File "/home/delphi/extraGcc/sumo/tests/../tests/complex/traci/ContextSubscriptionFilters/roadnetSearch_noOpposite/runner.py", line 87, in <module>
>     runSingle(1, float(sys.argv[2]), float(sys.argv[3]), lanes, opposite)
> ValueError: could not convert string to float: sumo
---------- Differences in output ----------
1,7d0
< Subscribing to context of vehicle 'ego'
< Adding subscription filters ... 
< (downstreamDist=10.0, upstreamDist=10.0, lanes=[0, 1], opposite=False)
< Context results for veh 'ego':
< ego
< Ok: Unsubscribe successful
< Print ended at step 3.0

TEST FAILED on ts-sim-build-ba : traci ContextSubscriptionFilters roadnetSearch_noOpposite dist_d10u100 ( Last six runs Oct2020 Sep2020 )

---------- Differences in errors ----------
0a1,4
> Traceback (most recent call last):
>   File "/home/delphi/extraGcc/sumo/tests/../tests/complex/traci/ContextSubscriptionFilters/roadnetSearch_noOpposite/runner.py", line 87, in <module>
>     runSingle(1, float(sys.argv[2]), float(sys.argv[3]), lanes, opposite)
> ValueError: could not convert string to float: sumo
---------- Differences in output ----------
1,10d0
< Subscribing to context of vehicle 'ego'
< Adding subscription filters ... 
< (downstreamDist=10.0, upstreamDist=100.0, lanes=[0], opposite=False)
< Context results for veh 'ego':
< ego
< v4
< v7
< v8
< Ok: Unsubscribe successful
< Print ended at step 3.0

TEST FAILED on ts-sim-build-ba : traci ContextSubscriptionFilters roadnetSearch_noOpposite dist_d10u80 ( Last six runs Oct2020 Sep2020 )

---------- Differences in errors ----------
0a1,4
> Traceback (most recent call last):
>   File "/home/delphi/extraGcc/sumo/tests/../tests/complex/traci/ContextSubscriptionFilters/roadnetSearch_noOpposite/runner.py", line 87, in <module>
>     runSingle(1, float(sys.argv[2]), float(sys.argv[3]), lanes, opposite)
> ValueError: could not convert string to float: sumo
---------- Differences in output ----------
1,9d0
< Subscribing to context of vehicle 'ego'
< Adding subscription filters ... 
< (downstreamDist=10.0, upstreamDist=80.0, lanes=[0], opposite=False)
< Context results for veh 'ego':
< ego
< v4
< v8
< Ok: Unsubscribe successful
< Print ended at step 3.0

TEST FAILED on ts-sim-build-ba : traci ContextSubscriptionFilters roadnetSearch_noOpposite dist_d155u65 ( Last six runs Oct2020 Sep2020 )

---------- Differences in errors ----------
0a1,4
> Traceback (most recent call last):
>   File "/home/delphi/extraGcc/sumo/tests/../tests/complex/traci/ContextSubscriptionFilters/roadnetSearch_noOpposite/runner.py", line 87, in <module>
>     runSingle(1, float(sys.argv[2]), float(sys.argv[3]), lanes, opposite)
> ValueError: could not convert string to float: sumo
---------- Differences in output ----------
1,11d0
< Subscribing to context of vehicle 'ego'
< Adding subscription filters ... 
< (downstreamDist=155.0, upstreamDist=65.0, lanes=[0], opposite=False)
< Context results for veh 'ego':
< ego
< v1
< v3
< v8
< v9
< Ok: Unsubscribe successful
< Print ended at step 3.0

TEST FAILED on ts-sim-build-ba : traci ContextSubscriptionFilters roadnetSearch_noOpposite dist_d200u10 ( Last six runs Oct2020 Sep2020 )

---------- Differences in errors ----------
0a1,4
> Traceback (most recent call last):
>   File "/home/delphi/extraGcc/sumo/tests/../tests/complex/traci/ContextSubscriptionFilters/roadnetSearch_noOpposite/runner.py", line 87, in <module>
>     runSingle(1, float(sys.argv[2]), float(sys.argv[3]), lanes, opposite)
> ValueError: could not convert string to float: sumo
---------- Differences in output ----------
1,9d0
< Subscribing to context of vehicle 'ego'
< Adding subscription filters ... 
< (downstreamDist=200.0, upstreamDist=10.0, lanes=[0], opposite=False)
< Context results for veh 'ego':
< ego
< v2
< v9
< Ok: Unsubscribe successful
< Print ended at step 3.0

TEST FAILED on ts-sim-build-ba : traci ContextSubscriptionFilters roadnetSearch_noOpposite dist_d20u30 ( Last six runs Oct2020 Sep2020 )

---------- Differences in errors ----------
0a1,4
> Traceback (most recent call last):
>   File "/home/delphi/extraGcc/sumo/tests/../tests/complex/traci/ContextSubscriptionFilters/roadnetSearch_noOpposite/runner.py", line 87, in <module>
>     runSingle(1, float(sys.argv[2]), float(sys.argv[3]), lanes, opposite)
> ValueError: could not convert string to float: sumo
---------- Differences in output ----------
1,8d0
< Subscribing to context of vehicle 'ego'
< Adding subscription filters ... 
< (downstreamDist=20.0, upstreamDist=30.0, lanes=[0], opposite=False)
< Context results for veh 'ego':
< ego
< v8
< Ok: Unsubscribe successful
< Print ended at step 3.0

TEST FAILED on ts-sim-build-ba : traci ContextSubscriptionFilters roadnetSearch_noOpposite dist_d30u20 ( Last six runs Oct2020 Sep2020 )

---------- Differences in errors ----------
0a1,4
> Traceback (most recent call last):
>   File "/home/delphi/extraGcc/sumo/tests/../tests/complex/traci/ContextSubscriptionFilters/roadnetSearch_noOpposite/runner.py", line 87, in <module>
>     runSingle(1, float(sys.argv[2]), float(sys.argv[3]), lanes, opposite)
> ValueError: could not convert string to float: sumo
---------- Differences in output ----------
1,8d0
< Subscribing to context of vehicle 'ego'
< Adding subscription filters ... 
< (downstreamDist=30.0, upstreamDist=20.0, lanes=[0], opposite=False)
< Context results for veh 'ego':
< ego
< v9
< Ok: Unsubscribe successful
< Print ended at step 3.0

TEST FAILED on ts-sim-build-ba : traci ContextSubscriptionFilters roadnetSearch_withOpposite dist_10_with_opposite ( Last six runs Oct2020 Sep2020 )

---------- Differences in errors ----------
0a1,4
> Traceback (most recent call last):
>   File "/home/delphi/extraGcc/sumo/tests/../tests/complex/traci/ContextSubscriptionFilters/roadnetSearch_withOpposite/runner.py", line 87, in <module>
>     runSingle(1, float(sys.argv[2]), float(sys.argv[3]), lanes, opposite)
> ValueError: could not convert string to float: sumo
---------- Differences in output ----------
1,8d0
< Subscribing to context of vehicle 'ego'
< Adding subscription filters ... 
< (downstreamDist=10.0, upstreamDist=10.0, lanes=[0, 1], opposite=True)
< Context results for veh 'ego':
< ego
< v10
< Ok: Unsubscribe successful
< Print ended at step 3.0

TEST FAILED on ts-sim-build-ba : traci ContextSubscriptionFilters roadnetSearch_withOpposite dist_d0_u150_only_opposite ( Last six runs Oct2020 Sep2020 )

---------- Differences in errors ----------
0a1,4
> Traceback (most recent call last):
>   File "/home/delphi/extraGcc/sumo/tests/../tests/complex/traci/ContextSubscriptionFilters/roadnetSearch_withOpposite/runner.py", line 87, in <module>
>     runSingle(1, float(sys.argv[2]), float(sys.argv[3]), lanes, opposite)
> ValueError: could not convert string to float: sumo
---------- Differences in output ----------
1,8d0
< Subscribing to context of vehicle 'ego'
< Adding subscription filters ... 
< (downstreamDist=0.0, upstreamDist=150.0, lanes=[1], opposite=True)
< Context results for veh 'ego':
< v10
< v5
< Ok: Unsubscribe successful
< Print ended at step 3.0

TEST FAILED on ts-sim-build-ba : traci ContextSubscriptionFilters roadnetSearch_withOpposite dist_d0_u150_with_opposite ( Last six runs Oct2020 Sep2020 )

---------- Differences in errors ----------
0a1,4
> Traceback (most recent call last):
>   File "/home/delphi/extraGcc/sumo/tests/../tests/complex/traci/ContextSubscriptionFilters/roadnetSearch_withOpposite/runner.py", line 87, in <module>
>     runSingle(1, float(sys.argv[2]), float(sys.argv[3]), lanes, opposite)
> ValueError: could not convert string to float: sumo
---------- Differences in output ----------
1,12d0
< Subscribing to context of vehicle 'ego'
< Adding subscription filters ... 
< (downstreamDist=0.0, upstreamDist=150.0, lanes=[0, 1], opposite=True)
< Context results for veh 'ego':
< ego
< v10
< v4
< v5
< v7
< v8
< Ok: Unsubscribe successful
< Print ended at step 3.0

TEST FAILED on ts-sim-build-ba : traci ContextSubscriptionFilters roadnetSearch_withOpposite dist_d100_u0_with_opposite ( Last six runs Oct2020 Sep2020 )

---------- Differences in errors ----------
0a1,4
> Traceback (most recent call last):
>   File "/home/delphi/extraGcc/sumo/tests/../tests/complex/traci/ContextSubscriptionFilters/roadnetSearch_withOpposite/runner.py", line 85, in <module>
>     opposite = bool(int(sys.argv[5]))
> ValueError: invalid literal for int() with base 10: '0.0'
---------- Differences in output ----------
1,9d0
< Subscribing to context of vehicle 'ego'
< Adding subscription filters ... 
< (downstreamDist=100.0, upstreamDist=0.0, lanes=[0, 1], opposite=True)
< Context results for veh 'ego':
< ego
< v6
< v9
< Ok: Unsubscribe successful
< Print ended at step 3.0

TEST FAILED on ts-sim-build-ba : traci ContextSubscriptionFilters roadnetSearch_withOpposite dist_d250_u0_only_opposite ( Last six runs Oct2020 Sep2020 )

---------- Differences in errors ----------
0a1,4
> Traceback (most recent call last):
>   File "/home/delphi/extraGcc/sumo/tests/../tests/complex/traci/ContextSubscriptionFilters/roadnetSearch_withOpposite/runner.py", line 85, in <module>
>     opposite = bool(int(sys.argv[5]))
> ValueError: invalid literal for int() with base 10: '0.0'
---------- Differences in output ----------
1,9d0
< Subscribing to context of vehicle 'ego'
< Adding subscription filters ... 
< (downstreamDist=250.0, upstreamDist=0.0, lanes=[1], opposite=True)
< Context results for veh 'ego':
< v1
< v3
< v6
< Ok: Unsubscribe successful
< Print ended at step 3.0

TEST FAILED on ts-sim-build-ba : traci ContextSubscriptionFilters roadnetSearch_withOpposite dist_d250_u0_with_opposite ( Last six runs Oct2020 Sep2020 )

---------- Differences in errors ----------
0a1,4
> Traceback (most recent call last):
>   File "/home/delphi/extraGcc/sumo/tests/../tests/complex/traci/ContextSubscriptionFilters/roadnetSearch_withOpposite/runner.py", line 85, in <module>
>     opposite = bool(int(sys.argv[5]))
> ValueError: invalid literal for int() with base 10: '0.0'
---------- Differences in output ----------
1,12d0
< Subscribing to context of vehicle 'ego'
< Adding subscription filters ... 
< (downstreamDist=250.0, upstreamDist=0.0, lanes=[0, 1], opposite=True)
< Context results for veh 'ego':
< ego
< v1
< v2
< v3
< v6
< v9
< Ok: Unsubscribe successful
< Print ended at step 3.0

TEST FAILED on ts-sim-build-ba : traci ContextSubscriptionFilters roadnetSearch_withOpposite dist_d250_u250_all ( Last six runs Oct2020 Sep2020 )

---------- Differences in errors ----------
0a1,4
> Traceback (most recent call last):
>   File "/home/delphi/extraGcc/sumo/tests/../tests/complex/traci/ContextSubscriptionFilters/roadnetSearch_withOpposite/runner.py", line 87, in <module>
>     runSingle(1, float(sys.argv[2]), float(sys.argv[3]), lanes, opposite)
> ValueError: could not convert string to float: sumo
---------- Differences in output ----------
1,17d0
< Subscribing to context of vehicle 'ego'
< Adding subscription filters ... 
< (downstreamDist=250.0, upstreamDist=250.0, lanes=[0, 1], opposite=True)
< Context results for veh 'ego':
< ego
< v1
< v10
< v2
< v3
< v4
< v5
< v6
< v7
< v8
< v9
< Ok: Unsubscribe successful
< Print ended at step 3.0

TEST FAILED on ts-sim-build-ba : traci ContextSubscriptionFilters turn turn_d250_u250 ( Last six runs Oct2020 Sep2020 )

---------- Differences in errors ----------
0a1,4
> Traceback (most recent call last):
>   File "/home/delphi/extraGcc/sumo/tests/../tests/complex/traci/ContextSubscriptionFilters/turn/runner.py", line 83, in <module>
>     runSingle(100, float(sys.argv[2]), float(sys.argv[3]))
> ValueError: could not convert string to float: sumo
---------- Differences in output ----------
1,115d0
< Subscribing to context of vehicle 'ego'
< Adding turn filter ... 
< (downstreamDist=250.0, upstreamDist=250.0)
< Step 1:
< Context results for veh 'ego':
< v4
< v6
< Step 2:
< Context results for veh 'ego':
< v4
< v6
< Step 3:
< Context results for veh 'ego':
< v4
< v6
< Step 4:
< Context results for veh 'ego':
< v4
< v5.2
< v6
< Step 5:
< Context results for veh 'ego':
< v4
< v5.2
< v6
< Step 6:
< Context results for veh 'ego':
< v4
< v4.2
<truncated after showing first 30 lines>

TEST FAILED on ts-sim-build-ba : traci ContextSubscriptionFilters turn turn_d50_u50 ( Last six runs Oct2020 Sep2020 )

---------- Differences in errors ----------
0a1,4
> Traceback (most recent call last):
>   File "/home/delphi/extraGcc/sumo/tests/../tests/complex/traci/ContextSubscriptionFilters/turn/runner.py", line 83, in <module>
>     runSingle(100, float(sys.argv[2]), float(sys.argv[3]))
> ValueError: could not convert string to float: sumo
---------- Differences in output ----------
1,80d0
< Subscribing to context of vehicle 'ego'
< Adding turn filter ... 
< (downstreamDist=50.0, upstreamDist=50.0)
< Step 1:
< Context results for veh 'ego':
< v4
< Step 2:
< Context results for veh 'ego':
< v4
< Step 3:
< Context results for veh 'ego':
< v4
< Step 4:
< Context results for veh 'ego':
< v4
< Step 5:
< Context results for veh 'ego':
< v4
< Step 6:
< Context results for veh 'ego':
< v4
< v4.2
< Step 7:
< Context results for veh 'ego':
< v4
< v4.2
< Step 8:
< Context results for veh 'ego':
< v4
<truncated after showing first 30 lines>

TEST FAILED on ts-sim-build-ba : traci ContextSubscriptionFilters vType_and_vClass none ( Last six runs Oct2020 Sep2020 )

---------- Differences in errors ----------
0a1,4
> Traceback (most recent call last):
>   File "/home/delphi/extraGcc/sumo/tests/../tests/complex/traci/ContextSubscriptionFilters/vType_and_vClass/runner.py", line 98, in <module>
>     runSingle(1, float(sys.argv[2]), float(sys.argv[3]), lanes, opposite, vTypes, vClasses)
> ValueError: could not convert string to float: sumo
---------- Differences in output ----------
1,9d0
< Subscribing to context of vehicle 'ego'
< Adding subscription filters ...
< (downstreamDist=20.0, upstreamDist=30.0, lanes=[0], opposite=False
<    vTypes:[], vClasses:[])
< Context results for veh 'ego':
< ego
< v8
< Ok: Unsubscribe successful
< Print ended at step 3.0

TEST FAILED on ts-sim-build-ba : traci ContextSubscriptionFilters vType_and_vClass vClass_negative ( Last six runs Oct2020 Sep2020 )

---------- Differences in errors ----------
0a1,4
> Traceback (most recent call last):
>   File "/home/delphi/extraGcc/sumo/tests/../tests/complex/traci/ContextSubscriptionFilters/vType_and_vClass/runner.py", line 98, in <module>
>     runSingle(1, float(sys.argv[2]), float(sys.argv[3]), lanes, opposite, vTypes, vClasses)
> ValueError: could not convert string to float: sumo
---------- Differences in output ----------
1,8d0
< Subscribing to context of vehicle 'ego'
< Adding subscription filters ...
< (downstreamDist=20.0, upstreamDist=30.0, lanes=[0], opposite=False
<    vTypes:[], vClasses:['passenger'])
< Context results for veh 'ego':
< ego
< Ok: Unsubscribe successful
< Print ended at step 3.0

TEST FAILED on ts-sim-build-ba : traci ContextSubscriptionFilters vType_and_vClass vClass_positive ( Last six runs Oct2020 Sep2020 )

---------- Differences in errors ----------
0a1,4
> Traceback (most recent call last):
>   File "/home/delphi/extraGcc/sumo/tests/../tests/complex/traci/ContextSubscriptionFilters/vType_and_vClass/runner.py", line 98, in <module>
>     runSingle(1, float(sys.argv[2]), float(sys.argv[3]), lanes, opposite, vTypes, vClasses)
> ValueError: could not convert string to float: sumo
---------- Differences in output ----------
1,8d0
< Subscribing to context of vehicle 'ego'
< Adding subscription filters ...
< (downstreamDist=20.0, upstreamDist=30.0, lanes=[0], opposite=False
<    vTypes:[], vClasses:['truck'])
< Context results for veh 'ego':
< v8
< Ok: Unsubscribe successful
< Print ended at step 3.0

TEST FAILED on ts-sim-build-ba : traci ContextSubscriptionFilters vType_and_vClass vType_negative ( Last six runs Oct2020 Sep2020 )

---------- Differences in errors ----------
0a1,4
> Traceback (most recent call last):
>   File "/home/delphi/extraGcc/sumo/tests/../tests/complex/traci/ContextSubscriptionFilters/vType_and_vClass/runner.py", line 98, in <module>
>     runSingle(1, float(sys.argv[2]), float(sys.argv[3]), lanes, opposite, vTypes, vClasses)
> ValueError: could not convert string to float: sumo
---------- Differences in output ----------
1,7d0
< Subscribing to context of vehicle 'ego'
< Adding subscription filters ...
< (downstreamDist=20.0, upstreamDist=30.0, lanes=[0], opposite=False
<    vTypes:['unknown'], vClasses:[])
< Context results for veh 'ego':
< Ok: Unsubscribe successful
< Print ended at step 3.0

TEST FAILED on ts-sim-build-ba : traci ContextSubscriptionFilters vType_and_vClass vType_positive ( Last six runs Oct2020 Sep2020 )

---------- Differences in errors ----------
0a1,4
> Traceback (most recent call last):
>   File "/home/delphi/extraGcc/sumo/tests/../tests/complex/traci/ContextSubscriptionFilters/vType_and_vClass/runner.py", line 98, in <module>
>     runSingle(1, float(sys.argv[2]), float(sys.argv[3]), lanes, opposite, vTypes, vClasses)
> ValueError: could not convert string to float: sumo
---------- Differences in output ----------
1,8d0
< Subscribing to context of vehicle 'ego'
< Adding subscription filters ...
< (downstreamDist=20.0, upstreamDist=30.0, lanes=[0], opposite=False
<    vTypes:['t0'], vClasses:[])
< Context results for veh 'ego':
< v8
< Ok: Unsubscribe successful
< Print ended at step 3.0

TEST FAILED on ts-sim-build-ba : traci bugs ticket1010 ( Last six runs Oct2020 Sep2020 )

---------- Differences in errors ----------
0a1,12
> Traceback (most recent call last):
>   File "/home/delphi/extraGcc/sumo/tests/../tests/complex/traci/bugs/ticket1010/runner.py", line 49, in <module>
>     run()
>   File "/home/delphi/extraGcc/sumo/tests/../tests/complex/traci/bugs/ticket1010/runner.py", line 38, in run
>     traci.start(cmd)
>   File "/home/delphi/extraGcc/sumo/tools/traci/main.py", line 156, in start
>     sumoProcess = subprocess.Popen(cmd2, stdout=stdout)
>   File "/usr/lib/python2.7/subprocess.py", line 394, in __init__
>     errread, errwrite)
>   File "/usr/lib/python2.7/subprocess.py", line 1047, in _execute_child
>     raise child_exception
> OSError: [Errno 2] No such file or directory

TEST FAILED on ts-sim-build-ba : traci bugs ticket1433 ( Last six runs Oct2020 Sep2020 )

---------- Differences in errors ----------
0a1,3
> Usage: runner.py [options]
> 
> runner.py: error: no such option: --mesosim

TEST FAILED on ts-sim-build-ba : traci bugs ticket3522 ( Last six runs Oct2020 Sep2020 )

---------- Differences in errors ----------
0a1,5
> Error: Error: Invalid vehicles in state (may be a micro state)!
> Quitting (on error).
> Traceback (most recent call last):
>     raise FatalTraCIError("connection closed by SUMO")
> traci.exceptions.FatalTraCIError: connection closed by SUMO
---------- Differences in output ----------
18,34d17
< Get after load....
< vtype
< 1.0 == 1.0
< 1.0 == 1.0
< 2.0 == 2.0
< 3.0 == 3.0
< 6.0 == 6.0
< 7.0 == 7.0
< 1.3 == 1.3
< vehicle
< 1.0 == 1.0
< 1.0 == 1.0
< 2.0 == 2.0
< 3.0 == 3.0
< 6.0 == 6.0
< 7.0 == 7.0
< 1.3 == 1.3
---------- Differences in vehroutes ----------
5,16d4
<     <vehicle id="veh0" depart="0.00" departPos="100.00" departSpeed="10.00" arrival="270.00">
<         <route edges="4/1to3/1 3/1to2/1 2/1to1/1 1/1to0/1"/>
<     </vehicle>
< 
<     <vehicle id="veh1" type="t1" depart="10.00" departPos="100.00" departSpeed="10.00" arrival="276.00">
<         <route edges="4/1to3/1 3/1to2/1 2/1to1/1 1/1to0/1"/>
<     </vehicle>
< 
<     <vehicle id="veh2" type="t2@veh2" depart="20.00" departPos="100.00" departSpeed="10.00" arrival="282.00">
<         <route edges="4/1to3/1 3/1to2/1 2/1to1/1 1/1to0/1"/>
<     </vehicle>
< 

2 TESTS FAILED on ts-sim-build-ba :

---------- Differences in errors ----------
1,2c1,8
< Error: tcpip::Socket::accept() Unable to create listening socket: Address already in use
< Quitting (on error).
---
> Traceback (most recent call last):
>   File "/home/delphi/extraGcc/sumo/tests/../tests/complex/traci/connection/busySocket/runner.py", line 41, in <module>
>     stdout=sys.stdout)
>   File "/usr/lib/python2.7/subprocess.py", line 394, in __init__
>     errread, errwrite)
>   File "/usr/lib/python2.7/subprocess.py", line 1047, in _execute_child
>     raise child_exception
> OSError: [Errno 2] No such file or directory
---------- Differences in output ----------
1,2d0
< Loading configuration ... done.
< Loading configuration ... done.
traci connection busySocket sumo ( Last six runs Oct2020 Sep2020 )
traci connection busySocket sumo-gui ( Last six runs Oct2020 Sep2020 )

2 TESTS FAILED on ts-sim-build-ba :

---------- Differences in errors ----------
0a1,10
> Traceback (most recent call last):
>   File "/home/delphi/extraGcc/sumo/tests/../tests/complex/traci/connection/clientCloses/runner.py", line 68, in <module>
>     runSingle(99, 50)
>   File "/home/delphi/extraGcc/sumo/tests/../tests/complex/traci/connection/clientCloses/runner.py", line 47, in runSingle
>     stdout=sys.stdout)
>   File "/usr/lib/python2.7/subprocess.py", line 394, in __init__
>     errread, errwrite)
>   File "/usr/lib/python2.7/subprocess.py", line 1047, in _execute_child
>     raise child_exception
> OSError: [Errno 2] No such file or directory
---------- Differences in output ----------
3,21d2
< Loading configuration ... done.
< Print ended at step 100
< ----------- SUMO end time is not given -----------
< Loading configuration ... done.
< Print ended at step 100
< =========== empty routes in SUMO ===========
< ----------- SUMO end time is smaller than TraCI's -----------
< Loading configuration ... done.
< Print ended at step 100
< ----------- SUMO end time is not given -----------
< Loading configuration ... done.
< Print ended at step 100
< =========== vehicle leaves before TraCI ends ===========
< ----------- SUMO end time is smaller than TraCI's -----------
< Loading configuration ... done.
< Print ended at step 100
< ----------- SUMO end time is not given -----------
< Loading configuration ... done.
< Print ended at step 100
traci connection clientCloses sumo ( Last six runs Oct2020 Sep2020 )
traci connection clientCloses sumo-gui ( Last six runs Oct2020 Sep2020 )

2 TESTS FAILED on ts-sim-build-ba :

---------- Differences in errors ----------
0a1,10
> Traceback (most recent call last):
>   File "/home/delphi/extraGcc/sumo/tests/../tests/complex/traci/connection/closingOutput/runner.py", line 36, in <module>
>     traci.start([sumoBinary, "-c", "sumo.sumocfg"] + addOption, stdout=sys.stdout)
>   File "/home/delphi/extraGcc/sumo/tools/traci/main.py", line 156, in start
>     sumoProcess = subprocess.Popen(cmd2, stdout=stdout)
>   File "/usr/lib/python2.7/subprocess.py", line 394, in __init__
>     errread, errwrite)
>   File "/usr/lib/python2.7/subprocess.py", line 1047, in _execute_child
>     raise child_exception
> OSError: [Errno 2] No such file or directory
---------- Differences in output ----------
1d0
< Loading configuration ... done.
---------- Missing result in state ----------
<?xml version="1.0" encoding="UTF-8"?>


<netstate xmlns:xsi="http://www.w3.org/2001/XMLSchema-instance" xsi:noNamespaceSchemaLocation="http://sumo.dlr.de/xsd/netstate_file.xsd">
    <timestep time="0.00">
        <edge id="2fi">
            <lane id="2fi_0">
                <vehicle id="horiz" pos="5.10" speed="0.00"/>
            </lane>
        </edge>
    </timestep>
    <timestep time="1.00">
        <edge id="2fi">
            <lane id="2fi_0">
                <vehicle id="horiz" pos="6.53" speed="1.43"/>
            </lane>
        </edge>
    </timestep>
    <timestep time="2.00">
        <edge id="2fi">
            <lane id="2fi_0">
                <vehicle id="horiz" pos="10.57" speed="4.03"/>
            </lane>
        </edge>
    </timestep>
    <timestep time="3.00">
        <edge id="2fi">
            <lane id="2fi_0">
                <vehicle id="horiz" pos="16.77" speed="6.21"/>
            </lane>
<truncated after showing first 30 lines>
---------- Missing result in tripinfo ----------
<?xml version="1.0" encoding="UTF-8"?>


<tripinfos xmlns:xsi="http://www.w3.org/2001/XMLSchema-instance" xsi:noNamespaceSchemaLocation="http://sumo.dlr.de/xsd/tripinfo_file.xsd">
</tripinfos>
traci connection closingOutput sumo ( Last six runs Oct2020 Sep2020 )
traci connection closingOutput sumo-gui ( Last six runs Oct2020 Sep2020 )

TEST FAILED on ts-sim-build-ba : traci connection multipleConnections asyncDisconnect sumo ( Last six runs Oct2020 Sep2020 )

---------- Differences in errors ----------
0a1,94
> /bin/sh: 0: Illegal option --
> Process Process-1:
> Traceback (most recent call last):
>     raise FatalTraCIError("Could not connect in %s tries" % (numRetries + 1))
> FatalTraCIError: Could not connect in 11 tries
>     self.run()
>   File "/usr/lib/python2.7/multiprocessing/process.py", line 114, in run
>     self._target(*self._args, **self._kwargs)
>   File "/home/delphi/extraGcc/sumo/tests/../tests/complex/traci/connection/multipleConnections/asyncDisconnect/runner.py", line 46, in traciLoop
>     traci.init(port)
>   File "/home/delphi/extraGcc/sumo/tools/traci/main.py", line 136, in init
>     _connections[label] = connect(port, numRetries, host, proc)
>   File "/home/delphi/extraGcc/sumo/tools/traci/main.py", line 127, in connect
>     raise FatalTraCIError("Could not connect in %s tries" % (numRetries + 1))
> FatalTraCIError: Could not connect in 11 tries
> /bin/sh: 0: Illegal option --
> Process Process-3:
> Traceback (most recent call last):
>     raise FatalTraCIError("Could not connect in %s tries" % (numRetries + 1))
> FatalTraCIError: Could not connect in 11 tries
> Process Process-4:
> Traceback (most recent call last):
>     raise FatalTraCIError("Could not connect in %s tries" % (numRetries + 1))
> FatalTraCIError: Could not connect in 11 tries
> /bin/sh: 0: Illegal option --
> Process Process-5:
> Traceback (most recent call last):
>     raise FatalTraCIError("Could not connect in %s tries" % (numRetries + 1))
> FatalTraCIError: Could not connect in 11 tries
<truncated after showing first 30 lines>
---------- Differences in output ----------
4,16d3
< Loading configuration ... done.
< ***Starting server on port <PORT> ***
<   waiting for 2 clients...
<   client connected
<   client connected
< Loading net-file from 'input_net.net.xml' ... done ((TIME)).
< Loading additional-files from 'input_additional2.add.xml' ... done ((TIME)).
< Loading done.
< Simulation started with time: 0.00
< Process 1 ended at step 20.0
< Process 1 was informed about 1 entered vehicles
< Process 2 ended at step 99.0
< Process 2 was informed about 3 entered vehicles
18,30d4
< Loading configuration ... done.
< ***Starting server on port <PORT> ***
<   waiting for 2 clients...
<   client connected
<   client connected
< Loading net-file from 'input_net.net.xml' ... done ((TIME)).
< Loading additional-files from 'input_additional2.add.xml' ... done ((TIME)).
< Loading done.
< Simulation started with time: 0.00
< Process 1 ended at step 20.0
< Process 1 was informed about 1 entered vehicles
< Process 2 ended at step 99.0
< Process 2 was informed about 3 entered vehicles
33,48d6
< Loading configuration ... done.
<truncated after showing first 30 lines>

TEST FAILED on ts-sim-build-ba : traci connection multipleConnections basic sumo ( Last six runs Oct2020 Sep2020 )

---------- Differences in errors ----------
0a1,118
> /bin/sh: 0: Illegal option --
> Process Process-1:
> Traceback (most recent call last):
>     raise FatalTraCIError("Could not connect in %s tries" % (numRetries + 1))
>     raise FatalTraCIError("Could not connect in %s tries" % (numRetries + 1))
> FatalTraCIError: Could not connect in 11 tries
> FatalTraCIError: Could not connect in 11 tries
> /bin/sh: 0: Illegal option --
> Process Process-4:
> Traceback (most recent call last):
>     raise FatalTraCIError("Could not connect in %s tries" % (numRetries + 1))
> FatalTraCIError: Could not connect in 11 tries
> Process Process-3:
> Traceback (most recent call last):
>     raise FatalTraCIError("Could not connect in %s tries" % (numRetries + 1))
> FatalTraCIError: Could not connect in 11 tries
> /bin/sh: 0: Illegal option --
> Process Process-5:
> Traceback (most recent call last):
>     raise FatalTraCIError("Could not connect in %s tries" % (numRetries + 1))
> FatalTraCIError: Could not connect in 11 tries
> Process Process-6:
> Traceback (most recent call last):
>     raise FatalTraCIError("Could not connect in %s tries" % (numRetries + 1))
> FatalTraCIError: Could not connect in 11 tries
> Process Process-7:
> Traceback (most recent call last):
>     raise FatalTraCIError("Could not connect in %s tries" % (numRetries + 1))
> FatalTraCIError: Could not connect in 11 tries
<truncated after showing first 30 lines>
---------- Differences in output ----------
4,14d3
< Loading configuration ... done.
< ***Starting server on port <PORT> ***
<   waiting for 2 clients...
<   client connected
<   client connected
< Loading net-file from 'input_net.net.xml' ... done ((TIME)).
< Loading additional-files from 'input_additional2.add.xml' ... done ((TIME)).
< Loading done.
< Simulation started with time: 0.00
< Process 1 ended at step 99.0
< Process 2 ended at step 99.0
16,26d4
< Loading configuration ... done.
< ***Starting server on port <PORT> ***
<   waiting for 2 clients...
<   client connected
<   client connected
< Loading net-file from 'input_net.net.xml' ... done ((TIME)).
< Loading additional-files from 'input_additional2.add.xml' ... done ((TIME)).
< Loading done.
< Simulation started with time: 0.00
< Process 1 ended at step 99.0
< Process 2 ended at step 99.0
29,45d6
< Loading configuration ... done.
< ***Starting server on port <PORT> ***
<   waiting for 5 clients...
<   client connected
<   client connected
<truncated after showing first 30 lines>

TEST FAILED on ts-sim-build-ba : traci connection multipleConnections basic sumo-gui ( Last six runs Oct2020 Sep2020 )

---------- Differences in errors ----------
0a1,119
> /bin/sh: 0: Illegal option --
> Process Process-1:
> Traceback (most recent call last):
>     raise FatalTraCIError("Could not connect in %s tries" % (numRetries + 1))
>   File "/home/delphi/extraGcc/sumo/tools/traci/main.py", line 127, in connect
>     raise FatalTraCIError("Could not connect in %s tries" % (numRetries + 1))
> FatalTraCIError: Could not connect in 11 tries
> FatalTraCIError: Could not connect in 11 tries
> /bin/sh: 0: Illegal option --
> Process Process-4:
> Traceback (most recent call last):
>     raise FatalTraCIError("Could not connect in %s tries" % (numRetries + 1))
> FatalTraCIError: Could not connect in 11 tries
> Process Process-3:
> Traceback (most recent call last):
>     raise FatalTraCIError("Could not connect in %s tries" % (numRetries + 1))
> FatalTraCIError: Could not connect in 11 tries
> /bin/sh: 0: Illegal option --
> Process Process-5:
> Traceback (most recent call last):
>     raise FatalTraCIError("Could not connect in %s tries" % (numRetries + 1))
> FatalTraCIError: Could not connect in 11 tries
> Process Process-6:
> Traceback (most recent call last):
>     raise FatalTraCIError("Could not connect in %s tries" % (numRetries + 1))
> FatalTraCIError: Could not connect in 11 tries
> Process Process-7:
> Traceback (most recent call last):
>     raise FatalTraCIError("Could not connect in %s tries" % (numRetries + 1))
<truncated after showing first 30 lines>
---------- Differences in output ----------
4,6d3
< Loading configuration ... done.
< Process 1 ended at step 99
< Process 2 ended at step 99
8,10d4
< Loading configuration ... done.
< Process 1 ended at step 99
< Process 2 ended at step 99
13,18d6
< Loading configuration ... done.
< Process 1 ended at step 99
< Process 2 ended at step 99
< Process 3 ended at step 99
< Process 4 ended at step 99
< Process 5 ended at step 99
20,25d7
< Loading configuration ... done.
< Process 1 ended at step 99
< Process 2 ended at step 99
< Process 3 ended at step 99
< Process 4 ended at step 99
< Process 5 ended at step 99
29,31d10
< Loading configuration ... done.
< Process 1 ended at step 99
< Process 2 ended at step 99
33,35d11
< Loading configuration ... done.
< Process 1 ended at step 99
< Process 2 ended at step 99
<truncated after showing first 30 lines>

TEST FAILED on ts-sim-build-ba : traci connection multipleConnections concurringSubscriptions sumo ( Last six runs Oct2020 Sep2020 )

---------- Differences in errors ----------
0a1,18
> /bin/sh: 0: Illegal option --
> Process Process-1:
> Traceback (most recent call last):
>     raise FatalTraCIError("Could not connect in %s tries" % (numRetries + 1))
>     _connections[label] = connect(port, numRetries, host, proc)
>   File "/home/delphi/extraGcc/sumo/tools/traci/main.py", line 127, in connect
>     raise FatalTraCIError("Could not connect in %s tries" % (numRetries + 1))
> FatalTraCIError: Could not connect in 11 tries
> FatalTraCIError: Could not connect in 11 tries
> /bin/sh: 0: Illegal option --
> Process Process-3:
> Traceback (most recent call last):
>     raise FatalTraCIError("Could not connect in %s tries" % (numRetries + 1))
> FatalTraCIError: Could not connect in 11 tries
> Process Process-4:
> Traceback (most recent call last):
>     raise FatalTraCIError("Could not connect in %s tries" % (numRetries + 1))
> FatalTraCIError: Could not connect in 11 tries
---------- Differences in output ----------
4,17d3
< Loading configuration ... done.
< ***Starting server on port <PORT> ***
<   waiting for 2 clients...
<   client connected
<   client connected
< Loading net-file from 'input_net.net.xml' ... done ((TIME)).
< Loading done.
< Simulation started with time: 0.00
<    1 subscribing to speed (ID = 64) of vehicle 'horiz'
<    -> {'horiz': {64: 0.0}}
<    2 subscribing to acceleration (ID = 70) of vehicle 'horiz'
<    -> {'horiz': {70: 2.6}}
< Process 1 (order 1) ended at step 120.0
< Process 2 (order 2) ended at step 120.0
20,1969d5
< Loading configuration ... done.
< ***Starting server on port <PORT> ***
<   waiting for 2 clients...
<   client connected
<   client connected
< Loading net-file from 'input_net.net.xml' ... done ((TIME)).
< Loading done.
< Simulation started with time: 0.00
<    2 subscribing to acceleration (ID = 70) of vehicle 'horiz'
<    -> {'horiz': {70: 2.6}}
<    1 subscribing to speed (ID = 64) of vehicle 'horiz'
<    -> {'horiz': {64: 0.0}}
< Process 1 (order 9) ended at step 120.0
< Process 2 (order 8) ended at step 120.0
<truncated after showing first 30 lines>

TEST FAILED on ts-sim-build-ba : traci connection multipleConnections differentSteplengths sumo ( Last six runs Oct2020 Sep2020 )

---------- Differences in errors ----------
0a1,80
> /bin/sh: 0: Illegal option --
> Process Process-1:
> Traceback (most recent call last):
>     raise FatalTraCIError("Could not connect in %s tries" % (numRetries + 1))
> FatalTraCIError: Could not connect in 11 tries
>     self.run()
>   File "/usr/lib/python2.7/multiprocessing/process.py", line 114, in run
>     self._target(*self._args, **self._kwargs)
>     self.run()
>   File "/home/delphi/extraGcc/sumo/tests/../tests/complex/traci/connection/multipleConnections/differentSteplengths/runner.py", line 46, in traciLoop
>   File "/usr/lib/python2.7/multiprocessing/process.py", line 114, in run
>     self._target(*self._args, **self._kwargs)
>   File "/home/delphi/extraGcc/sumo/tests/../tests/complex/traci/connection/multipleConnections/differentSteplengths/runner.py", line 46, in traciLoop
>     traci.init(port)
>   File "/home/delphi/extraGcc/sumo/tools/traci/main.py", line 136, in init
>     traci.init(port)
>   File "/home/delphi/extraGcc/sumo/tools/traci/main.py", line 136, in init
>     _connections[label] = connect(port, numRetries, host, proc)
>   File "/home/delphi/extraGcc/sumo/tools/traci/main.py", line 127, in connect
>     raise FatalTraCIError("Could not connect in %s tries" % (numRetries + 1))
>     _connections[label] = connect(port, numRetries, host, proc)
>   File "/home/delphi/extraGcc/sumo/tools/traci/main.py", line 127, in connect
>     raise FatalTraCIError("Could not connect in %s tries" % (numRetries + 1))
> FatalTraCIError: Could not connect in 11 tries
> FatalTraCIError: Could not connect in 11 tries
> Process Process-4:
> Traceback (most recent call last):
>     raise FatalTraCIError("Could not connect in %s tries" % (numRetries + 1))
> FatalTraCIError: Could not connect in 11 tries
<truncated after showing first 30 lines>
---------- Differences in output ----------
4,22d3
< Loading configuration ... done.
< ***Starting server on port <PORT> ***
<   waiting for 4 clients...
<   client connected
<   client connected
<   client connected
<   client connected
< Loading net-file from 'input_net.net.xml' ... done ((TIME)).
< Loading additional-files from 'input_additional2.add.xml' ... done ((TIME)).
< Loading done.
< Simulation started with time: 0.00
< Process 1 ended at step 99.0
< Process 1 was informed about 3 entered vehicles
< Process 2 ended at step 99.0
< Process 2 was informed about 3 entered vehicles
< Process 3 ended at step 101.0
< Process 3 was informed about 3 entered vehicles
< Process 4 ended at step 100.0
< Process 4 was informed about 3 entered vehicles
24,42d4
< Loading configuration ... done.
< ***Starting server on port <PORT> ***
<   waiting for 4 clients...
<   client connected
<   client connected
<   client connected
<   client connected
< Loading net-file from 'input_net.net.xml' ... done ((TIME)).
< Loading additional-files from 'input_additional2.add.xml' ... done ((TIME)).
<truncated after showing first 30 lines>

TEST FAILED on ts-sim-build-ba : traci connection multipleConnections orderDependentResults sumo ( Last six runs Oct2020 Sep2020 )

---------- Differences in errors ----------
0a1,18
> /bin/sh: 0: Illegal option --
> Process Process-1:
> Traceback (most recent call last):
>     raise FatalTraCIError("Could not connect in %s tries" % (numRetries + 1))
> FatalTraCIError: Could not connect in 11 tries
> Process Process-2:
> Traceback (most recent call last):
>     raise FatalTraCIError("Could not connect in %s tries" % (numRetries + 1))
> FatalTraCIError: Could not connect in 11 tries
> /bin/sh: 0: Illegal option --
> Process Process-3:
> Traceback (most recent call last):
>     raise FatalTraCIError("Could not connect in %s tries" % (numRetries + 1))
> FatalTraCIError: Could not connect in 11 tries
> Process Process-4:
> Traceback (most recent call last):
>     raise FatalTraCIError("Could not connect in %s tries" % (numRetries + 1))
> FatalTraCIError: Could not connect in 11 tries
---------- Differences in output ----------
4,1237d3
< Loading configuration ... done.
< ***Starting server on port <PORT> ***
<   waiting for 2 clients...
<   client connected
<   client connected
< Loading net-file from 'input_net.net.xml' ... done ((TIME)).
< Loading done.
< Simulation started with time: 0.00
<    stepping (step 1)...
<    Retrieving position for vehicle 'horiz' -> 5.1 on lane '2fi_0'
<    Retrieving speed for vehicle 'horiz' -> 0.0
<    Setting speed for vehicle 'horiz' -> 5
<    Retrieving speed for vehicle 'horiz' -> 0.0
<    stepping (step 1)...
<    Retrieving position for vehicle 'horiz' -> 5.1 on lane '2fi_0'
<    Retrieving speed for vehicle 'horiz' -> 0.0
<    Setting speed for vehicle 'horiz' -> 10
<    Retrieving speed for vehicle 'horiz' -> 0.0
<    stepping (step 2)...
<    Retrieving position for vehicle 'horiz' -> 15.1 on lane '2fi_0'
<    Retrieving speed for vehicle 'horiz' -> 10.0
<    Setting speed for vehicle 'horiz' -> 5
<    Retrieving speed for vehicle 'horiz' -> 10.0
<    stepping (step 2)...
<    Retrieving position for vehicle 'horiz' -> 15.1 on lane '2fi_0'
<    Retrieving speed for vehicle 'horiz' -> 10.0
<    Setting speed for vehicle 'horiz' -> 10
<    Retrieving speed for vehicle 'horiz' -> 10.0
<    stepping (step 3)...
<truncated after showing first 30 lines>

TEST FAILED on ts-sim-build-ba : traci connection multipleConnections subsecondSUMOstep sumo ( Last six runs Oct2020 Sep2020 )

---------- Differences in errors ----------
0a1,66
> /bin/sh: 0: Illegal option --
> Process Process-1:
> Traceback (most recent call last):
>     raise FatalTraCIError("Could not connect in %s tries" % (numRetries + 1))
>     _connections[label] = connect(port, numRetries, host, proc)
>     raise FatalTraCIError("Could not connect in %s tries" % (numRetries + 1))
>   File "/home/delphi/extraGcc/sumo/tools/traci/main.py", line 127, in connect
>     raise FatalTraCIError("Could not connect in %s tries" % (numRetries + 1))
> FatalTraCIError: Could not connect in 11 tries
> FatalTraCIError: Could not connect in 11 tries
> FatalTraCIError: Could not connect in 11 tries
> Process Process-4:
> Traceback (most recent call last):
>     raise FatalTraCIError("Could not connect in %s tries" % (numRetries + 1))
> FatalTraCIError: Could not connect in 11 tries
> /bin/sh: 0: Illegal option --
> Process Process-5:
> Traceback (most recent call last):
>     raise FatalTraCIError("Could not connect in %s tries" % (numRetries + 1))
> FatalTraCIError: Could not connect in 11 tries
> Process Process-6:
> Traceback (most recent call last):
>     raise FatalTraCIError("Could not connect in %s tries" % (numRetries + 1))
> FatalTraCIError: Could not connect in 11 tries
> Process Process-7:
> Traceback (most recent call last):
>     raise FatalTraCIError("Could not connect in %s tries" % (numRetries + 1))
> FatalTraCIError: Could not connect in 11 tries
> Process Process-8:
<truncated after showing first 30 lines>
---------- Differences in output ----------
4,22d3
< Loading configuration ... done.
< ***Starting server on port <PORT> ***
<   waiting for 4 clients...
<   client connected
<   client connected
<   client connected
<   client connected
< Loading net-file from 'input_net.net.xml' ... done ((TIME)).
< Loading additional-files from 'input_additional2.add.xml' ... done ((TIME)).
< Loading done.
< Simulation started with time: 0.00
< Process 1 ended at step 99.0
< Process 1 was informed about 3 entered vehicles
< Process 2 ended at step 99.0
< Process 2 was informed about 3 entered vehicles
< Process 3 ended at step 100.3
< Process 3 was informed about 3 entered vehicles
< Process 4 ended at step 100.0
< Process 4 was informed about 3 entered vehicles
24,42d4
< Loading configuration ... done.
< ***Starting server on port <PORT> ***
<   waiting for 4 clients...
<   client connected
<   client connected
<   client connected
<   client connected
< Loading net-file from 'input_net.net.xml' ... done ((TIME)).
< Loading additional-files from 'input_additional2.add.xml' ... done ((TIME)).
<truncated after showing first 30 lines>

TEST FAILED on ts-sim-build-ba : traci connection multipleConnections unspecifiedOrderWarning sumo ( Last six runs Oct2020 Sep2020 )

---------- Differences in errors ----------
1,4c1,2
< Error: Execution order (libsumo::CMD_SETORDER) was not set for all TraCI clients in pre-execution phase.
< Quitting (on error).
< Error: Execution order (libsumo::CMD_SETORDER) was not set for all TraCI clients in pre-execution phase.
< Quitting (on error).
---
> /bin/sh: 0: Illegal option --
> /bin/sh: 0: Illegal option --
---------- Differences in output ----------
3,9c3,4
< Loading configuration ... done.
< ***Starting server on port <PORT> ***
<   waiting for 2 clients...
<   client connected
<   client connected
< client 1:  connection closed by SUMO  (at TraCIStep 1)
< client 2:  connection closed by SUMO  (at TraCIStep 1)
---
> client 1:  Could not connect in 11 tries  (at TraCIStep 1)
> client 2:  Could not connect in 11 tries  (at TraCIStep 1)
11,17c6,7
< Loading configuration ... done.
< ***Starting server on port <PORT> ***
<   waiting for 2 clients...
<   client connected
<   client connected
< client 1:  connection closed by SUMO  (at TraCIStep 1)
< client 2:  connection closed by SUMO  (at TraCIStep 1)
---
> client 1:  Could not connect in 11 tries  (at TraCIStep 1)
> client 2:  Could not connect in 11 tries  (at TraCIStep 1)

2 TESTS FAILED on ts-sim-build-ba :

---------- Differences in errors ----------
0a1,4
> /bin/sh: 0: Illegal option --
> Traceback (most recent call last):
>     raise FatalTraCIError("Could not connect in %s tries" % (numRetries + 1))
> traci.exceptions.FatalTraCIError: Could not connect in 11 tries
---------- Differences in output ----------
2d1
< Loading configuration ... done.
4,62d2
< Print ended at step 100
< Loading configuration ... done.
<  Run 1
< Print ended at step 100
< Loading configuration ... done.
<  Run 2
< Print ended at step 100
< Loading configuration ... done.
<  Run 3
< Print ended at step 100
< Loading configuration ... done.
<  Run 4
< Print ended at step 100
< Loading configuration ... done.
<  Run 5
< Print ended at step 100
< Loading configuration ... done.
<  Run 6
< Print ended at step 100
< Loading configuration ... done.
<  Run 7
< Print ended at step 100
< Loading configuration ... done.
<  Run 8
< Print ended at step 100
< Loading configuration ... done.
<  Run 9
<truncated after showing first 30 lines>
traci connection repeatedConnection sumo ( Last six runs Oct2020 Sep2020 )
traci connection repeatedConnection sumo-gui ( Last six runs Oct2020 Sep2020 )

2 TESTS FAILED on ts-sim-build-ba :

---------- Differences in output ----------
1,5d0
< Loading configuration ... done.
< ['1fi']
< Ok: Unsubscribe successful
< Print ended at step 1003.0
< Ok: Subscription and computed are same
traci contextSubscriptions edge_100m ( Last six runs Oct2020 Sep2020 )
traci contextSubscriptions edge_200m ( Last six runs Oct2020 Sep2020 )

2 TESTS FAILED on ts-sim-build-ba :

---------- Differences in output ----------
1,5d0
< Loading configuration ... done.
< ['0']
< Ok: Unsubscribe successful
< Print ended at step 1003.0
< Ok: Subscription and computed are same
traci contextSubscriptions junction_100m ( Last six runs Oct2020 Sep2020 )
traci contextSubscriptions junction_200m ( Last six runs Oct2020 Sep2020 )

2 TESTS FAILED on ts-sim-build-ba :

---------- Differences in output ----------
1,5d0
< Loading configuration ... done.
< ['2si_0']
< Ok: Unsubscribe successful
< Print ended at step 1003.0
< Ok: Subscription and computed are same
traci contextSubscriptions lane_100m ( Last six runs Oct2020 Sep2020 )
traci contextSubscriptions lane_200m ( Last six runs Oct2020 Sep2020 )

2 TESTS FAILED on ts-sim-build-ba :

---------- Differences in output ----------
1,5d0
< Loading configuration ... done.
< ['p0']
< Ok: Unsubscribe successful
< Print ended at step 1003.0
< Ok: Subscription and computed are same
traci contextSubscriptions person_100m ( Last six runs Oct2020 Sep2020 )
traci contextSubscriptions person_200m ( Last six runs Oct2020 Sep2020 )

2 TESTS FAILED on ts-sim-build-ba :

---------- Differences in output ----------
1,5d0
< Loading configuration ... done.
< ['poi']
< Ok: Unsubscribe successful
< Print ended at step 1003.0
< Ok: Subscription and computed are same
traci contextSubscriptions poi_100m ( Last six runs Oct2020 Sep2020 )
traci contextSubscriptions poi_200m ( Last six runs Oct2020 Sep2020 )

2 TESTS FAILED on ts-sim-build-ba :

---------- Differences in output ----------
1,5d0
< Loading configuration ... done.
< ['poly']
< Ok: Unsubscribe successful
< Print ended at step 1003.0
< Ok: Subscription and computed are same
traci contextSubscriptions polygon_100m ( Last six runs Oct2020 Sep2020 )
traci contextSubscriptions polygon_200m ( Last six runs Oct2020 Sep2020 )

2 TESTS FAILED on ts-sim-build-ba :

---------- Differences in output ----------
1,5d0
< Loading configuration ... done.
< ['ego']
< Ok: Unsubscribe successful
< Print ended at step 1003.0
< Ok: Subscription and computed are same
traci contextSubscriptions range_100m ( Last six runs Oct2020 Sep2020 )
traci contextSubscriptions range_200m ( Last six runs Oct2020 Sep2020 )

TEST FAILED on ts-sim-build-ba : traci lane lane_intermodal ( Last six runs Oct2020 Sep2020 )

---------- Differences in errors ----------
1c1,3
< Error: Answered with error to command 0xa3: Lane ':C_15_0' is not known
---
> Traceback (most recent call last):
>     raise FatalTraCIError("connection closed by SUMO")
> traci.exceptions.FatalTraCIError: connection closed by SUMO

TEST FAILED on ts-sim-build-ba : traci misc lateralCollision laneChanging leftLane ( Last six runs Oct2020 Sep2020 )

---------- Differences in errors ----------
1,2c1,4
< Warning: Teleporting vehicle 'left'; collision with vehicle 'collider', lane='e2_2', gap=-7.50, time=6.00 stage=laneChange.
< Warning: Vehicle 'left' ends teleporting on edge 'e3', time 6.00.
---
> Traceback (most recent call last):
>   File "/home/delphi/extraGcc/sumo/tests/../tests/complex/traci/misc/lateralCollision/laneChanging/runner.py", line 77, in <module>
>     runSingle(50, int(sys.argv[2]), "collider")
> ValueError: invalid literal for int() with base 10: 'sumo'
---------- Differences in output ----------
1,28d0
< Loading configuration ... done.
< old lanechangemode 011001010101
< old speedmode 31
< new lanechangemode 010001010101
< new speedmode 0
< [000] lane 1, lateral pos: 0.00
< [001] lane 1, lateral pos: 0.00
< [002] lane 1, lateral pos: 0.00
< [003] lane 1, lateral pos: 0.00
< [004] lane 1, lateral pos: 0.00
< trying to change lane...
< [005] lane 1, lateral pos: 0.00
< [006] lane 2, lateral pos: 0.00
< [007] lane 2, lateral pos: 0.00
< [008] lane 2, lateral pos: 0.00
< [009] lane 2, lateral pos: 0.00
< [010] lane 2, lateral pos: 0.00
< [011] lane 2, lateral pos: 0.00
< [012] lane 2, lateral pos: 0.00
< [013] lane 2, lateral pos: 0.00
< [014] lane 2, lateral pos: 0.00
< [015] lane 2, lateral pos: 0.00
< [016] lane 2, lateral pos: 0.00
< [017] lane 2, lateral pos: 0.00
< [018] lane 2, lateral pos: 0.00
< [019] lane 2, lateral pos: 0.00
< [020] Vehicle 'collider' has arrived at destination
< Print ended at step 21

TEST FAILED on ts-sim-build-ba : traci misc lateralCollision laneChanging rightLane ( Last six runs Oct2020 Sep2020 )

---------- Differences in errors ----------
1,2c1,4
< Warning: Teleporting vehicle 'collider'; collision with vehicle 'right', lane='e2_0', gap=-7.50, time=6.00 stage=laneChange.
< Warning: Vehicle 'collider' ends teleporting on edge 'e3', time 6.00.
---
> Traceback (most recent call last):
>   File "/home/delphi/extraGcc/sumo/tests/../tests/complex/traci/misc/lateralCollision/laneChanging/runner.py", line 77, in <module>
>     runSingle(50, int(sys.argv[2]), "collider")
> ValueError: invalid literal for int() with base 10: 'sumo'
---------- Differences in output ----------
1,24d0
< Loading configuration ... done.
< old lanechangemode 011001010101
< old speedmode 31
< new lanechangemode 010001010101
< new speedmode 0
< [000] lane 1, lateral pos: 0.00
< [001] lane 1, lateral pos: 0.00
< [002] lane 1, lateral pos: 0.00
< [003] lane 1, lateral pos: 0.00
< [004] lane 1, lateral pos: 0.00
< trying to change lane...
< [005] lane 1, lateral pos: 0.00
< [006] lane 0, lateral pos: 0.00
< [007] lane 0, lateral pos: 0.00
< [008] lane 0, lateral pos: 0.00
< [009] lane 0, lateral pos: 0.00
< [010] lane 0, lateral pos: 0.00
< [011] lane 0, lateral pos: 0.00
< [012] lane 0, lateral pos: 0.00
< [013] lane 0, lateral pos: 0.00
< [014] lane 0, lateral pos: 0.00
< [015] lane 0, lateral pos: 0.00
< [016] Vehicle 'collider' has arrived at destination
< Print ended at step 17

TEST FAILED on ts-sim-build-ba : traci misc lateralCollision sublaneChanging leftLane0.2 ( Last six runs Oct2020 Sep2020 )

---------- Differences in errors ----------
1,4c1,4
< Warning: Teleporting vehicle 'collider'; collision with vehicle 'left', lane='e3_2', gap=-7.50', latGap=-0.10, time=11.00 stage=laneChange.
< Warning: Teleporting vehicle 'left'; collision with vehicle 'collider', lane='e3_2', gap=-7.50', latGap=-0.10, time=11.00 stage=laneChange.
< Warning: Vehicle 'collider' ends teleporting on edge 'e4', time 11.00.
< Warning: Vehicle 'left' ends teleporting on edge 'e4', time 11.00.
---
> Traceback (most recent call last):
>   File "/home/delphi/extraGcc/sumo/tests/../tests/complex/traci/misc/lateralCollision/sublaneChanging/runner.py", line 76, in <module>
>     runSingle(50, float(sys.argv[2]), "collider")
> ValueError: could not convert string to float: sumo
---------- Differences in output ----------
1,39d0
< Loading configuration ... done.
< old lanechangemode 011001010101
< old speedmode 31
< new lanechangemode 010001010101
< new speedmode 0
< trying to change lateral position by 0.20...
< [000] lane 1, lateral pos: 0.00
< trying to change lateral position by 0.20...
< [001] lane 1, lateral pos: 0.20
< trying to change lateral position by 0.20...
< [002] lane 1, lateral pos: 0.40
< trying to change lateral position by 0.20...
< [003] lane 1, lateral pos: 0.60
< trying to change lateral position by 0.20...
< [004] lane 1, lateral pos: 0.80
< trying to change lateral position by 0.20...
< [005] lane 1, lateral pos: 1.00
< trying to change lateral position by 0.20...
< [006] lane 1, lateral pos: 1.20
< trying to change lateral position by 0.20...
< [007] lane 1, lateral pos: 1.40
< trying to change lateral position by 0.20...
< [008] lane 1, lateral pos: 1.60
< trying to change lateral position by 0.20...
< [009] lane 2, lateral pos: -1.40
< trying to change lateral position by 0.20...
< [010] lane 2, lateral pos: -1.20
< trying to change lateral position by 0.20...
< [011] lane 0, lateral pos: 0.00
<truncated after showing first 30 lines>

TEST FAILED on ts-sim-build-ba : traci misc lateralCollision sublaneChanging leftLane0.5 ( Last six runs Oct2020 Sep2020 )

---------- Differences in errors ----------
1,8c1,4
< Warning: Teleporting vehicle 'collider'; collision with vehicle 'left', lane='e1_2', gap=-7.50', latGap=-0.40, time=5.00 stage=laneChange.
< Warning: Teleporting vehicle 'left'; collision with vehicle 'collider', lane='e1_2', gap=-7.50', latGap=-0.40, time=5.00 stage=laneChange.
< Warning: Vehicle 'collider' ends teleporting on edge 'e2', time 6.00.
< Warning: Vehicle 'left' ends teleporting on edge 'e2', time 6.00.
< Warning: Teleporting vehicle 'collider'; collision with vehicle 'left', lane='e3_2', gap=-7.50', latGap=-0.40, time=11.00 stage=laneChange.
< Warning: Teleporting vehicle 'left'; collision with vehicle 'collider', lane='e3_2', gap=-7.50', latGap=-0.40, time=11.00 stage=laneChange.
< Warning: Vehicle 'collider' ends teleporting on edge 'e4', time 11.00.
< Warning: Vehicle 'left' ends teleporting on edge 'e4', time 11.00.
---
> Traceback (most recent call last):
>   File "/home/delphi/extraGcc/sumo/tests/../tests/complex/traci/misc/lateralCollision/sublaneChanging/runner.py", line 76, in <module>
>     runSingle(50, float(sys.argv[2]), "collider")
> ValueError: could not convert string to float: sumo
---------- Differences in output ----------
1,39d0
< Loading configuration ... done.
< old lanechangemode 011001010101
< old speedmode 31
< new lanechangemode 010001010101
< new speedmode 0
< trying to change lateral position by 0.50...
< [000] lane 1, lateral pos: 0.00
< trying to change lateral position by 0.50...
< [001] lane 1, lateral pos: 0.50
< trying to change lateral position by 0.50...
< [002] lane 1, lateral pos: 1.00
< trying to change lateral position by 0.50...
< [003] lane 1, lateral pos: 1.50
< trying to change lateral position by 0.50...
< [004] lane 2, lateral pos: -1.20
< trying to change lateral position by 0.50...
< [005] lane -1073741824, lateral pos: -1073741824.00
< trying to change lateral position by 0.50...
< [006] lane 1, lateral pos: 0.00
< trying to change lateral position by 0.50...
< [007] lane 1, lateral pos: 0.50
< trying to change lateral position by 0.50...
< [008] lane 1, lateral pos: 1.00
< trying to change lateral position by 0.50...
< [009] lane 1, lateral pos: 1.50
< trying to change lateral position by 0.50...
< [010] lane 2, lateral pos: -1.20
< trying to change lateral position by 0.50...
< [011] lane 0, lateral pos: 0.00
<truncated after showing first 30 lines>

TEST FAILED on ts-sim-build-ba : traci misc rerouting person stop_walk_stop_walk ( Last six runs Oct2020 Sep2020 )

---------- Differences in errors ----------
0a1,12
> Traceback (most recent call last):
>   File "/home/delphi/extraGcc/sumo/tests/../tests/complex/traci/misc/rerouting/person/stop_walk_stop_walk/runner.py", line 27, in <module>
>     import libsumo as traci  # noqa
>   File "/home/delphi/extraGcc/sumo/tools/libsumo/__init__.py", line 20, in <module>
>     from .libsumo import vehicle, simulation
>   File "/home/delphi/extraGcc/sumo/tools/libsumo/libsumo.py", line 17, in <module>
>     _libsumo = swig_import_helper()
>   File "/home/delphi/extraGcc/sumo/tools/libsumo/libsumo.py", line 16, in swig_import_helper
>     return importlib.import_module('_libsumo')
>   File "/usr/lib/python2.7/importlib/__init__.py", line 37, in import_module
>     __import__(name)
> ImportError: No module named _libsumo
---------- Missing result in fcd ----------
<?xml version="1.0" encoding="UTF-8"?>


<fcd-export xmlns:xsi="http://www.w3.org/2001/XMLSchema-instance" xsi:noNamespaceSchemaLocation="http://sumo.dlr.de/xsd/fcd_file.xsd">
    <timestep time="0.00">
        <person id="p0" x="107.95" y="81.95" angle="270.00" speed="0.00" pos="81.95" edge="SC" slope="0.00"/>
    </timestep>
    <timestep time="1.00">
        <person id="p0" x="107.95" y="81.95" angle="270.00" speed="0.00" pos="81.95" edge="SC" slope="0.00"/>
    </timestep>
    <timestep time="2.00">
        <person id="p0" x="107.95" y="81.95" angle="270.00" speed="0.00" pos="81.95" edge="SC" slope="0.00"/>
    </timestep>
    <timestep time="3.00">
        <person id="p0" x="107.95" y="81.95" angle="270.00" speed="0.00" pos="81.95" edge="SC" slope="0.00"/>
    </timestep>
    <timestep time="4.00">
        <person id="p0" x="107.95" y="81.95" angle="270.00" speed="0.00" pos="81.95" edge="SC" slope="0.00"/>
    </timestep>
    <timestep time="5.00">
        <person id="p0" x="107.95" y="81.95" angle="270.00" speed="0.00" pos="81.95" edge="SC" slope="0.00"/>
    </timestep>
    <timestep time="6.00">
        <person id="p0" x="107.95" y="81.95" angle="270.00" speed="0.00" pos="81.95" edge="SC" slope="0.00"/>
    </timestep>
    <timestep time="7.00">
        <person id="p0" x="107.95" y="81.95" angle="270.00" speed="0.00" pos="81.95" edge="SC" slope="0.00"/>
    </timestep>
    <timestep time="8.00">
        <person id="p0" x="107.95" y="81.95" angle="270.00" speed="0.00" pos="81.95" edge="SC" slope="0.00"/>
<truncated after showing first 30 lines>
---------- Missing result in vehroutes ----------
<?xml version="1.0" encoding="UTF-8"?>


<routes xmlns:xsi="http://www.w3.org/2001/XMLSchema-instance" xsi:noNamespaceSchemaLocation="http://sumo.dlr.de/xsd/routes_file.xsd">
    <person id="p0" depart="0.00" departPos="-10.00" arrival="110.00">
        <stop lane="SC_0" endPos="81.95" duration="15.00"/>
        <walk edges="SC CN"/>
        <stop lane="CN_0" endPos="10.00" duration="15.00"/>
        <walk edges="CN SC"/>
    </person>

</routes>

TEST FAILED on ts-sim-build-ba : traci person moveToXY keepRoute1_junction ( Last six runs Oct2020 Sep2020 )

---------- Differences in errors ----------
0a1
> Warning: Could not map position 111.59,92.40 onto lane ':C_w2_0'
---------- Differences in fcd ----------
57c57
<         <person id="p0" x="111.59" y="92.40" angle="0.00" speed="0.93" pos="0.05" edge=":C_c1" slope="0.00"/>
---
>         <person id="p0" x="111.59" y="92.40" angle="0.00" speed="0.93" pos="7.01" edge=":C_w2" slope="0.00"/>
60c60
<         <person id="p0" x="111.59" y="93.40" angle="0.00" speed="1.21" pos="1.05" edge=":C_c1" slope="0.00"/>
---
>         <person id="p0" x="111.59" y="93.40" angle="0.00" speed="0.93" pos="1.05" edge=":C_c1" slope="0.00"/>
63c63
<         <person id="p0" x="111.59" y="94.40" angle="0.00" speed="1.38" pos="2.05" edge=":C_c1" slope="0.00"/>
---
>         <person id="p0" x="111.59" y="94.40" angle="0.00" speed="1.21" pos="2.05" edge=":C_c1" slope="0.00"/>
66c66
<         <person id="p0" x="111.59" y="95.40" angle="0.00" speed="1.27" pos="3.05" edge=":C_c1" slope="0.00"/>
---
>         <person id="p0" x="111.59" y="95.40" angle="0.00" speed="1.38" pos="3.05" edge=":C_c1" slope="0.00"/>
69c69
<         <person id="p0" x="111.59" y="96.40" angle="0.00" speed="1.46" pos="4.05" edge=":C_c1" slope="0.00"/>
---
>         <person id="p0" x="111.59" y="96.40" angle="0.00" speed="1.27" pos="4.05" edge=":C_c1" slope="0.00"/>
72c72
<         <person id="p0" x="111.59" y="97.40" angle="0.00" speed="1.32" pos="5.05" edge=":C_c1" slope="0.00"/>
---
>         <person id="p0" x="111.59" y="97.40" angle="0.00" speed="1.46" pos="5.05" edge=":C_c1" slope="0.00"/>
75c75
<         <person id="p0" x="111.59" y="98.40" angle="0.00" speed="1.38" pos="6.05" edge=":C_c1" slope="0.00"/>
---
>         <person id="p0" x="111.59" y="98.40" angle="0.00" speed="1.32" pos="6.05" edge=":C_c1" slope="0.00"/>
78c78
<         <person id="p0" x="111.59" y="99.40" angle="0.00" speed="1.29" pos="7.05" edge=":C_c1" slope="0.00"/>
<truncated after showing first 30 lines>

TEST FAILED on ts-sim-build-ba : traci trafficlight getBlocking_reroute ( Last six runs Oct2020 Sep2020 )

---------- Differences in output ----------
1,2c1,2
< ('blocker1',)
< ('blocker2',)
---
> ()
> ()

TEST FAILED on ts-sim-build-ba : traci trafficlight railsignal_state ( Last six runs Oct2020 Sep2020 )

---------- Differences in output ----------
6c6
< 3.0 N2_0 b=() r=('rail3',) p=('rail3',)
---
> 3.0 N2_0 b=() r=() p=()
8c8
< 4.0 N2_0 b=() r=('rail3',) p=('rail3',)
---
> 4.0 N2_0 b=() r=() p=()
10c10
< 5.0 N2_0 b=() r=('rail3',) p=('rail3',)
---
> 5.0 N2_0 b=() r=() p=()
12c12
< 6.0 N2_0 b=() r=('rail3',) p=('rail3',)
---
> 6.0 N2_0 b=() r=() p=()
14c14
< 7.0 N2_0 b=() r=('rail3',) p=('rail3',)
---
> 7.0 N2_0 b=() r=() p=()
16c16
< 8.0 N2_0 b=() r=('rail3',) p=('rail3',)
---
> 8.0 N2_0 b=() r=() p=()
18c18
< 9.0 N2_0 b=() r=('rail3',) p=('rail3',)
---
> 9.0 N2_0 b=() r=() p=()
20c20
< 10.0 N2_0 b=() r=('rail3',) p=('rail3',)
<truncated after showing first 30 lines>

TEST FAILED on ts-sim-build-ba : traci vehicle distance_after_reroute ( Last six runs Oct2020 Sep2020 )

---------- Differences in output ----------
2,5c2,5
< 1145.0
< ('ed0', 'ed1', 'ed5')
< 1145.0
< 1165.0
---
> 1162.62666667
> ('ed1', 'ed5')
> 1162.62666667
> 1162.62666667
7,9c7,9
< 1165.0
< 129 1235.0
< 130 1245.0
---
> 1162.62666667
> 129 1244.69
> 130 1244.69
---------- Differences in rawdump ----------
8,12c8
<             <lane id="ed0_0">
<                 <vehicle id="Stapler_00" pos="5.10" speed="0.00"/>
<             </lane>
<             <lane id="ed0_1"/>
<             <lane id="ed0_2"/>
---
>             <vehicle id="Stapler_00" pos="0.00" speed="10.00"/>
17,21c13
<             <lane id="ed0_0">
<                 <vehicle id="Stapler_00" pos="6.10" speed="1.00"/>
<             </lane>
<             <lane id="ed0_1"/>
<             <lane id="ed0_2"/>
---
>             <vehicle id="Stapler_00" pos="0.00" speed="10.00"/>
26,30c18
<             <lane id="ed0_0">
<                 <vehicle id="Stapler_00" pos="8.10" speed="2.00"/>
<             </lane>
<             <lane id="ed0_1"/>
<             <lane id="ed0_2"/>
---
>             <vehicle id="Stapler_00" pos="0.00" speed="10.00"/>
35,39c23
<             <lane id="ed0_0">
<                 <vehicle id="Stapler_00" pos="11.10" speed="3.00"/>
<             </lane>
<             <lane id="ed0_1"/>
<             <lane id="ed0_2"/>
<truncated after showing first 30 lines>

TEST FAILED on ts-sim-build-ba : traci vehicle nextTLS ( Last six runs Oct2020 Sep2020 )

---------- Differences in errors ----------
0a1,96
> Warning: getNextTLS not yet implemented for meso
> Warning: getNextTLS not yet implemented for meso
> Warning: getNextTLS not yet implemented for meso
> Warning: getNextTLS not yet implemented for meso
> Warning: getNextTLS not yet implemented for meso
> Warning: getNextTLS not yet implemented for meso
> Warning: getNextTLS not yet implemented for meso
> Warning: getNextTLS not yet implemented for meso
> Warning: getNextTLS not yet implemented for meso
> Warning: getNextTLS not yet implemented for meso
> Warning: getNextTLS not yet implemented for meso
> Warning: getNextTLS not yet implemented for meso
> Warning: getNextTLS not yet implemented for meso
> Warning: getNextTLS not yet implemented for meso
> Warning: getNextTLS not yet implemented for meso
> Warning: getNextTLS not yet implemented for meso
> Warning: getNextTLS not yet implemented for meso
> Warning: getNextTLS not yet implemented for meso
> Warning: getNextTLS not yet implemented for meso
> Warning: getNextTLS not yet implemented for meso
> Warning: getNextTLS not yet implemented for meso
> Warning: getNextTLS not yet implemented for meso
> Warning: getNextTLS not yet implemented for meso
> Warning: getNextTLS not yet implemented for meso
> Warning: getNextTLS not yet implemented for meso
> Warning: getNextTLS not yet implemented for meso
> Warning: getNextTLS not yet implemented for meso
> Warning: getNextTLS not yet implemented for meso
> Warning: getNextTLS not yet implemented for meso
<truncated after showing first 30 lines>
---------- Differences in output ----------
1,90c1,90
< 1.0 (('C', 13, 86.85000000000001, 'g'), ('C', 15, 270.75, 'r'), ('C', 10, 454.65, 'G'))
< 2.0 (('C', 13, 84.25, 'g'), ('C', 15, 268.15, 'r'), ('C', 10, 452.04999999999995, 'G'))
< 3.0 (('C', 13, 79.05000000000001, 'g'), ('C', 15, 283.41, 'r'), ('C', 10, 467.31, 'G'))
< 4.0 (('C', 13, 71.25, 'g'), ('C', 15, 275.61, 'r'), ('C', 10, 459.51, 'G'))
< 5.0 (('C', 13, 60.85, 'g'), ('C', 15, 265.21, 'r'), ('C', 10, 449.10999999999996, 'G'))
< 6.0 (('C', 13, 47.85, 'g'), ('C', 15, 252.20999999999998, 'r'), ('C', 10, 436.10999999999996, 'G'))
< 7.0 (('C', 13, 33.96, 'g'), ('C', 15, 238.32, 'r'), ('C', 10, 422.21999999999997, 'G'))
< 8.0 (('C', 13, 20.070000000000007, 'g'), ('C', 15, 224.43, 'r'), ('C', 10, 408.33, 'G'))
< 9.0 (('C', 13, 6.777000000000001, 'g'), ('C', 15, 211.137, 'r'), ('C', 10, 395.037, 'G'))
< 10.0 (('C', 15, 202.344, 'r'), ('C', 10, 386.24399999999997, 'G'))
< 11.0 (('C', 15, 190.95100000000002, 'r'), ('C', 10, 374.851, 'G'))
< 12.0 (('C', 15, 177.06099999999998, 'r'), ('C', 10, 360.96099999999996, 'G'))
< 13.0 (('C', 15, 163.171, 'r'), ('C', 10, 347.07099999999997, 'G'))
< 14.0 (('C', 15, 149.281, 'r'), ('C', 10, 333.181, 'G'))
< 15.0 (('C', 15, 135.391, 'r'), ('C', 10, 319.291, 'G'))
< 16.0 (('C', 15, 121.501, 'r'), ('C', 10, 305.401, 'G'))
< 17.0 (('C', 15, 107.61099999999999, 'r'), ('C', 10, 291.51099999999997, 'G'))
< 18.0 (('C', 15, 93.721, 'r'), ('C', 10, 277.621, 'G'))
< 19.0 (('C', 15, 79.83099999999999, 'r'), ('C', 10, 268.731, 'G'))
< 20.0 (('C', 15, 65.941, 'r'), ('C', 10, 254.841, 'G'))
< 21.0 (('C', 15, 52.050999999999995, 'r'), ('C', 10, 240.95100000000002, 'G'))
< 22.0 (('C', 15, 38.160999999999994, 'r'), ('C', 10, 227.06099999999998, 'G'))
< 23.0 (('C', 15, 24.271, 'r'), ('C', 10, 213.171, 'G'))
< 24.0 (('C', 15, 12.01433333333334, 'r'), ('C', 10, 200.91433333333333, 'G'))
< 25.0 (('C', 15, 4.257666666666665, 'r'), ('C', 10, 193.15766666666667, 'G'))
< 26.0 (('C', 15, 1.0010000000000048, 'r'), ('C', 10, 189.901, 'G'))
< 27.0 (('C', 15, 1.0010000000000048, 'r'), ('C', 10, 189.901, 'G'))
< 28.0 (('C', 15, 1.0010000000000048, 'r'), ('C', 10, 189.901, 'G'))
< 29.0 (('C', 15, 1.0010000000000048, 'r'), ('C', 10, 189.901, 'G'))
<truncated after showing first 30 lines>

TEST FAILED on ts-sim-build-ba : traci vehicle resume ( Last six runs Oct2020 Sep2020 )

---------- Differences in errors ----------
0a1
> Warning: resume not yet implemented for meso
---------- Differences in rawdump ----------
8,12c8
<             <lane id="ed0_0">
<                 <vehicle id="Stapler_00" pos="5.10" speed="0.00"/>
<             </lane>
<             <lane id="ed0_1"/>
<             <lane id="ed0_2"/>
---
>             <vehicle id="Stapler_00" pos="0.00" speed="10.00"/>
17,21c13
<             <lane id="ed0_0">
<                 <vehicle id="Stapler_00" pos="6.10" speed="1.00"/>
<             </lane>
<             <lane id="ed0_1"/>
<             <lane id="ed0_2"/>
---
>             <vehicle id="Stapler_00" pos="0.00" speed="10.00"/>
26,30c18
<             <lane id="ed0_0">
<                 <vehicle id="Stapler_00" pos="8.10" speed="2.00"/>
<             </lane>
<             <lane id="ed0_1"/>
<             <lane id="ed0_2"/>
---
>             <vehicle id="Stapler_00" pos="0.00" speed="10.00"/>
35,39c23
<             <lane id="ed0_0">
<                 <vehicle id="Stapler_00" pos="11.10" speed="3.00"/>
<             </lane>
<             <lane id="ed0_1"/>
<             <lane id="ed0_2"/>
<truncated after showing first 30 lines>

TEST FAILED on ts-sim-build-ba : traci vehicle vehicle ( Last six runs Oct2020 Sep2020 )

---------- Differences in errors ----------
31,425c31,36
< Warning: getLeader not yet implemented for meso
< Warning: getLeader not yet implemented for meso
< Warning: getNextStops not yet implemented for meso
< Warning: getLeader not yet implemented for meso
< Warning: getLeader not yet implemented for meso
< Warning: getNextStops not yet implemented for meso
< Warning: getLeader not yet implemented for meso
< Warning: getLeader not yet implemented for meso
< Warning: getNextStops not yet implemented for meso
< Warning: getLeader not yet implemented for meso
< Warning: getLeader not yet implemented for meso
< Warning: getNextStops not yet implemented for meso
< Warning: getLeader not yet implemented for meso
< Warning: getLeader not yet implemented for meso
< Warning: getNextStops not yet implemented for meso
< Warning: getLeader not yet implemented for meso
< Warning: getLeader not yet implemented for meso
< Warning: getNextStops not yet implemented for meso
< Error: Answered with error to command 0xa4: Vehicle 'anotherOne' is not known.
< Warning: moveTo not yet implemented for meso
< Warning: getLeader not yet implemented for meso
< Warning: getLeader not yet implemented for meso
< Warning: getLeader not yet implemented for meso
< Warning: getLeader not yet implemented for meso
< Warning: moveToXY not yet implemented for meso
< Warning: getLeader not yet implemented for meso
< Warning: getLeader not yet implemented for meso
< Warning: getLeader not yet implemented for meso
< Warning: getLeader not yet implemented for meso
<truncated after showing first 30 lines>
---------- Differences in output ----------
40a41
> speedDeviation 0.0
55a57
> stopDelay -1.0
60a63
> person IDs ()
67a71
> dist 0.0
117a122
> speedDeviation 0.0
128c133
< emissionclass HBEFA2/zero
---
> emissionclass Zero/default
132a138
> stopDelay -1.0
137a144
> person IDs ()
144a152
> dist 0.0
194a203
> speedDeviation 0.0
209a219
> stopDelay -1.0
214a225
> person IDs ()
221a233
> dist -1073741824.0
285a298
> speedDeviation 0.0
<truncated after showing first 30 lines>
---------- Differences in tripinfo ----------
5,6d4
<     <tripinfo id="1" depart="6.00" departLane="" departPos="0.00" departSpeed="11.11" departDelay="0.00" arrival="19.00" arrivalLane="" arrivalPos="83.33" arrivalSpeed="11.11" duration="13.00" routeLength="83.33" waitingTime="0.00" waitingCount="0" stopTime="0.00" timeLoss="0.00" rerouteNo="1" devices="vehroute_1 tripinfo_1" vType="DEFAULT_VEHTYPE" speedFactor="1.00" vaporized="traci"/>
<     <tripinfo id="failVeh" depart="128.00" departLane="" departPos="0.00" departSpeed="11.11" departDelay="0.00" arrival="161.00" arrivalLane="" arrivalPos="134.00" arrivalSpeed="13.89" duration="33.00" routeLength="384.00" waitingTime="0.00" waitingCount="0" stopTime="0.00" timeLoss="0.00" rerouteNo="0" devices="vehroute_failVeh tripinfo_failVeh routing_failVeh" vType="DEFAULT_VEHTYPE" speedFactor="1.00" vaporized=""/>
---------- Differences in vehroutes ----------
5,15d4
<     <vehicle id="1" depart="6.00" arrival="19.00">
<         <routeDistribution>
<             <route replacedOnEdge="" reason="traci:changeTarget" replacedAtTime="6.00" probability="0" edges="2fi 2si 1o 1fi 1si 3o 3fi 3si 4o 4fi 4si"/>
<             <route edges="2fi 2si 4o 4fi"/>
<         </routeDistribution>
<     </vehicle>
< 
<     <vehicle id="failVeh" depart="128.00" arrival="161.00">
<         <route edges="3fi disconnected"/>
<     </vehicle>
< 

TEST FAILED on ts-sim-build-ba : traci vehicle vehicle_context ( Last six runs Oct2020 Sep2020 )

---------- Differences in output ----------
1c1
< t=2.0 subscriptionResult=None
---
> t=2.0 subscriptionResult={}

TEST FAILED on ts-sim-build-ba : traci vehicletype save_and_load_vtype_params ( Last six runs Oct2020 Sep2020 )

---------- Differences in errors ----------
3,4c3,5
< Warning: setActionStepLength not applicable for meso
< Warning: setActionStepLength not applicable for meso
---
> Traceback (most recent call last):
>     raise FatalTraCIError("connection closed by SUMO")
> traci.exceptions.FatalTraCIError: connection closed by SUMO
---------- Differences in output ----------
1,30d0
< Get before save....
< vtype
< 4.0 == 4.0
< 0.8 == 0.8
< 0.9 == 0.9
< 3.3 == 3.3
< 99.9 == 99.9
< 1.5 ==1.5
< vehicle
< 4.0 == 4.0
< 0.8 == 0.8
< 0.9 == 0.9
< 3.3 == 3.3
< 99.9 == 99.9
< 2.0 ==1.5
< Get after load....
< vtype
< 4.0 == 4.0
< 0.8 == 0.8
< 0.9 == 0.9
< 3.3 == 3.3
< 99.9 == 99.9
< 1.5 ==1.5
< vehicle
< 4.0 == 4.0
< 0.8 == 0.8
< 0.9 == 0.9
< 3.3 == 3.3
< 99.9 == 99.9
<truncated after showing first 30 lines>
---------- Differences in vehroutes ----------
2a3,4
> <!-- generated on Sun Sep 27 06:11:15 2020 by Eclipse SUMO sumo Version v1_7_0+0225-03c664a9f7
> <configuration xmlns:xsi="http://www.w3.org/2001/XMLSchema-instance" xsi:noNamespaceSchemaLocation="http://sumo.dlr.de/xsd/sumoConfiguration.xsd">
4,15c6,9
< <routes xmlns:xsi="http://www.w3.org/2001/XMLSchema-instance" xsi:noNamespaceSchemaLocation="http://sumo.dlr.de/xsd/routes_file.xsd">
<     <vehicle id="veh0" type="DEFAULT_VEHTYPE" depart="0.00" departPos="0.00" departSpeed="10.00" speedFactor="1.06" arrival="255.00">
<         <route edges="4/1to3/1 3/1to2/1 2/1to1/1 1/1to0/1"/>
<     </vehicle>
< 
<     <vehicle id="veh1" type="t1" depart="10.00" departPos="0.00" departSpeed="10.00" speedFactor="1.00" arrival="257.00">
<         <route edges="4/1to3/1 3/1to2/1 2/1to1/1 1/1to0/1"/>
<     </vehicle>
< 
<     <vehicle id="veh2" type="t2@veh2" depart="20.00" departPos="0.00" departSpeed="10.10" speedFactor="0.90" arrival="263.00">
<         <route edges="4/1to3/1 3/1to2/1 2/1to1/1 1/1to0/1"/>
<     </vehicle>
---
>     <input>
>         <net-file value="input_net.net.xml"/>
>         <route-files value="input_routes.rou.xml"/>
>     </input>
17c11,44
< </routes>
---
>     <output>
>         <vehroute-output value="vehroutes.xml"/>
>         <save-state.times value="50"/>
>         <save-state.files value="state.xml"/>
>     </output>
> 
<truncated after showing first 30 lines>
---------- Missing result in state ----------
<?xml version="1.0" encoding="UTF-8"?>


<snapshot xmlns:xsi="http://www.w3.org/2001/XMLSchema-instance" xsi:noNamespaceSchemaLocation="http://sumo.dlr.de/xsd/state_file.xsd" version="<version>" time="50.00">
    <route id="r1" state="1" edges="4/1to3/1 3/1to2/1 2/1to1/1 1/1to0/1"/>
    <delay number="3" begin="3" end="0" depart="0.00" time="0.00"/>
    <vType id="DEFAULT_BIKETYPE" vClass="bicycle"/>
    <vType id="DEFAULT_CONTAINERTYPE" vClass="ignoring"/>
    <vType id="DEFAULT_PEDTYPE" vClass="pedestrian"/>
    <vType id="DEFAULT_VEHTYPE" length="3.00" minGap="2.00" maxSpeed="10.00" accel="0.8" decel="4.5" sigma="0"/>
    <vType id="t1" length="4.00" minGap="0.80" maxSpeed="99.90" speedFactor="normc(0.90,0.10,0.20,2.00)" actionStepLength="1.50" width="3.30" accel="2.5" decel="3.5" tau="1.5"/>
    <vType id="t2" length="5.00" minGap="1.50" maxSpeed="20.00" actionStepLength="2.00" color="yellow" accel="2.5" decel="4.5" sigma="0.5" tau="2.0"/>
    <vType id="t2@veh2" length="4.00" minGap="0.80" maxSpeed="99.90" actionStepLength="2.00" width="3.30" color="yellow" accel="2.5" decel="4.5" sigma="0.5" tau="2.0"/>
    <vehicle id="veh0" type="DEFAULT_VEHTYPE" depart="0.00" departPos="100.00" departSpeed="10.00" route="r1" speedFactor="1.06" state="0 1 0 0 0 53000 43000 9223372036854775807">
        <device id="vehroute_veh0" state="10.00 0.00 0"/>
    </vehicle>
    <vehicle id="veh1" type="t1" depart="10.00" departPos="100.00" departSpeed="10.00" route="r1" speedFactor="1.00" state="10000 0 0 3 0 50000 40000 9223372036854775807">
        <device id="vehroute_veh1" state="10.00 0.00 0"/>
    </vehicle>
    <vehicle id="veh2" type="t2@veh2" depart="20.00" departPos="100.00" departSpeed="10.00" route="r1" speedFactor="0.90" state="20000 0 0 2 0 49691 39794 9223372036854775807">
        <device id="vehroute_veh2" state="10.10 0.00 0"/>
    </vehicle>
    <segment>
        <vehicles time="-1" value=""/>
    </segment>
    <segment>
        <vehicles time="-1" value=""/>
    </segment>
    <segment>
        <vehicles time="-1" value=""/>
<truncated after showing first 30 lines>

Detailed information for the tests that had known bugs:

TEST had known bugs (see #7492) on ts-sim-build-ba : traci inductionloop inductionloop ( Last six runs Oct2020 Sep2020 )

meso handles inductionloops differently
(This bug was triggered by text found in file 'errors' matching 'Induction loop '0' is not known')
---------- Differences in errors ----------
0a1,17
> Error: Answered with error to command 0xa0: Induction loop '0' is not known
> Traceback (most recent call last):
>   File "/home/delphi/extraGcc/sumo/tests/../tests/complex/traci/inductionloop/inductionloop/runner.py", line 39, in <module>
>     print("vehNum", traci.inductionloop.getLastStepVehicleNumber(loopID))
>   File "/home/delphi/extraGcc/sumo/tools/traci/_inductionloop.py", line 69, in getLastStepVehicleNumber
>     return self._getUniversal(tc.LAST_STEP_VEHICLE_NUMBER, loopID)
>   File "/home/delphi/extraGcc/sumo/tools/traci/domain.py", line 168, in _getUniversal
>     return _parse(self._retValFunc, varID, self._getCmd(varID, objectID, format, *values))
>   File "/home/delphi/extraGcc/sumo/tools/traci/domain.py", line 173, in _getCmd
>     r = self._connection._sendCmd(self._cmdGetID, varID, objID, format, *values)
>   File "/home/delphi/extraGcc/sumo/tools/traci/connection.py", line 178, in _sendCmd
>     return self._sendExact()
>   File "/home/delphi/extraGcc/sumo/tools/traci/connection.py", line 95, in _sendExact
>     raise TraCIException(err, prefix[1], _RESULTS[prefix[2]])
> traci.exceptions.TraCIException: Induction loop '0' is not known
> Error: tcpip::Socket::recvAndCheck @ recv: peer shutdown
> Quitting (on error).
---------- Differences in output ----------
8,47d7
< vehNum 1
< meanSpeed 4.033343723951839
< vehIDs ('horiz',)
< occupancy 14.062612603401092
< meanLength 5.0
< timeSinceDet 0.0
< vehData [('horiz', 5.0, 2.859373873965989, -1.0, 'DEFAULT_VEHTYPE')]
< position 10.0
< laneID 2fi_0
< {16: 1}
< step 3
< {16: 1}
< step 4
< {16: 0}
< step 5
< {16: 0}
< step=6.0 detVehs=() vehData=[]
< step=7.0 detVehs=() vehData=[]
< step=8.0 detVehs=() vehData=[]
< step=9.0 detVehs=() vehData=[]
< step=10.0 detVehs=('jump',) vehData=[('jump', 5.0, 9.217991643355125, 9.762970751742937, 'DEFAULT_VEHTYPE')]
< step=11.0 detVehs=('departOnDet',) vehData=[('departOnDet', 5.0, 10.0, -1.0, 'DEFAULT_VEHTYPE')]
< step=12.0 detVehs=('departOnDet',) vehData=[('departOnDet', 5.0, 10.0, 11.520954348148399, 'DEFAULT_VEHTYPE')]
< step=13.0 detVehs=() vehData=[]
< step=14.0 detVehs=() vehData=[]
< step=15.0 detVehs=('onDet1',) vehData=[('onDet1', 5.0, 14.796187261392792, -1.0, 'DEFAULT_VEHTYPE')]
< step=16.0 detVehs=('onDet1',) vehData=[('onDet1', 5.0, 14.796187261392792, 15.675780308314552, 'DEFAULT_VEHTYPE')]
< step=17.0 detVehs=() vehData=[]
< step=18.0 detVehs=() vehData=[]
<truncated after showing first 30 lines>

python3: 389 tests: 361 succeeded 15 known bugs 13 FAILED

Detailed information for the tests that FAILED:

TEST FAILED on ts-sim-build-ba : sumo lane_change best_lanes ( Last six runs Oct2020 Sep2020 )

---------- Differences in output ----------
9c9
< lane 0 ok
---
> lane 0 mismatches
30,32c30,32
< lane 0 ok
< lane 1 ok
< lane 2 ok
---
> lane 0 mismatches
> lane 1 mismatches
> lane 2 mismatches
53,55c53,55
< lane 0 ok
< lane 1 ok
< lane 2 ok
---
> lane 0 mismatches
> lane 1 mismatches
> lane 2 mismatches
76,78c76,78
< lane 0 ok
< lane 1 ok
< lane 2 ok
---
> lane 0 mismatches
> lane 1 mismatches
> lane 2 mismatches
99,101c99,101
< lane 0 ok
<truncated after showing first 30 lines>

TEST FAILED on ts-sim-build-ba : sumo meso segment_length ( Last six runs Oct2020 Sep2020 )

---------- Differences in errors ----------
1,18d0
< Warning: Teleporting vehicle 'flow_0.290'; waited too long, from edge 'D3E3':3 to edge 'E3E4':2, time 1942.70.
< Warning: Teleporting vehicle 'flow_0.1327'; waited too long, from edge 'D1D2':3, time 3149.99.
< Warning: Vehicle 'flow_0.1327' ends teleporting on edge 'E2E3':2, time 3184.95.
< Warning: Teleporting vehicle 'flow_0.1253'; waited too long, from edge 'C2D2':2, time 3350.35.
< Warning: Teleporting vehicle 'flow_0.1177'; waited too long, from edge 'C2D2':3 to edge 'D2E2':1, time 3369.50.
< Warning: Vehicle 'flow_0.1253' teleports beyond arrival edge 'E3E4', time 3455.23.
< Warning: Teleporting vehicle 'flow_0.290'; waited too long, from edge 'D3E3':3 to edge 'E3E4':2, time 1942.70.
< Warning: Teleporting vehicle 'flow_0.1327'; waited too long, from edge 'D1D2':3, time 3149.99.
< Warning: Vehicle 'flow_0.1327' ends teleporting on edge 'E2E3':2, time 3184.95.
< Warning: Teleporting vehicle 'flow_0.1253'; waited too long, from edge 'C2D2':2, time 3350.35.
< Warning: Teleporting vehicle 'flow_0.1177'; waited too long, from edge 'C2D2':3 to edge 'D2E2':1, time 3369.50.
< Warning: Vehicle 'flow_0.1253' teleports beyond arrival edge 'E3E4', time 3455.23.
< Warning: Teleporting vehicle 'flow_0.290'; waited too long, from edge 'D3E3':3 to edge 'E3E4':2, time 1942.70.
< Warning: Teleporting vehicle 'flow_0.1327'; waited too long, from edge 'D1D2':3, time 3149.99.
< Warning: Vehicle 'flow_0.1327' ends teleporting on edge 'E2E3':2, time 3184.95.
< Warning: Teleporting vehicle 'flow_0.1253'; waited too long, from edge 'C2D2':2, time 3350.35.
< Warning: Teleporting vehicle 'flow_0.1177'; waited too long, from edge 'C2D2':3 to edge 'D2E2':1, time 3369.50.
< Warning: Vehicle 'flow_0.1253' teleports beyond arrival edge 'E3E4', time 3455.23.
25,26d6
< Warning: Teleporting vehicle 'flow_0.569'; waited too long, from edge 'D2D3':2, time 2145.24.
< Warning: Vehicle 'flow_0.569' teleports beyond arrival edge 'E3E4', time 2215.16.
28a9,12
> Warning: Teleporting vehicle 'flow_0.1113'; waited too long, from edge 'C2D2':2, time 2764.47.
> Warning: Vehicle 'flow_0.1113' ends teleporting on edge 'D3D4':0, time 2799.43.
> Warning: Teleporting vehicle 'flow_0.1425'; waited too long, from edge 'D2E2':2, time 3374.74.
> Warning: Vehicle 'flow_0.1425' ends teleporting on edge 'E3E4':1, time 3409.70.
35,36d18
< Warning: Teleporting vehicle 'flow_0.569'; waited too long, from edge 'D2D3':2, time 2145.24.
< Warning: Vehicle 'flow_0.569' teleports beyond arrival edge 'E3E4', time 2215.16.
<truncated after showing first 30 lines>
---------- Differences in output ----------
4,8c4,8
< Durations with junction control int.net.xml: count 19, min 302.70 (10), max 481.33 (140), mean 402.60 Q1 324.87, median 387.45, Q3 481.33
< Deviation int.net.xml meso vs. micro: 0.268959541746
< Deviation int.net.xml meso jc vs. micro: 0.0674865821079
< Durations noint.net.xml: count 19, min 309.99 (100), max 311.31 (120), mean 310.75 Q1 310.24, median 310.72, Q3 311.18
< Durations with junction control noint.net.xml: count 19, min 311.62 (10), max 473.85 (150), mean 399.04 Q1 337.87, median 408.87, Q3 473.85
---
> Durations with junction control int.net.xml: count 19, min 302.70 (10), max 500.62 (140), mean 408.19 Q1 325.72, median 399.70, Q3 500.62
> Deviation int.net.xml meso vs. micro: 0.2719209933362098
> Deviation int.net.xml meso jc vs. micro: 0.041900378733400495
> Durations noint.net.xml: count 19, min 309.99 (100), max 316.32 (150), mean 312.15 Q1 310.49, median 310.72, Q3 316.32
> Durations with junction control noint.net.xml: count 19, min 311.62 (10), max 438.37 (150), mean 386.77 Q1 334.71, median 402.22, Q3 438.37
10c10
< Deviation noint.net.xml meso jc vs. micro: -0.0347733657277
---
> Deviation noint.net.xml meso jc vs. micro: -0.017943461645534464

TEST FAILED on ts-sim-build-ba : sumo socketout ( Last six runs Oct2020 Sep2020 )

---------- Differences in errors ----------
3,6d2
< Error: Error on closing output devices.
< Error: send failed: Software caused tcpip::Socket abort
< Error: Error on closing output devices.
< Error: send failed: Software caused tcpip::Socket abort

TEST FAILED on ts-sim-build-ba : traas api ( Last six runs Oct2020 Sep2020 )

---------- Differences in errors ----------
1,3c1,4
< Note: data/APITest.java uses unchecked or unsafe operations.
< Note: Recompile with -Xlint:unchecked for details.
< Received null repsonse for command 203 149. (Maybe you need to use do_job_set?)
---
> Traceback (most recent call last):
>   File "/home/delphi/extraGcc/sumo/tests/../tests/complex/traas/runner.py", line 38, in <module>
>     assert(os.path.exists(traasJar))
> AssertionError
---------- Differences in output ----------
1,78d0
< deltaT:1.0
< findRoute result stage:
<   gneE0
<   -gneE2
<   gneE2
< findIntermodalRoute result stages:
<   gneE0
<   gneE2
< Step 1.0, tlsPhase 0 (North-South)
< Step 2.0, tlsPhase 0 (North-South)
< Step 3.0, tlsPhase 0 (North-South)
< Step 4.0, tlsPhase 0 (North-South)
< Step 5.0, tlsPhase 0 (North-South)
< Step 6.0, tlsPhase 0 (North-South)
< Step 7.0, tlsPhase 0 (North-South)
< Step 8.0, tlsPhase 0 (North-South)
< Step 9.0, tlsPhase 0 (North-South)
< Step 10.0, tlsPhase 0 (North-South)
< Step 11.0, tlsPhase 0 (North-South)
< Step 12.0, tlsPhase 0 (North-South)
< Step 13.0, tlsPhase 0 (North-South)
< Step 14.0, tlsPhase 0 (North-South)
< Step 15.0, tlsPhase 0 (North-South)
< Step 16.0, tlsPhase 0 (North-South)
< Step 17.0, tlsPhase 0 (North-South)
< Step 18.0, tlsPhase 0 (North-South)
< Step 19.0, tlsPhase 0 (North-South)
< Step 20.0, tlsPhase 0 (North-South)
< Step 21.0, tlsPhase 0 (North-South)
<truncated after showing first 30 lines>

TEST FAILED on ts-sim-build-ba : traas multiclient ( Last six runs Oct2020 Sep2020 )

---------- Differences in errors ----------
0a1,4
> Traceback (most recent call last):
>   File "/home/delphi/extraGcc/sumo/tests/../tests/complex/traas/runner.py", line 38, in <module>
>     assert(os.path.exists(traasJar))
> AssertionError
---------- Differences in output ----------
1,4656d0
< Step 0.1, tlsPhase 0 (North-South)
< Step 0.1
< Step 0.2
< Step 0.3
< Step 0.4
< Step 0.5
< Step 0.6
< Step 0.7
< Step 0.8
< Step 0.9
< Step 1.0
< Step 1.1
< Step 1.2
< Step 1.3
< Step 1.4
< Step 1.5
< Step 1.6
< Step 1.7
< Step 1.8
< Step 1.9
< Step 2.0
< Step 2.1
< Step 2.2
< Step 2.3
< Step 2.4
< Step 2.5
< Step 2.6
< Step 2.7
< Step 2.8
<truncated after showing first 30 lines>

TEST FAILED on ts-sim-build-ba : traas simple ( Last six runs Oct2020 Sep2020 )

---------- Differences in errors ----------
0a1,4
> Traceback (most recent call last):
>   File "/home/delphi/extraGcc/sumo/tests/../tests/complex/traas/runner.py", line 38, in <module>
>     assert(os.path.exists(traasJar))
> AssertionError
---------- Differences in output ----------
1,4643d0
< Step 0.1, tlsPhase 0 (North-South)
< Step 0.2, tlsPhase 0 (North-South)
< Step 0.3, tlsPhase 0 (North-South)
< Step 0.4, tlsPhase 0 (North-South)
< Step 0.5, tlsPhase 0 (North-South)
< Step 0.6, tlsPhase 0 (North-South)
< Step 0.7, tlsPhase 0 (North-South)
< Step 0.8, tlsPhase 0 (North-South)
< Step 0.9, tlsPhase 0 (North-South)
< Step 1.0, tlsPhase 0 (North-South)
< Step 1.1, tlsPhase 0 (North-South)
< Step 1.2, tlsPhase 0 (North-South)
< Step 1.3, tlsPhase 0 (North-South)
< Step 1.4, tlsPhase 0 (North-South)
< Step 1.5, tlsPhase 0 (North-South)
< Step 1.6, tlsPhase 0 (North-South)
< Step 1.7, tlsPhase 0 (North-South)
< Step 1.8, tlsPhase 0 (North-South)
< Step 1.9, tlsPhase 0 (North-South)
< Step 2.0, tlsPhase 0 (North-South)
< Step 2.1, tlsPhase 0 (North-South)
< Step 2.2, tlsPhase 0 (North-South)
< Step 2.3, tlsPhase 0 (North-South)
< Step 2.4, tlsPhase 0 (North-South)
< Step 2.5, tlsPhase 0 (North-South)
< Step 2.6, tlsPhase 0 (North-South)
< Step 2.7, tlsPhase 0 (North-South)
< Step 2.8, tlsPhase 0 (North-South)
< Step 2.9, tlsPhase 0 (North-South)
<truncated after showing first 30 lines>

TEST FAILED on ts-sim-build-ba : traas subscription ( Last six runs Oct2020 Sep2020 )

---------- Differences in errors ----------
0a1,4
> Traceback (most recent call last):
>   File "/home/delphi/extraGcc/sumo/tests/../tests/complex/traas/runner.py", line 38, in <module>
>     assert(os.path.exists(traasJar))
> AssertionError
---------- Differences in output ----------
1,88d0
< Step: 0
< Subscription Departed vehicles: v0
< Step: 1
< Subscription Departed vehicles: v1
< Position of vehicle v0: x = 14.723087073160213 y = -4.8
< Speed of vehicle v0: 14.723087073160213
< Step: 2
< Subscription Departed vehicles: v2
< Position of vehicle v0: x = 29.446174146320427 y = -4.8
< Speed of vehicle v0: 14.723087073160213
< Position of vehicle v1: x = 13.033068701216276 y = -4.8
< Speed of vehicle v1: 13.033068701216276
< Step: 3
< Subscription Departed vehicles: v3
< Position of vehicle v0: x = 44.16926121948064 y = -4.8
< Speed of vehicle v0: 14.723087073160213
< Position of vehicle v1: x = 26.066137402432553 y = -4.8
< Speed of vehicle v1: 13.033068701216276
< Position of vehicle v2: x = 11.791085876520345 y = -4.8
< Speed of vehicle v2: 11.791085876520345
< Step: 4
< Subscription Departed vehicles: v4
< Position of vehicle v0: x = 58.892348292640854 y = -4.8
< Speed of vehicle v0: 14.723087073160213
< Position of vehicle v1: x = 39.099206103648825 y = -4.8
< Speed of vehicle v1: 13.033068701216276
< Position of vehicle v2: x = 23.872351142675807 y = -1.6
< Speed of vehicle v2: 12.081265266155462
< Position of vehicle v3: x = 10.290835876520346 y = -4.8
<truncated after showing first 30 lines>

TEST FAILED on ts-sim-build-ba : traas webservice ( Last six runs Oct2020 Sep2020 )

---------- Differences in errors ----------
0a1,4
> Traceback (most recent call last):
>   File "/home/delphi/extraGcc/sumo/tests/../tests/complex/traas/webservice/runner.py", line 35, in <module>
>     assert(os.path.exists(traasJar))
> AssertionError
---------- Differences in output ----------
1,17d0
< Sumo Webservice is going to start
< WSDL wird geparst ...
< 
< 
< 
< Die WSDL und die zugehrigen Metadaten werden heruntergeladen
< 
< 
< Code wird generiert ...
< 
< 
< Code wird kompiliert ...
< 
< 
< Die generierten Artefakte werden in ./webservice.jar archiviert.
< 
< Benutzer user startet den Sumo Webservice Service

TEST FAILED on ts-sim-build-ba : traci person moveToXY keepRoute1_junction ( Last six runs Oct2020 Sep2020 )

---------- Differences in errors ----------
0a1
> Warning: Could not map position 111.59,92.40 onto lane ':C_w2_0'
---------- Differences in fcd ----------
57c57
<         <person id="p0" x="111.59" y="92.40" angle="0.00" speed="0.93" pos="0.05" edge=":C_c1" slope="0.00"/>
---
>         <person id="p0" x="111.59" y="92.40" angle="0.00" speed="0.93" pos="7.01" edge=":C_w2" slope="0.00"/>
60c60
<         <person id="p0" x="111.59" y="93.40" angle="0.00" speed="1.21" pos="1.05" edge=":C_c1" slope="0.00"/>
---
>         <person id="p0" x="111.59" y="93.40" angle="0.00" speed="0.93" pos="1.05" edge=":C_c1" slope="0.00"/>
63c63
<         <person id="p0" x="111.59" y="94.40" angle="0.00" speed="1.38" pos="2.05" edge=":C_c1" slope="0.00"/>
---
>         <person id="p0" x="111.59" y="94.40" angle="0.00" speed="1.21" pos="2.05" edge=":C_c1" slope="0.00"/>
66c66
<         <person id="p0" x="111.59" y="95.40" angle="0.00" speed="1.27" pos="3.05" edge=":C_c1" slope="0.00"/>
---
>         <person id="p0" x="111.59" y="95.40" angle="0.00" speed="1.38" pos="3.05" edge=":C_c1" slope="0.00"/>
69c69
<         <person id="p0" x="111.59" y="96.40" angle="0.00" speed="1.46" pos="4.05" edge=":C_c1" slope="0.00"/>
---
>         <person id="p0" x="111.59" y="96.40" angle="0.00" speed="1.27" pos="4.05" edge=":C_c1" slope="0.00"/>
72c72
<         <person id="p0" x="111.59" y="97.40" angle="0.00" speed="1.32" pos="5.05" edge=":C_c1" slope="0.00"/>
---
>         <person id="p0" x="111.59" y="97.40" angle="0.00" speed="1.46" pos="5.05" edge=":C_c1" slope="0.00"/>
75c75
<         <person id="p0" x="111.59" y="98.40" angle="0.00" speed="1.38" pos="6.05" edge=":C_c1" slope="0.00"/>
---
>         <person id="p0" x="111.59" y="98.40" angle="0.00" speed="1.32" pos="6.05" edge=":C_c1" slope="0.00"/>
78c78
<         <person id="p0" x="111.59" y="99.40" angle="0.00" speed="1.29" pos="7.05" edge=":C_c1" slope="0.00"/>
<truncated after showing first 30 lines>

TEST FAILED on ts-sim-build-ba : traci trafficlight getBlocking_reroute ( Last six runs Oct2020 Sep2020 )

---------- Differences in output ----------
1,2c1,2
< ('blocker1',)
< ('blocker2',)
---
> ()
> ()

TEST FAILED on ts-sim-build-ba : traci trafficlight railsignal_state ( Last six runs Oct2020 Sep2020 )

---------- Differences in output ----------
6c6
< 3.0 N2_0 b=() r=('rail3',) p=('rail3',)
---
> 3.0 N2_0 b=() r=() p=()
8c8
< 4.0 N2_0 b=() r=('rail3',) p=('rail3',)
---
> 4.0 N2_0 b=() r=() p=()
10c10
< 5.0 N2_0 b=() r=('rail3',) p=('rail3',)
---
> 5.0 N2_0 b=() r=() p=()
12c12
< 6.0 N2_0 b=() r=('rail3',) p=('rail3',)
---
> 6.0 N2_0 b=() r=() p=()
14c14
< 7.0 N2_0 b=() r=('rail3',) p=('rail3',)
---
> 7.0 N2_0 b=() r=() p=()
16c16
< 8.0 N2_0 b=() r=('rail3',) p=('rail3',)
---
> 8.0 N2_0 b=() r=() p=()
18c18
< 9.0 N2_0 b=() r=('rail3',) p=('rail3',)
---
> 9.0 N2_0 b=() r=() p=()
20c20
< 10.0 N2_0 b=() r=('rail3',) p=('rail3',)
<truncated after showing first 30 lines>

TEST FAILED on ts-sim-build-ba : traci vehicle moveToXY customLength_keepRoute2 ( Last six runs Oct2020 Sep2020 )

---------- Differences in output ----------
11c11
< 12.0 edge=beg xReq=100 xAct=100.0 xActConv 99.95
---
> 12.0 edge=middle xReq=100 xAct=100.0 xActConv 100.0
31c31
< 32.0 edge=end xReq=300 xAct=300.0 xActConv 300.0
---
> 32.0 edge=middle xReq=300 xAct=300.0 xActConv 299.8

TEST FAILED on ts-sim-build-ba : tutorial city_mobil ( Last six runs Oct2020 Sep2020 )

---------- Differences in output ----------
16c16
< ('footmainout', 'footmain3to4') True True True
---
> ('footmainout', 'footmain3to4') True True False
18,19c18,19
< ('footmainout', 'footmain5to6') True True True
< ('footmainout', 'footmain6to7') True True True
---
> ('footmainout', 'footmain5to6') True True False
> ('footmainout', 'footmain6to7') True True False
34c34
< ('footmainout', 'footmain3to4') True True True
---
> ('footmainout', 'footmain3to4') True True False
36,37c36,37
< ('footmainout', 'footmain5to6') True True True
< ('footmainout', 'footmain6to7') True True True
---
> ('footmainout', 'footmain5to6') True True False
> ('footmainout', 'footmain6to7') True True False

Detailed information for the tests that had known bugs:

TEST had known bugs (ticket #1448) on ts-sim-build-ba : sumo b50 ( Last six runs Oct2020 Sep2020 )

collision with partial occupator
(This bug was triggered by text found in file 'errors' matching 'collision')
---------- Differences in errors ----------
7,16c7,12
< Warning: Teleporting vehicle 'vehicle.582'; waited too long (jam), lane='i3_0', time=1605.00.
< Warning: Vehicle 'vehicle.582' ends teleporting on edge 'i4', time 1605.00.
< Warning: Teleporting vehicle 'vehicle.624'; waited too long (jam), lane='i2_0', time=1630.00.
< Warning: Vehicle 'vehicle.624' ends teleporting on edge 'i5', time 1779.00.
< Warning: Teleporting vehicle 'vehicle.561'; waited too long (jam), lane='i4_1', time=1897.00.
< Warning: Vehicle 'vehicle.561' ends teleporting on edge 'i5', time 1989.00.
< Warning: Teleporting vehicle 'vehicle.898'; waited too long (wrong lane), lane='i7_1', time=3286.00.
< Warning: Vehicle 'vehicle.898' ends teleporting on edge 'e3', time 3343.00.
< Warning: Teleporting vehicle 'vehicle.2009'; waited too long (jam), lane='i3_1', time=6150.00.
< Warning: Vehicle 'vehicle.2009' ends teleporting on edge 'i5', time 6286.00.
---
> Warning: Teleporting vehicle 'vehicle.624'; waited too long (jam), lane='i3_0', time=2139.00.
> Warning: Vehicle 'vehicle.624' ends teleporting on edge 'i4', time 2139.00.
> Warning: Teleporting vehicle 'vehicle.898'; waited too long (wrong lane), lane='i7_1', time=3253.00.
> Warning: Vehicle 'vehicle.898' ends teleporting on edge 'o', time 3253.00.
> Warning: Teleporting vehicle 'vehicle.2373'; collision with vehicle 'vehicle.2375', lane='i4_1', gap=-0.13, time=6717.00 stage=move.
> Warning: Vehicle 'vehicle.2373' ends teleporting on edge 'i5', time 6717.00.
---------- Differences in output ----------
12c12
< Teleports: 5 (Jam: 4, Wrong Lane: 1)
---
> Teleports: 3 (Collisions: 1, Jam: 1, Wrong Lane: 1)
15c15
< Simulation ended at time: 8795.00
---
> Simulation ended at time: 8800.00

TEST had known bugs (see #254) on ts-sim-build-ba : sumo output one_vehicle ( Last six runs Oct2020 Sep2020 )

different outputs from detectors which should detect the same
(This bug was triggered by text found in file 'output' matching 'failed')
---------- Differences in output ----------
10c10
< success 0.1 ['--step-length', '.1', '--end', '100'] ['3/1to2/1_0']
---
> failed 0.1 ['--step-length', '.1', '--end', '100'] 3/1to2/1_0 (71.4, 71.5) <zip object at 0x7fa385f4dfc8>
12c12
< success 1 ['--step-length', '.1', '--end', '100'] ['3/1to2/1_0']
---
> failed 1 ['--step-length', '.1', '--end', '100'] 3/1to2/1_0 (72.0, 73.0) <zip object at 0x7fa387529548>
14c14
< success 10 ['--step-length', '.1', '--end', '100'] ['3/1to2/1_0']
---
> failed 10 ['--step-length', '.1', '--end', '100'] 3/1to2/1_0 (80.0, 90.0) <zip object at 0x7fa387564f48>
18c18
< success 0.1 ['--step-length', '.1', '--end', '1000'] ['3/1to2/1_0']
---
> failed 0.1 ['--step-length', '.1', '--end', '1000'] 3/1to2/1_0 (71.4, 71.5) <zip object at 0x7fa385be8fc8>
20c20
< success 1 ['--step-length', '.1', '--end', '1000'] ['3/1to2/1_0']
---
> failed 1 ['--step-length', '.1', '--end', '1000'] 3/1to2/1_0 (72.0, 73.0) <zip object at 0x7fa38765d788>
22c22
< success 10 ['--step-length', '.1', '--end', '1000'] ['3/1to2/1_0']
---
> failed 10 ['--step-length', '.1', '--end', '1000'] 3/1to2/1_0 (80.0, 90.0) <zip object at 0x7fa385ef5e48>
24c24
< success 100 ['--step-length', '.1', '--end', '1000'] ['3/1to2/1_0']
---
> failed 100 ['--step-length', '.1', '--end', '1000'] 3/1to2/1_0 (100.0, 200.0) <zip object at 0x7fa385eff988>
34c34
< success 0.1 ['--step-length', '1', '--end', '100'] ['3/1to2/1_0']
<truncated after showing first 30 lines>

TEST had known bugs (see #254) on ts-sim-build-ba : sumo output teleport ( Last six runs Oct2020 Sep2020 )

different outputs from detectors which should detect the same
(This bug was triggered by text found in file 'output' matching 'failed')
---------- Differences in output ----------
2c2
< success ['--step-length', '.1', '--end', '51'] ['2/1to1/1_0']
---
> success 0.1 ['--step-length', '.1', '--end', '51'] ['2/1to1/1_0']
4c4
< success ['--step-length', '.1', '--end', '51'] ['2/1to1/1_0', '1/1to0/1_0']
---
> success 0.1 ['--step-length', '.1', '--end', '51'] ['2/1to1/1_0', '1/1to0/1_0']
6c6
< success ['--step-length', '.1', '--end', '51'] ['2/1to1/1_0']
---
> success 1 ['--step-length', '.1', '--end', '51'] ['2/1to1/1_0']
8c8
< success ['--step-length', '.1', '--end', '51'] ['2/1to1/1_0', '1/1to0/1_0']
---
> success 1 ['--step-length', '.1', '--end', '51'] ['2/1to1/1_0', '1/1to0/1_0']
10c10
< success ['--step-length', '.1', '--end', '51'] ['2/1to1/1_0']
---
> success 10 ['--step-length', '.1', '--end', '51'] ['2/1to1/1_0']
12c12
< success ['--step-length', '.1', '--end', '51'] ['2/1to1/1_0', '1/1to0/1_0']
---
> success 10 ['--step-length', '.1', '--end', '51'] ['2/1to1/1_0', '1/1to0/1_0']
14c14
< success ['--step-length', '.1', '--end', '51'] ['2/1to1/1_0']
---
> success 100 ['--step-length', '.1', '--end', '51'] ['2/1to1/1_0']
16c16
< success ['--step-length', '.1', '--end', '51'] ['2/1to1/1_0', '1/1to0/1_0']
<truncated after showing first 30 lines>

TEST had known bugs (see #254) on ts-sim-build-ba : sumo output teleport_multihop ( Last six runs Oct2020 Sep2020 )

different outputs from detectors which should detect the same
(This bug was triggered by text found in file 'output' matching 'failed')
---------- Differences in output ----------
34c34
< success 0.1 ['--step-length', '.1', '--end', '1000'] 2/1to1/1_0 (230.0, 230.1) [('e2', 9.99), ('e3', 10.0), ('edge', 9.99), ('lane', 9.99)]
---
> failed 0.1 ['--step-length', '.1', '--end', '1000'] 2/1to1/1_0 (149.0, 149.1) <zip object at 0x7fcf954b0fc8>
36c36
< success 0.1 ['--step-length', '.1', '--end', '1000'] 1/1to0/1_0 (148.1, 148.2) [('e2', 9.99), ('e3', 10.0), ('edge', 9.99), ('lane', 9.99)]
---
> failed 0.1 ['--step-length', '.1', '--end', '1000'] 2/1to1/1_0 (149.0, 149.1) <zip object at 0x7fcf9515d108>
38c38
< success 1 ['--step-length', '.1', '--end', '1000'] 2/1to1/1_0 (230.0, 231.0) [('e2', 9.99), ('e3', 10.0), ('edge', 9.99), ('lane', 9.99)]
---
> failed 1 ['--step-length', '.1', '--end', '1000'] 2/1to1/1_0 (149.0, 150.0) <zip object at 0x7fcf96fdc588>
40c40
< success 1 ['--step-length', '.1', '--end', '1000'] 1/1to0/1_0 (148.0, 149.0) [('e2', 9.91), ('e3', 10.0), ('edge', 9.91), ('lane', 9.91)]
---
> failed 1 ['--step-length', '.1', '--end', '1000'] 2/1to1/1_0 (149.0, 150.0) <zip object at 0x7fcf958f4f88>
42c42
< success 10 ['--step-length', '.1', '--end', '1000'] 2/1to1/1_0 (230.0, 240.0) [('e2', 9.42), ('e3', 9.9), ('edge', 9.42), ('lane', 9.42)]
---
> failed 10 ['--step-length', '.1', '--end', '1000'] 2/1to1/1_0 (140.0, 150.0) <zip object at 0x7fcf96f0c588>
44c44
< success 10 ['--step-length', '.1', '--end', '1000'] 1/1to0/1_0 (140.0, 150.0) [('e2', 9.96), ('e3', 9.99), ('edge', 9.96), ('lane', 9.96)]
---
> failed 10 ['--step-length', '.1', '--end', '1000'] 2/1to1/1_0 (140.0, 150.0) <zip object at 0x7fcf96f0c588>
46c46
< success 100 ['--step-length', '.1', '--end', '1000'] 2/1to1/1_0 (200.0, 300.0) [('e1', 10.0), ('e2', 9.22), ('e3', 5.71), ('edge', 9.22), ('lane', 9.22)]
---
> failed 100 ['--step-length', '.1', '--end', '1000'] 2/1to1/1_0 (100.0, 200.0) <zip object at 0x7fcf96fd53c8>
48c48
< success 100 ['--step-length', '.1', '--end', '1000'] 1/1to0/1_0 (100.0, 200.0) [('e1', 9.53), ('e2', 5.82), ('e3', 6.93), ('edge', 5.82), ('lane', 5.82)]
<truncated after showing first 30 lines>

TEST had known bugs (see #254) on ts-sim-build-ba : sumo output teleport_multihop_newDefaults ( Last six runs Oct2020 Sep2020 )

different outputs from detectors which should detect the same
(This bug was triggered by text found in file 'output' matching 'failed')
---------- Differences in output ----------
18c18
< success 0.1 ['--step-length', '.1', '--end', '100'] ['2/1to1/1_0']
---
> failed 0.1 ['--step-length', '.1', '--end', '100'] 2/1to1/1_0 (76.2, 76.3) <zip object at 0x7f456ebf3e88>
20c20
< success 0.1 ['--step-length', '.1', '--end', '100'] ['2/1to1/1_0', '1/1to0/1_0']
---
> failed 0.1 ['--step-length', '.1', '--end', '100'] 2/1to1/1_0 (76.2, 76.3) <zip object at 0x7f456ebb7ac8>
22c22
< success 1 ['--step-length', '.1', '--end', '100'] ['2/1to1/1_0']
---
> failed 1 ['--step-length', '.1', '--end', '100'] 2/1to1/1_0 (76.0, 77.0) <zip object at 0x7f457030b508>
24c24
< success 1 ['--step-length', '.1', '--end', '100'] ['2/1to1/1_0', '1/1to0/1_0']
---
> failed 1 ['--step-length', '.1', '--end', '100'] 2/1to1/1_0 (76.0, 77.0) <zip object at 0x7f45703626c8>
26c26
< success 10 ['--step-length', '.1', '--end', '100'] ['2/1to1/1_0']
---
> failed 10 ['--step-length', '.1', '--end', '100'] 2/1to1/1_0 (70.0, 80.0) <zip object at 0x7f45702fdcc8>
28c28
< success 10 ['--step-length', '.1', '--end', '100'] ['2/1to1/1_0', '1/1to0/1_0']
---
> failed 10 ['--step-length', '.1', '--end', '100'] 2/1to1/1_0 (70.0, 80.0) <zip object at 0x7f45702fdcc8>
30c30
< success 100 ['--step-length', '.1', '--end', '100'] ['2/1to1/1_0']
---
> failed 100 ['--step-length', '.1', '--end', '100'] 2/1to1/1_0 (0.0, 100.0) <zip object at 0x7f456ebe0748>
32c32
< success 100 ['--step-length', '.1', '--end', '100'] ['2/1to1/1_0', '1/1to0/1_0']
<truncated after showing first 30 lines>

TEST had known bugs (see #254) on ts-sim-build-ba : sumo output two_same_vehicles ( Last six runs Oct2020 Sep2020 )

different outputs from detectors which should detect the same
(This bug was triggered by text found in file 'output' matching 'failed')
---------- Differences in output ----------
10c10
< success 0.1 ['--step-length', '.1', '--end', '100'] ['3/1to2/1_0']
---
> failed 0.1 ['--step-length', '.1', '--end', '100'] 3/1to2/1_0 (75.4, 75.5) <zip object at 0x7ff76a04a1c8>
12c12
< success 1 ['--step-length', '.1', '--end', '100'] ['3/1to2/1_0']
---
> failed 1 ['--step-length', '.1', '--end', '100'] 3/1to2/1_0 (76.0, 77.0) <zip object at 0x7ff76b683988>
14c14
< success 10 ['--step-length', '.1', '--end', '100'] ['3/1to2/1_0']
---
> failed 10 ['--step-length', '.1', '--end', '100'] 3/1to2/1_0 (80.0, 90.0) <zip object at 0x7ff769feb0c8>
18c18
< success 0.1 ['--step-length', '.1', '--end', '1000'] ['3/1to2/1_0']
---
> failed 0.1 ['--step-length', '.1', '--end', '1000'] 3/1to2/1_0 (75.4, 75.5) <zip object at 0x7ff769d0efc8>
20c20
< success 1 ['--step-length', '.1', '--end', '1000'] ['3/1to2/1_0']
---
> failed 1 ['--step-length', '.1', '--end', '1000'] 3/1to2/1_0 (76.0, 77.0) <zip object at 0x7ff76a032848>
22c22
< success 10 ['--step-length', '.1', '--end', '1000'] ['3/1to2/1_0']
---
> failed 10 ['--step-length', '.1', '--end', '1000'] 3/1to2/1_0 (80.0, 90.0) <zip object at 0x7ff76a014948>
24c24
< success 100 ['--step-length', '.1', '--end', '1000'] ['3/1to2/1_0']
---
> failed 100 ['--step-length', '.1', '--end', '1000'] 3/1to2/1_0 (100.0, 200.0) <zip object at 0x7ff76a032e48>
34c34
< success 0.1 ['--step-length', '1', '--end', '100'] ['3/1to2/1_0']
<truncated after showing first 30 lines>

TEST had known bugs (see #254) on ts-sim-build-ba : sumo output two_vehicles_diff_length ( Last six runs Oct2020 Sep2020 )

different outputs from detectors which should detect the same
(This bug was triggered by text found in file 'output' matching 'failed')
---------- Differences in output ----------
10c10
< success 0.1 ['--step-length', '.1', '--end', '100'] ['3/1to2/1_0']
---
> failed 0.1 ['--step-length', '.1', '--end', '100'] 3/1to2/1_0 (76.4, 76.5) <zip object at 0x7fd167eb5088>
12c12
< success 1 ['--step-length', '.1', '--end', '100'] ['3/1to2/1_0']
---
> failed 1 ['--step-length', '.1', '--end', '100'] 3/1to2/1_0 (77.0, 78.0) <zip object at 0x7fd169479408>
14c14
< success 10 ['--step-length', '.1', '--end', '100'] ['3/1to2/1_0']
---
> failed 10 ['--step-length', '.1', '--end', '100'] 3/1to2/1_0 (80.0, 90.0) <zip object at 0x7fd167e3b088>
18c18
< success 0.1 ['--step-length', '.1', '--end', '1000'] ['3/1to2/1_0']
---
> failed 0.1 ['--step-length', '.1', '--end', '1000'] 3/1to2/1_0 (76.4, 76.5) <zip object at 0x7fd167b61e08>
20c20
< success 1 ['--step-length', '.1', '--end', '1000'] ['3/1to2/1_0']
---
> failed 1 ['--step-length', '.1', '--end', '1000'] 3/1to2/1_0 (77.0, 78.0) <zip object at 0x7fd16949ef08>
22c22
< success 10 ['--step-length', '.1', '--end', '1000'] ['3/1to2/1_0']
---
> failed 10 ['--step-length', '.1', '--end', '1000'] 3/1to2/1_0 (80.0, 90.0) <zip object at 0x7fd167ea26c8>
24c24
< success 100 ['--step-length', '.1', '--end', '1000'] ['3/1to2/1_0']
---
> failed 100 ['--step-length', '.1', '--end', '1000'] 3/1to2/1_0 (100.0, 200.0) <zip object at 0x7fd16949ef08>
34c34
< success 0.1 ['--step-length', '1', '--end', '100'] ['3/1to2/1_0']
<truncated after showing first 30 lines>

TEST had known bugs (see #254) on ts-sim-build-ba : sumo output two_vehicles_diff_speed ( Last six runs Oct2020 Sep2020 )

different outputs from detectors which should detect the same
(This bug was triggered by text found in file 'output' matching 'failed')
---------- Differences in output ----------
0a1,48
> Loading configuration ... done.
> failed 0.1 ['--step-length', '.1', '--end', '51'] 3/1to2/1_0 (38.4, 38.5) <zip object at 0x7faaa0604088>
> Loading configuration ... done.
> failed 1 ['--step-length', '.1', '--end', '51'] 3/1to2/1_0 (38.0, 39.0) <zip object at 0x7faaa0604fc8>
> Loading configuration ... done.
> failed 10 ['--step-length', '.1', '--end', '51'] 3/1to2/1_0 (30.0, 40.0) <zip object at 0x7faaa0604fc8>
> Loading configuration ... done.
> failed 100 ['--step-length', '.1', '--end', '51'] 3/1to2/1_0 (0.0, 51.0) <zip object at 0x7faaa05ee048>
> Loading configuration ... done.
> failed 0.1 ['--step-length', '.1', '--end', '100'] 3/1to2/1_0 (38.4, 38.5) <zip object at 0x7faaa0613088>
> Loading configuration ... done.
> failed 1 ['--step-length', '.1', '--end', '100'] 3/1to2/1_0 (38.0, 39.0) <zip object at 0x7faaa1c36588>
> Loading configuration ... done.
> failed 10 ['--step-length', '.1', '--end', '100'] 3/1to2/1_0 (30.0, 40.0) <zip object at 0x7faaa1c36588>
> Loading configuration ... done.
> failed 100 ['--step-length', '.1', '--end', '100'] 3/1to2/1_0 (0.0, 100.0) <zip object at 0x7faaa0599088>
> Loading configuration ... done.
> failed 0.1 ['--step-length', '.1', '--end', '1000'] 3/1to2/1_0 (38.4, 38.5) <zip object at 0x7faaa02a9088>
> Loading configuration ... done.
> failed 1 ['--step-length', '.1', '--end', '1000'] 3/1to2/1_0 (38.0, 39.0) <zip object at 0x7faaa1bfcf08>
> Loading configuration ... done.
> failed 10 ['--step-length', '.1', '--end', '1000'] 3/1to2/1_0 (30.0, 40.0) <zip object at 0x7faaa05c2908>
> Loading configuration ... done.
> failed 100 ['--step-length', '.1', '--end', '1000'] 3/1to2/1_0 (0.0, 100.0) <zip object at 0x7faaa05e0dc8>
> Loading configuration ... done.
> failed 0.1 ['--step-length', '1', '--end', '51'] 3/1to2/1_0 (39.0, 40.0) <zip object at 0x7faaa05e0dc8>
> Loading configuration ... done.
> failed 1 ['--step-length', '1', '--end', '51'] 3/1to2/1_0 (39.0, 40.0) <zip object at 0x7faaa05e0cc8>
> Loading configuration ... done.
<truncated after showing first 30 lines>

TEST had known bugs (#4727) on ts-sim-build-ba : traci ContextSubscriptionFilters leadFollow carFollowing ( Last six runs Oct2020 Sep2020 )

#4727
(This bug was triggered by text found in file 'output' matching '.')
---------- Differences in output ----------
4d3
< lead_straight
6d4
< [002] Context results for vehicle 'ego':
7a6
> [002] Context results for vehicle 'ego':
9d7
< [003] Context results for vehicle 'ego':
10a9
> [003] Context results for vehicle 'ego':
12d10
< [004] Context results for vehicle 'ego':
13a12
> [004] Context results for vehicle 'ego':
15d13
< [005] Context results for vehicle 'ego':
16a15
> [005] Context results for vehicle 'ego':
18d16
< [006] Context results for vehicle 'ego':
19a18
> [006] Context results for vehicle 'ego':
21d19
< [007] Context results for vehicle 'ego':
22a21
> [007] Context results for vehicle 'ego':
24d22
< [008] Context results for vehicle 'ego':
25a24
> [008] Context results for vehicle 'ego':
<truncated after showing first 30 lines>

2 TESTS had known bugs (#4727) on ts-sim-build-ba :

#4727
(This bug was triggered by text found in file 'output' matching '.')
---------- Differences in output ----------
4a5
> follow_straight
7d7
< follow_straight
9a10
> follow_straight
12d12
< follow_straight
14a15
> follow_straight
17d17
< follow_straight
19a20
> follow_straight
22d22
< follow_straight
24a25
> follow_straight
27d27
< follow_straight
29a30
> follow_straight
32d32
< follow_straight
34a35
> follow_straight
37d37
< follow_straight
39a40
> follow_straight
<truncated after showing first 30 lines>
traci ContextSubscriptionFilters leadFollow laneChangeLeft ( Last six runs Oct2020 Sep2020 )
traci ContextSubscriptionFilters leadFollow laneChangeRight ( Last six runs Oct2020 Sep2020 )

TEST had known bugs (#4727) on ts-sim-build-ba : traci ContextSubscriptionFilters leadFollow laneChangeNeighbors ( Last six runs Oct2020 Sep2020 )

#4727
(This bug was triggered by text found in file 'output' matching '.')
---------- Differences in output ----------
4,5d3
< follow_straight
< follow_right
6a5,7
> follow_right
> follow_straight
> lead_left
9d9
< lead_left
11,12d10
< follow_straight
< follow_right
13a12,14
> follow_right
> follow_straight
> lead_left
16d16
< lead_left
18,19d17
< follow_straight
< follow_right
20a19,21
> follow_right
> follow_straight
> lead_left
23d23
< lead_left
25,26d24
< follow_straight
< follow_right
<truncated after showing first 30 lines>

TEST had known bugs (see #3263) on ts-sim-build-ba : traci vehicle moveToXY keepRoute2 ( Last six runs Oct2020 Sep2020 )

mapping failure
(This bug was triggered by text found in file 'output' matching 'failed')
---------- Differences in output ----------
0a1,2
> internal corner (inside, segment2) failed: x=198, x2=198.0,   y=1.9, y2=1.9,   lane=middle_0, lane2=middle_0, pos=102, pos2=98.0   posLat=2.0 posLat2=1.9
> internal corner (outside, far) failed: x=203, x2=203.0,   y=-4, y2=-4.0,   lane=, lane2=middle_0, pos=-1073741824.0, pos2=100.0   posLat=-1073741824.0 posLat2=-1.4142135623730951

TEST had known bugs (see #5383) on ts-sim-build-ba : traci vehicle moveToXY permissions ( Last six runs Oct2020 Sep2020 )

mapping failure
(This bug was triggered by text found in file 'output' matching 'failed')
---------- Differences in output ----------
0a1
> right lane (ignore permissions) failed: mode=6 x=40, x2=40.0,   y=-1.6, y2=-1.6,   lane=beg_0, lane2=, pos=40, pos2=-1073741824.0   posLat=0.0 posLat2=-1073741824.0

TEST had known bugs (see #6192) on ts-sim-build-ba : traci vehicle openGap with_low_maxDecel_fast_CACC ( Last six runs Oct2020 Sep2020 )

not even failing as intended
(This bug was triggered by text found in file 'errors' matching 'Error')
---------- Differences in errors ----------
0a1,8
> Traceback (most recent call last):
>   File "/home/delphi/extraGcc/sumo/tests/../tests/complex/traci/vehicle/openGap/runner.py", line 155, in <module>
>     runSingle(targetTimeHeadway, targetSpaceHeadway, duration, changeRate, maxDecel, refVehID)
>   File "/home/delphi/extraGcc/sumo/tests/../tests/complex/traci/vehicle/openGap/runner.py", line 65, in runSingle
>     leader = results[tc.VAR_LEADER][0]
> TypeError: 'NoneType' object is not subscriptable
> Error: tcpip::Socket::recvAndCheck @ recv: peer shutdown
> Quitting (on error).
---------- Differences in output ----------
4,103c4,103
< Time 2.0: Gap 'follower'->'leader' = 5.938 (headway=0.367)
< 'follower' speed = 16.161582708
< Time 3.0: Gap 'follower'->'leader' = 8.966 (headway=0.528)
< 'follower' speed = 16.9836198736
< Time 4.0: Gap 'follower'->'leader' = 11.281 (headway=0.641)
< 'follower' speed = 17.5863190784
< Time 5.0: Gap 'follower'->'leader' = 13.069 (headway=0.725)
< 'follower' speed = 18.0379935645
< Time 6.0: Gap 'follower'->'leader' = 14.459 (headway=0.787)
< 'follower' speed = 18.3815472225
< Time 7.0: Gap 'follower'->'leader' = 15.545 (headway=0.834)
< 'follower' speed = 18.6456171431
< Time 8.0: Gap 'follower'->'leader' = 16.397 (headway=0.870)
< 'follower' speed = 18.8501483763
< Time 9.0: Gap 'follower'->'leader' = 17.068 (headway=0.898)
< 'follower' speed = 19.0094667411
< Time 10.0: Gap 'follower'->'leader' = 17.596 (headway=0.920)
< 'follower' speed = 19.1340998278
< Time 11.0: Gap 'follower'->'leader' = 18.013 (headway=0.937)
< 'follower' speed = 19.231918606
< Time 12.0: Gap 'follower'->'leader' = 18.342 (headway=0.950)
< 'follower' speed = 19.3088858604
< Time 13.0: Gap 'follower'->'leader' = 18.603 (headway=0.960)
< 'follower' speed = 19.3695649077
< Time 14.0: Gap 'follower'->'leader' = 18.810 (headway=0.969)
< 'follower' speed = 19.4174756866
< Time 15.0: Gap 'follower'->'leader' = 18.973 (headway=0.975)
< 'follower' speed = 19.4553500651
< Time 16.0: Gap 'follower'->'leader' = 19.103 (headway=0.980)
<truncated after showing first 30 lines>