Test results for POLYCONVERT

(generated by unknown at 27May06:23)

gdal

Last six runs

Apr2020 May2020

test_default.gdal.png

Test21May202022May202023May202024May202025May202026May2020
Summary3 tests: 3 FAILED 3 tests: 3 FAILED 3 tests: 3 FAILED 3 tests: 3 FAILED 3 tests: 3 FAILED 3 tests: 3 FAILED
import shape default errors different ts-sim-build-baerrors different ts-sim-build-baerrors different ts-sim-build-baerrors different ts-sim-build-baerrors different ts-sim-build-baerrors different ts-sim-build-ba
import shape handmade errors different ts-sim-build-baerrors different ts-sim-build-baerrors different ts-sim-build-baerrors different ts-sim-build-baerrors different ts-sim-build-baerrors different ts-sim-build-ba
import shape network errors different(+) ts-sim-build-baerrors different(+) ts-sim-build-baerrors different(+) ts-sim-build-baerrors different(+) ts-sim-build-baerrors different(+) ts-sim-build-baerrors different(+) ts-sim-build-ba