25Jun2024 - detailed test results for SUMO.meso.gui

To reconnect the TextTest GUI to these results, run:

texttest -a sumo -d /home/delphi/extraGcc/sumo/tests -reconnect /home/delphi/extraGcc/texttesttmp/extra_gcc4_64.30Jun093012.2076434 -g

To start TextTest for these tests, run:

texttest -a sumo -d /home/delphi/extraGcc/sumo/tests


meso.gui: 2403 tests: 2116 succeeded 269 FAILED 18 known bugs

Detailed information for the tests that FAILED:

TEST FAILED on ts-sim-build-ba : basic container container_number ( Last six runs Jun2024 )

---------- Differences in output ----------
5c5
< Simulation ended at time: 240.00
---
> Simulation ended at time: 240.00.

TEST FAILED on ts-sim-build-ba : basic container container_start_containerStop ( Last six runs Jun2024 )

---------- Differences in output ----------
5c5
< Simulation ended at time: 51.00
---
> Simulation ended at time: 51.00.

2 TESTS FAILED on ts-sim-build-ba :

---------- Differences in output ----------
5c5
< Simulation ended at time: 198.00
---
> Simulation ended at time: 198.00.
basic container leaving_vehicle_at_stop ( Last six runs Jun2024 )
extended stops parking parkingArea_departPos ( Last six runs Jun2024 )

2 TESTS FAILED on ts-sim-build-ba :

---------- Differences in output ----------
5c5
< Simulation ended at time: 289.00
---
> Simulation ended at time: 289.00.
basic container trip_chain ( Last six runs Jun2024 )
basic container trip_chain_containerStop_input ( Last six runs Jun2024 )

TEST FAILED on ts-sim-build-ba : basic container trip_chain_no_from ( Last six runs Jun2024 )

---------- Differences in output ----------
5,15d4
< Simulation ended at time: 289.00
< Reason: All vehicles have left the simulation.
< Performance: 
< Vehicles: 
<  Inserted: 2
<  Running: 0
<  Waiting: 0
< Containers: 
<  Inserted: 1
<  Running: 0
< 
---------- Differences in tripinfos ----------
6,14d5
<     <containerinfo id="container0" depart="0.00" type="DEFAULT_CONTAINERTYPE" duration="288.00" waitingTime="66.49" timeLoss="0.00" traveltime="201.51">
<         <tranship depart="0.00" departPos="80.00" arrival="54.00" arrivalPos="55.00" duration="54.00" routeLength="75.00" maxSpeed="1.39"/>
<         <transport waitingTime="66.49" vehicle="train0" depart="120.49" arrival="134.00" arrivalPos="0.00" duration="13.51" routeLength="182.50" timeLoss="0.00"/>
<         <tranship depart="134.00" departPos="0.00" arrival="228.00" arrivalPos="30.00" duration="94.00" routeLength="130.55" maxSpeed="1.39"/>
<         <stop duration="20.00" arrival="248.00" arrivalPos="30.00" actType="waiting"/>
<         <transport waitingTime="0.00" vehicle="car0" depart="248.00" arrival="288.00" arrivalPos="92.00" duration="40.00" routeLength="181.00" timeLoss="0.00"/>
<     </containerinfo>
<     <tripinfo id="car0" depart="248.00" departLane="" departPos="0.00" departSpeed="0.00" departDelay="0.00" arrival="288.00" arrivalLane="" arrivalPos="92.00" arrivalSpeed="13.90" duration="40.00" routeLength="273.00" waitingTime="0.00" waitingCount="0" stopTime="20.00" timeLoss="20.00" rerouteNo="0" devices="tripinfo_car0 container_car0" vType="DEFAULT_VEHTYPE" speedFactor="1.00" vaporized=""/>
< </tripinfos>
---------- New result in exitcode ----------
-11

2 TESTS FAILED on ts-sim-build-ba :

---------- Differences in output ----------
5c5
< Simulation ended at time: 280.00
---
> Simulation ended at time: 280.00.
basic containerFlow trip_chain ( Last six runs Jun2024 )
extended state save_taz ( Last six runs Jun2024 )

4 TESTS FAILED on ts-sim-build-ba :

---------- Differences in output ----------
4c4
< Simulation ended at time: 116.00
---
> Simulation ended at time: 116.00.
basic dynamics insertion backlog_lanewise ( Last six runs Jun2024 )
junction_model ignoreFoeOnJunction ignore_pedestrians_all ( Last six runs Jun2024 )
junction_model ignoreFoeOnJunction ignore_pedestrians_none ( Last six runs Jun2024 )
junction_model ignoreFoeOnJunction ignore_pedestrians_some ( Last six runs Jun2024 )

TEST FAILED on ts-sim-build-ba : basic dynamics insertion bestLane4 ( Last six runs Jun2024 )

---------- Differences in output ----------
4c4
< Simulation ended at time: 3600.00
---
> Simulation ended at time: 3600.00.

TEST FAILED on ts-sim-build-ba : basic dynamics insertion best_distance ( Last six runs Jun2024 )

---------- Differences in output ----------
6c6
< Simulation ended at time: 900.00
---
> Simulation ended at time: 900.00.

TEST FAILED on ts-sim-build-ba : basic dynamics insertion force_unsafe_followspeed ( Last six runs Jun2024 )

---------- Differences in output ----------
4c4
< Simulation ended at time: 99.00
---
> Simulation ended at time: 99.00.

TEST FAILED on ts-sim-build-ba : basic dynamics insertion high_flow1 ( Last six runs Jun2024 )

---------- Differences in output ----------
5c5
< Simulation ended at time: 1904.00
---
> Simulation ended at time: 1904.00.

TEST FAILED on ts-sim-build-ba : basic dynamics insertion high_flow1_extreme ( Last six runs Jun2024 )

---------- Differences in output ----------
5c5
< Simulation ended at time: 1898.00
---
> Simulation ended at time: 1898.00.

2 TESTS FAILED on ts-sim-build-ba :

---------- Differences in output ----------
5c5
< Simulation ended at time: 2413.00
---
> Simulation ended at time: 2413.00.
basic dynamics insertion high_flow2 ( Last six runs Jun2024 )
basic dynamics insertion high_flow2_emergencyDecel ( Last six runs Jun2024 )

TEST FAILED on ts-sim-build-ba : basic dynamics insertion high_flow3 ( Last six runs Jun2024 )

---------- Differences in output ----------
5c5
< Simulation ended at time: 1800.00
---
> Simulation ended at time: 1800.00.

TEST FAILED on ts-sim-build-ba : basic person person_number ( Last six runs Jun2024 )

---------- Differences in output ----------
5c5
< Simulation ended at time: 140.00
---
> Simulation ended at time: 140.00.

TEST FAILED on ts-sim-build-ba : basic person riding leaving_vehicle_at_stop ( Last six runs Jun2024 )

---------- Differences in output ----------
5c5
< Simulation ended at time: 284.00
---
> Simulation ended at time: 284.00.

TEST FAILED on ts-sim-build-ba : basic person riding leaving_vehicle_at_stop_subsecond ( Last six runs Jun2024 )

---------- Differences in output ----------
5c5
< Simulation ended at time: 280.90
---
> Simulation ended at time: 280.90.

TEST FAILED on ts-sim-build-ba : basic person riding veh_is_triggered ride_triggered_scale ( Last six runs Jun2024 )

---------- Differences in output ----------
4c4
< Simulation ended at time: 79.00
---
> Simulation ended at time: 79.00.

7 TESTS FAILED on ts-sim-build-ba :

---------- Differences in output ----------
4c4
< Simulation ended at time: 35.00
---
> Simulation ended at time: 35.00.
basic person scale individual default ( Last six runs Jun2024 )
basic person scale individual scale3 ( Last six runs Jun2024 )
basic person scale personFlow_number default ( Last six runs Jun2024 )
basic person scale personFlow_number scale3 ( Last six runs Jun2024 )
basic person scale personFlow_probability default ( Last six runs Jun2024 )
basic person scale personFlow_probability scale0.5 ( Last six runs Jun2024 )
extended state save_stopTimes ( Last six runs Jun2024 )

2 TESTS FAILED on ts-sim-build-ba :

---------- Differences in output ----------
4c4
< Simulation ended at time: 34.00
---
> Simulation ended at time: 34.00.
basic person scale individual scale0.5 ( Last six runs Jun2024 )
basic person scale personFlow_number scale0.5 ( Last six runs Jun2024 )

7 TESTS FAILED on ts-sim-build-ba :

---------- Differences in output ----------
4c4
< Simulation ended at time: 39.00
---
> Simulation ended at time: 39.00.
basic person scale personFlow_probability scale3 ( Last six runs Jun2024 )
extended state save2 ( Last six runs Jun2024 )
extended state save2_H ( Last six runs Jun2024 )
extended state save_actionStepLength ( Last six runs Jun2024 )
extended state save_actionStepLength2 ( Last six runs Jun2024 )
extended state save_at_interval ( Last six runs Jun2024 )
extended state save_with_internal_links ( Last six runs Jun2024 )

2 TESTS FAILED on ts-sim-build-ba :

---------- Differences in output ----------
5c5
< Simulation ended at time: 275.00
---
> Simulation ended at time: 275.00.
basic person trip_chain ( Last six runs Jun2024 )
basic person trip_chain_chargingstations ( Last six runs Jun2024 )

TEST FAILED on ts-sim-build-ba : basic personFlow ferry_trip ( Last six runs Jun2024 )

---------- Differences in output ----------
5c5
< Simulation ended at time: 1957.00
---
> Simulation ended at time: 1957.00.

3 TESTS FAILED on ts-sim-build-ba :

---------- Differences in output ----------
4c4
< Simulation ended at time: 1000.00
---
> Simulation ended at time: 1000.00.
basic personFlow ride_triggeredPersonFlow_capacity ( Last six runs Jun2024 )
junction_model junction_type tls_right_on_red stress_test original ( Last six runs Jun2024 )
meso junction_control no_control_flowPenalty40 ( Last six runs Jun2024 )

TEST FAILED on ts-sim-build-ba : basic personFlow trip_chain ( Last six runs Jun2024 )

---------- Differences in output ----------
5c5
< Simulation ended at time: 195.00
---
> Simulation ended at time: 195.00.

TEST FAILED on ts-sim-build-ba : basic simple_nets cross cross1l ( Last six runs Jun2024 )

---------- Differences in output ----------
4c4
< Simulation ended at time: 1179.00
---
> Simulation ended at time: 1179.00.

TEST FAILED on ts-sim-build-ba : bugs 0xxx ticket651 ( Last six runs Jun2024 )

---------- Differences in output ----------
4c4
< Simulation ended at time: 2195.00
---
> Simulation ended at time: 2195.00.

TEST FAILED on ts-sim-build-ba : bugs 0xxx ticket963 ( Last six runs Jun2024 )

---------- Differences in output ----------
4c4
< Simulation ended at time: 677.00
---
> Simulation ended at time: 677.00.

TEST FAILED on ts-sim-build-ba : bugs 13xxx ticket13363 ( Last six runs Jun2024 )

---------- Differences in output ----------
4c4
< Simulation ended at time: 3661.60
---
> Simulation ended at time: 3661.60.

TEST FAILED on ts-sim-build-ba : bugs 2xxx ticket2740 ( Last six runs Jun2024 )

---------- Differences in output ----------
4c4
< Simulation ended at time: 371.00
---
> Simulation ended at time: 371.00.

TEST FAILED on ts-sim-build-ba : bugs 3xxx ticket3110 ( Last six runs Jun2024 )

---------- Differences in output ----------
5c5
< Simulation ended at time: 193.00
---
> Simulation ended at time: 193.00.

TEST FAILED on ts-sim-build-ba : bugs 4xxx ticket4518 ( Last six runs Jun2024 )

---------- Differences in output ----------
5c5
< Simulation ended at time: 296.00
---
> Simulation ended at time: 296.00.

TEST FAILED on ts-sim-build-ba : bugs 4xxx ticket4678 ( Last six runs Jun2024 )

---------- Differences in output ----------
4c4
< Simulation ended at time: 467.50
---
> Simulation ended at time: 467.50.

TEST FAILED on ts-sim-build-ba : bugs 5xxx ticket5420 ( Last six runs Jun2024 )

---------- Differences in output ----------
4c4
< Simulation ended at time: 17.00
---
> Simulation ended at time: 17.00.

3 TESTS FAILED on ts-sim-build-ba :

---------- Differences in output ----------
4c4
< Simulation ended at time: 211.00
---
> Simulation ended at time: 211.00.
bugs 5xxx ticket5487 ( Last six runs Jun2024 )
output duration_log using_scale ( Last six runs Jun2024 )
output duration_log using_scale_with_flows ( Last six runs Jun2024 )

TEST FAILED on ts-sim-build-ba : bugs 5xxx ticket5864 ( Last six runs Jun2024 )

---------- Differences in output ----------
5c5
< Simulation ended at time: 699.00
---
> Simulation ended at time: 699.00.

TEST FAILED on ts-sim-build-ba : bugs 8xxx ticket8124 ( Last six runs Jun2024 )

---------- Differences in output ----------
4c4
< Simulation ended at time: 600.00
---
> Simulation ended at time: 600.00.

TEST FAILED on ts-sim-build-ba : bugs 8xxx ticket8397 ( Last six runs Jun2024 )

---------- Differences in output ----------
4c4
< Simulation ended at time: 15.00
---
> Simulation ended at time: 15.00.

TEST FAILED on ts-sim-build-ba : bugs 8xxx ticket8798 ( Last six runs Jun2024 )

---------- Differences in output ----------
4c4
< Simulation ended at time: 239.00
---
> Simulation ended at time: 239.00.

TEST FAILED on ts-sim-build-ba : bugs 8xxx ticket8817 ( Last six runs Jun2024 )

---------- Differences in output ----------
4c4
< Simulation ended at time: 1844.40
---
> Simulation ended at time: 1844.40.

TEST FAILED on ts-sim-build-ba : bugs 9xxx ticket9821 ( Last six runs Jun2024 )

---------- Differences in output ----------
4c4
< Simulation ended at time: 2.00
---
> Simulation ended at time: 2.00.

TEST FAILED on ts-sim-build-ba : cf_model drive_in_circles circle ( Last six runs Jun2024 )

---------- Differences in output ----------
6c6
< Simulation ended at time: 3000.00
---
> Simulation ended at time: 3000.00.

2 TESTS FAILED on ts-sim-build-ba :

---------- Differences in output ----------
5c5
< Simulation ended at time: 1440.00
---
> Simulation ended at time: 1440.00.
cf_model jam_resolution bottleneck_confluence ( Last six runs Jun2024 )
cf_model jam_resolution bottleneck_departLane_random ( Last six runs Jun2024 )

TEST FAILED on ts-sim-build-ba : cf_model jam_resolution bottleneck_zipper ( Last six runs Jun2024 )

---------- Differences in output ----------
5c5
< Simulation ended at time: 219.00
---
> Simulation ended at time: 219.00.

TEST FAILED on ts-sim-build-ba : cf_model jam_resolution bottleneck_zipper_subseconds ( Last six runs Jun2024 )

---------- Differences in output ----------
4c4
< Simulation ended at time: 218.20
---
> Simulation ended at time: 218.20.

TEST FAILED on ts-sim-build-ba : cf_model jam_resolution tls ( Last six runs Jun2024 )

---------- Differences in output ----------
4c4
< Simulation ended at time: 950.00
---
> Simulation ended at time: 950.00.

4 TESTS FAILED on ts-sim-build-ba :

---------- Differences in output ----------
5c5
< Simulation ended at time: 60.00
---
> Simulation ended at time: 60.00.
devices rerouting assignment taz_astar ( Last six runs Jun2024 )
devices rerouting assignment taz_astar_landmark ( Last six runs Jun2024 )
devices rerouting assignment taz_astar_landmark_empty ( Last six runs Jun2024 )
devices rerouting parallel taz_astar_landmark_parallel ( Last six runs Jun2024 )

TEST FAILED on ts-sim-build-ba : devices rerouting parallel parallel_astar ( Last six runs Jun2024 )

---------- Differences in output ----------
5c5
< Simulation ended at time: 104.00
---
> Simulation ended at time: 104.00.

TEST FAILED on ts-sim-build-ba : devices rerouting parallel public_walk ( Last six runs Jun2024 )

---------- Differences in output ----------
5c5
< Simulation ended at time: 1261.00
---
> Simulation ended at time: 1261.00.

TEST FAILED on ts-sim-build-ba : devices rerouting personTrip bike_public_walk ( Last six runs Jun2024 )

---------- Differences in output ----------
5c5
< Simulation ended at time: 1012.00
---
> Simulation ended at time: 1012.00.

2 TESTS FAILED on ts-sim-build-ba :

---------- Differences in output ----------
4c4
< Simulation ended at time: 3623.00
---
> Simulation ended at time: 3623.00.
devices rerouting reroute_congestions delayed_insertion ( Last six runs Jun2024 )
devices rerouting reroute_congestions delayed_insertion_departLaneBest ( Last six runs Jun2024 )

3 TESTS FAILED on ts-sim-build-ba :

---------- Differences in output ----------
4c4
< Simulation ended at time: 3972.00
---
> Simulation ended at time: 3972.00.
devices rerouting reroute_congestions exit_times ( Last six runs Jun2024 )
devices rerouting reroute_congestions period_120 ( Last six runs Jun2024 )
devices rerouting reroute_congestions period_vType ( Last six runs Jun2024 )

2 TESTS FAILED on ts-sim-build-ba :

---------- Differences in output ----------
5c5
< Simulation ended at time: 3225.00
---
> Simulation ended at time: 3225.00.
devices rerouting tlsPenalty default ( Last six runs Jun2024 )
devices rerouting tlsPenalty penalty_0.5 ( Last six runs Jun2024 )

TEST FAILED on ts-sim-build-ba : devices rerouting turn_specific_speeds default ( Last six runs Jun2024 )

---------- Differences in output ----------
5c5
< Simulation ended at time: 840.00
---
> Simulation ended at time: 840.00.

TEST FAILED on ts-sim-build-ba : devices taxi 2taxis_10persons greedy ( Last six runs Jun2024 )

---------- Differences in output ----------
4c4
< Simulation ended at time: 738.00
---
> Simulation ended at time: 738.00.

TEST FAILED on ts-sim-build-ba : devices taxi 2taxis_10persons greedyClosest ( Last six runs Jun2024 )

---------- Differences in output ----------
4c4
< Simulation ended at time: 730.00
---
> Simulation ended at time: 730.00.

TEST FAILED on ts-sim-build-ba : devices taxi 2taxis_10persons greedyShared ( Last six runs Jun2024 )

---------- Differences in output ----------
4c4
< Simulation ended at time: 678.00
---
> Simulation ended at time: 678.00.

TEST FAILED on ts-sim-build-ba : devices taxi 2taxis_10persons routeExtension ( Last six runs Jun2024 )

---------- Differences in output ----------
4c4
< Simulation ended at time: 731.00
---
> Simulation ended at time: 731.00.

2 TESTS FAILED on ts-sim-build-ba :

---------- Differences in output ----------
4c4
< Simulation ended at time: 206.00
---
> Simulation ended at time: 206.00.
devices taxi lines 2lines_rideAny ( Last six runs Jun2024 )
devices taxi lines 2lines_taxiAny ( Last six runs Jun2024 )

3 TESTS FAILED on ts-sim-build-ba :

---------- Differences in output ----------
4c4
< Simulation ended at time: 366.00
---
> Simulation ended at time: 366.00.
devices taxi lines 2lines_rideAny_notTaxi ( Last six runs Jun2024 )
devices taxi lines 2lines_rideSelect_greedy ( Last six runs Jun2024 )
devices taxi lines 2lines_rideSelect_greedyClosest ( Last six runs Jun2024 )

2 TESTS FAILED on ts-sim-build-ba :

---------- Differences in output ----------
4c4
< Simulation ended at time: 207.00
---
> Simulation ended at time: 207.00.
devices taxi lines 2lines_rideSelect_greedyShared ( Last six runs Jun2024 )
devices taxi lines 2lines_rideSelect_routeExtension ( Last six runs Jun2024 )

TEST FAILED on ts-sim-build-ba : devices taxi personTrip bike_sharing ( Last six runs Jun2024 )

---------- Differences in output ----------
5c5
< Simulation ended at time: 663.00
---
> Simulation ended at time: 663.00.

TEST FAILED on ts-sim-build-ba : errors too_many_teleports ( Last six runs Jun2024 )

---------- Differences in output ----------
4c4
< Simulation ended at time: 4026.00
---
> Simulation ended at time: 4026.00.

4 TESTS FAILED on ts-sim-build-ba :

---------- Differences in output ----------
6c6
< Simulation ended at time: 3089.00
---
> Simulation ended at time: 3089.00.
extended calibrator 2lanes_calibrate1 ( Last six runs Jun2024 )
extended calibrator 2lanes_calibrate2 ( Last six runs Jun2024 )
extended calibrator 2lanes_calibrate_edge ( Last six runs Jun2024 )
extended calibrator vTypes ( Last six runs Jun2024 )

TEST FAILED on ts-sim-build-ba : extended inc-dua more_digits ( Last six runs Jun2024 )

---------- Differences in output ----------
4c4
< Simulation ended at time: 299.00
---
> Simulation ended at time: 299.00.

TEST FAILED on ts-sim-build-ba : extended inc-dua numeric_accuracy ( Last six runs Jun2024 )

---------- Differences in output ----------
4c4
< Simulation ended at time: 1185.00
---
> Simulation ended at time: 1185.00.

TEST FAILED on ts-sim-build-ba : extended rerouter closingLaneReroute closingLane_no_notification ( Last six runs Jun2024 )

---------- Differences in output ----------
5c5
< Simulation ended at time: 288.00
---
> Simulation ended at time: 288.00.

2 TESTS FAILED on ts-sim-build-ba :

---------- Differences in output ----------
5c5
< Simulation ended at time: 330.00
---
> Simulation ended at time: 330.00.
extended rerouter closingLaneReroute directional_lane_switch ( Last six runs Jun2024 )
extended rerouter closingLaneReroute directional_lane_switch_visible ( Last six runs Jun2024 )

2 TESTS FAILED on ts-sim-build-ba :

---------- Differences in output ----------
5c5
< Simulation ended at time: 1001.00
---
> Simulation ended at time: 1001.00.
extended rerouter closingReroute hard_closedDepartEdge trip_departLane_default_ignore ( Last six runs Jun2024 )
extended rerouter closingReroute hard_closedDepartEdge vehicle_departLane_default_ignore ( Last six runs Jun2024 )

5 TESTS FAILED on ts-sim-build-ba :

---------- Differences in output ----------
6c6
< Simulation ended at time: 39.00
---
> Simulation ended at time: 39.00.
extended state load ( Last six runs Jun2024 )
extended state load_and_save ( Last six runs Jun2024 )
extended state load_and_save_actionStepLength ( Last six runs Jun2024 )
extended state load_late_insertion ( Last six runs Jun2024 )
extended state load_scaled ( Last six runs Jun2024 )

3 TESTS FAILED on ts-sim-build-ba :

---------- Differences in output ----------
7c7
< Simulation ended at time: 39.00
---
> Simulation ended at time: 39.00.
extended state load_and_save_actionStepLength2 ( Last six runs Jun2024 )
extended state load_remove ( Last six runs Jun2024 )
extended state load_routes_as_additional ( Last six runs Jun2024 )

TEST FAILED on ts-sim-build-ba : extended state load_and_save_same ( Last six runs Jun2024 )

---------- Differences in output ----------
6c6
< Simulation ended at time: 44.00
---
> Simulation ended at time: 44.00.

TEST FAILED on ts-sim-build-ba : extended state load_arriving ( Last six runs Jun2024 )

---------- Differences in output ----------
6c6
< Simulation ended at time: 30.00
---
> Simulation ended at time: 30.00.

TEST FAILED on ts-sim-build-ba : extended state load_shifted ( Last six runs Jun2024 )

---------- Differences in output ----------
6c6
< Simulation ended at time: 130.00
---
> Simulation ended at time: 130.00.

2 TESTS FAILED on ts-sim-build-ba :

---------- Differences in output ----------
4c4
< Simulation ended at time: 11.00
---
> Simulation ended at time: 11.00.
extended state save2_begin_mismatch ( Last six runs Jun2024 )
extended state save2_mismatch ( Last six runs Jun2024 )

TEST FAILED on ts-sim-build-ba : extended state save_at_interval_mismatch ( Last six runs Jun2024 )

---------- Differences in output ----------
4c4
< Simulation ended at time: 38.50
---
> Simulation ended at time: 38.50.

TEST FAILED on ts-sim-build-ba : extended state save_pastStop_param ( Last six runs Jun2024 )

---------- Differences in output ----------
4c4
< Simulation ended at time: 46.00
---
> Simulation ended at time: 46.00.

2 TESTS FAILED on ts-sim-build-ba :

---------- Differences in output ----------
5c5
< Simulation ended at time: 70.00
---
> Simulation ended at time: 70.00.
extended state save_routeProbe ( Last six runs Jun2024 )
meso edge_type overtaking ( Last six runs Jun2024 )

TEST FAILED on ts-sim-build-ba : extended state save_taz_route_invalid ( Last six runs Jun2024 )

---------- Differences in output ----------
5c5
< Simulation ended at time: 600.00
---
> Simulation ended at time: 600.00.

TEST FAILED on ts-sim-build-ba : extended stops parking busstop_parkingLength_mixed ( Last six runs Jun2024 )

---------- Differences in output ----------
5c5
< Simulation ended at time: 173.00
---
> Simulation ended at time: 173.00.

TEST FAILED on ts-sim-build-ba : extended stops parking busstop_parkingLength_mixed2 ( Last six runs Jun2024 )

---------- Differences in output ----------
5c5
< Simulation ended at time: 119.00
---
> Simulation ended at time: 119.00.

2 TESTS FAILED on ts-sim-build-ba :

---------- Differences in output ----------
5c5
< Simulation ended at time: 327.00
---
> Simulation ended at time: 327.00.
extended stops parkingArea_onRoad congestion ( Last six runs Jun2024 )
extended stops parkingArea_onRoad long_lots ( Last six runs Jun2024 )

TEST FAILED on ts-sim-build-ba : extended stops parkingArea_onRoad different_durations ( Last six runs Jun2024 )

---------- Differences in output ----------
5c5
< Simulation ended at time: 235.00
---
> Simulation ended at time: 235.00.

TEST FAILED on ts-sim-build-ba : junction_model avoid_spill_back large_junction_short_edge ( Last six runs Jun2024 )

---------- Differences in output ----------
4c4
< Simulation ended at time: 80.00
---
> Simulation ended at time: 80.00.

TEST FAILED on ts-sim-build-ba : junction_model avoid_spill_back network_ends_behind_junction ( Last six runs Jun2024 )

---------- Differences in output ----------
4c4
< Simulation ended at time: 42.00
---
> Simulation ended at time: 42.00.

TEST FAILED on ts-sim-build-ba : junction_model avoid_spill_back roundabout ( Last six runs Jun2024 )

---------- Differences in output ----------
4c4
< Simulation ended at time: 125.00
---
> Simulation ended at time: 125.00.

TEST FAILED on ts-sim-build-ba : junction_model avoid_spill_back small_junction_before_tls ( Last six runs Jun2024 )

---------- Differences in output ----------
4c4
< Simulation ended at time: 90.00
---
> Simulation ended at time: 90.00.

TEST FAILED on ts-sim-build-ba : junction_model bikes prioLarge_onlyBike ( Last six runs Jun2024 )

---------- Differences in output ----------
4c4
< Simulation ended at time: 635.00
---
> Simulation ended at time: 635.00.

3 TESTS FAILED on ts-sim-build-ba :

---------- Differences in output ----------
4c4
< Simulation ended at time: 122.00
---
> Simulation ended at time: 122.00.
junction_model ignoreFoeOnJunction ignore_veh_all ( Last six runs Jun2024 )
junction_model ignoreFoeOnJunction ignore_veh_none ( Last six runs Jun2024 )
junction_model ignoreFoeOnJunction ignore_veh_some ( Last six runs Jun2024 )

2 TESTS FAILED on ts-sim-build-ba :

---------- Differences in output ----------
4c4
< Simulation ended at time: 0.00
---
> Simulation ended at time: 0.00.
junction_model indirect_left_turn internal_junction_controlled ( Last six runs Jun2024 )
junction_model indirect_left_turn internal_junction_uncontrolled ( Last six runs Jun2024 )

TEST FAILED on ts-sim-build-ba : junction_model indirect_left_turn internal_junction_controlled_moped ( Last six runs Jun2024 )

---------- Differences in output ----------
5c5
< Simulation ended at time: 1434.00
---
> Simulation ended at time: 1434.00.

2 TESTS FAILED on ts-sim-build-ba :

---------- Differences in output ----------
5c5
< Simulation ended at time: 1029.00
---
> Simulation ended at time: 1029.00.
junction_model indirect_left_turn priority2_oncoming ( Last six runs Jun2024 )
junction_model indirect_left_turn priority_oncoming ( Last six runs Jun2024 )

3 TESTS FAILED on ts-sim-build-ba :

---------- Differences in output ----------
5c5
< Simulation ended at time: 1111.00
---
> Simulation ended at time: 1111.00.
junction_model indirect_left_turn priority2_sameStraight ( Last six runs Jun2024 )
junction_model indirect_left_turn priority_sameStraight ( Last six runs Jun2024 )
junction_model indirect_left_turn priority_sameStraight_defaultShape ( Last six runs Jun2024 )

TEST FAILED on ts-sim-build-ba : junction_model junction_type priority_custom narrow_road ( Last six runs Jun2024 )

---------- Differences in output ----------
4c4
< Simulation ended at time: 3601.00
---
> Simulation ended at time: 3601.00.

5 TESTS FAILED on ts-sim-build-ba :

---------- Differences in output ----------
5c5
< Simulation ended at time: 941.00
---
> Simulation ended at time: 941.00.
junction_model junction_type rail_crossing basic ( Last six runs Jun2024 )
junction_model junction_type rail_crossing opening-delay ( Last six runs Jun2024 )
junction_model junction_type rail_crossing opening-time ( Last six runs Jun2024 )
junction_model junction_type rail_crossing space_gap ( Last six runs Jun2024 )
junction_model junction_type rail_crossing yellow-time ( Last six runs Jun2024 )

TEST FAILED on ts-sim-build-ba : junction_model junction_type tls off_internal_cont_major ( Last six runs Jun2024 )

---------- Differences in output ----------
4c4
< Simulation ended at time: 112.00
---
> Simulation ended at time: 112.00.

TEST FAILED on ts-sim-build-ba : junction_model junction_type tls right_on_red_program ( Last six runs Jun2024 )

---------- Differences in output ----------
4c4
< Simulation ended at time: 218.00
---
> Simulation ended at time: 218.00.

2 TESTS FAILED on ts-sim-build-ba :

---------- Differences in output ----------
4c4
< Simulation ended at time: 1016.00
---
> Simulation ended at time: 1016.00.
junction_model junction_type zipper variations ( Last six runs Jun2024 )
junction_model junction_type zipper variations_adaptDist_50 ( Last six runs Jun2024 )

2 TESTS FAILED on ts-sim-build-ba :

---------- Differences in output ----------
4c4
< Simulation ended at time: 1007.00
---
> Simulation ended at time: 1007.00.
junction_model junction_type zipper variations_dense ( Last six runs Jun2024 )
junction_model junction_type zipper variations_dense_adaptDist_50 ( Last six runs Jun2024 )

TEST FAILED on ts-sim-build-ba : junction_model junction_type zipper variations_highspeed ( Last six runs Jun2024 )

---------- Differences in output ----------
4c4
< Simulation ended at time: 1005.00
---
> Simulation ended at time: 1005.00.

2 TESTS FAILED on ts-sim-build-ba :

---------- Differences in output ----------
4c4
< Simulation ended at time: 1014.40
---
> Simulation ended at time: 1014.40.
junction_model junction_type zipper variations_subsecond ( Last six runs Jun2024 )
junction_model junction_type zipper variations_subsecond_IDM ( Last six runs Jun2024 )

TEST FAILED on ts-sim-build-ba : junction_model minor_internalJunction bike_behind_crossing ( Last six runs Jun2024 )

---------- Differences in output ----------
4c4
< Simulation ended at time: 1355.00
---
> Simulation ended at time: 1355.00.

TEST FAILED on ts-sim-build-ba : junction_model roundabout small ( Last six runs Jun2024 )

---------- Differences in output ----------
4c4
< Simulation ended at time: 310.00
---
> Simulation ended at time: 310.00.

TEST FAILED on ts-sim-build-ba : meso bugs ticket2244 ( Last six runs Jun2024 )

---------- Differences in output ----------
4c4
< Simulation ended at time: 886.00
---
> Simulation ended at time: 886.00.

TEST FAILED on ts-sim-build-ba : meso bugs ticket2246 ( Last six runs Jun2024 )

---------- Differences in output ----------
4c4
< Simulation ended at time: 1487.00
---
> Simulation ended at time: 1487.00.

TEST FAILED on ts-sim-build-ba : meso bugs ticket2769 ( Last six runs Jun2024 )

---------- Differences in output ----------
4c4
< Simulation ended at time: 1123.00
---
> Simulation ended at time: 1123.00.

TEST FAILED on ts-sim-build-ba : meso bugs ticket5722 ( Last six runs Jun2024 )

---------- Differences in output ----------
5c5
< Simulation ended at time: 5400.00
---
> Simulation ended at time: 5400.00.

TEST FAILED on ts-sim-build-ba : meso bugs ticket7491 ( Last six runs Jun2024 )

---------- Differences in output ----------
5c5
< Simulation ended at time: 203.00
---
> Simulation ended at time: 203.00.

TEST FAILED on ts-sim-build-ba : meso bugs ticket8156 ( Last six runs Jun2024 )

---------- Differences in output ----------
4c4
< Simulation ended at time: 2183.00
---
> Simulation ended at time: 2183.00.

2 TESTS FAILED on ts-sim-build-ba :

---------- Differences in output ----------
4c4
< Simulation ended at time: 53.00
---
> Simulation ended at time: 53.00.
meso edge_type default ( Last six runs Jun2024 )
meso edge_type tls_default ( Last six runs Jun2024 )

TEST FAILED on ts-sim-build-ba : meso edge_type jamThreshold ( Last six runs Jun2024 )

---------- Differences in output ----------
5c5
< Simulation ended at time: 56.00
---
> Simulation ended at time: 56.00.

TEST FAILED on ts-sim-build-ba : meso edge_type junctionControl ( Last six runs Jun2024 )

---------- Differences in output ----------
5c5
< Simulation ended at time: 55.00
---
> Simulation ended at time: 55.00.

TEST FAILED on ts-sim-build-ba : meso edge_type minorPenalty ( Last six runs Jun2024 )

---------- Differences in output ----------
5c5
< Simulation ended at time: 58.00
---
> Simulation ended at time: 58.00.

TEST FAILED on ts-sim-build-ba : meso edge_type overtaking_default ( Last six runs Jun2024 )

---------- Differences in output ----------
4c4
< Simulation ended at time: 73.00
---
> Simulation ended at time: 73.00.

TEST FAILED on ts-sim-build-ba : meso edge_type overtaking_option ( Last six runs Jun2024 )

---------- Differences in output ----------
4c4
< Simulation ended at time: 70.00
---
> Simulation ended at time: 70.00.

TEST FAILED on ts-sim-build-ba : meso edge_type tauff ( Last six runs Jun2024 )

---------- Differences in output ----------
5c5
< Simulation ended at time: 82.00
---
> Simulation ended at time: 82.00.

2 TESTS FAILED on ts-sim-build-ba :

---------- Differences in output ----------
5c5
< Simulation ended at time: 53.00
---
> Simulation ended at time: 53.00.
meso edge_type taufj ( Last six runs Jun2024 )
meso edge_type taufjj ( Last six runs Jun2024 )

TEST FAILED on ts-sim-build-ba : meso edge_type taujf ( Last six runs Jun2024 )

---------- Differences in output ----------
5c5
< Simulation ended at time: 57.00
---
> Simulation ended at time: 57.00.

TEST FAILED on ts-sim-build-ba : meso edge_type tls_flowPenalty ( Last six runs Jun2024 )

---------- Differences in output ----------
5c5
< Simulation ended at time: 62.00
---
> Simulation ended at time: 62.00.

TEST FAILED on ts-sim-build-ba : meso edge_type tls_penalty ( Last six runs Jun2024 )

---------- Differences in output ----------
5c5
< Simulation ended at time: 59.00
---
> Simulation ended at time: 59.00.

TEST FAILED on ts-sim-build-ba : meso ignore_lanes plain ( Last six runs Jun2024 )

---------- Differences in output ----------
4c4
< Simulation ended at time: 3708.00
---
> Simulation ended at time: 3708.00.

TEST FAILED on ts-sim-build-ba : meso ignore_lanes remove_bus ( Last six runs Jun2024 )

---------- Differences in output ----------
4c4
< Simulation ended at time: 5415.00
---
> Simulation ended at time: 5415.00.

TEST FAILED on ts-sim-build-ba : meso ignore_lanes remove_none ( Last six runs Jun2024 )

---------- Differences in output ----------
4c4
< Simulation ended at time: 2716.00
---
> Simulation ended at time: 2716.00.

TEST FAILED on ts-sim-build-ba : meso jamming single_jam_1lane ( Last six runs Jun2024 )

---------- Differences in output ----------
4c4
< Simulation ended at time: 584.00
---
> Simulation ended at time: 584.00.

TEST FAILED on ts-sim-build-ba : meso jamming speedDev_jamThreshold_-0.8 ( Last six runs Jun2024 )

---------- Differences in output ----------
4c4
< Simulation ended at time: 3702.00
---
> Simulation ended at time: 3702.00.

2 TESTS FAILED on ts-sim-build-ba :

---------- Differences in output ----------
4c4
< Simulation ended at time: 3736.00
---
> Simulation ended at time: 3736.00.
meso jamming speedDev_jamThreshold_-1 ( Last six runs Jun2024 )
meso jamming speedDev_jamThreshold_default ( Last six runs Jun2024 )

TEST FAILED on ts-sim-build-ba : meso junction_control multique ( Last six runs Jun2024 )

---------- Differences in output ----------
4c4
< Simulation ended at time: 5136.00
---
> Simulation ended at time: 5136.00.

TEST FAILED on ts-sim-build-ba : meso junction_control network_problem control ( Last six runs Jun2024 )

---------- Differences in output ----------
4c4
< Simulation ended at time: 9747.00
---
> Simulation ended at time: 9747.00.

2 TESTS FAILED on ts-sim-build-ba :

---------- Differences in output ----------
4c4
< Simulation ended at time: 446.00
---
> Simulation ended at time: 446.00.
meso junction_control network_problem control.limited ( Last six runs Jun2024 )
meso junction_control network_problem no_control ( Last six runs Jun2024 )

TEST FAILED on ts-sim-build-ba : meso junction_control network_problem control.limited.small_roundabout ( Last six runs Jun2024 )

---------- Differences in output ----------
4c4
< Simulation ended at time: 425.00
---
> Simulation ended at time: 425.00.

TEST FAILED on ts-sim-build-ba : meso junction_control network_problem control.limited_minorPenalty ( Last six runs Jun2024 )

---------- Differences in output ----------
4c4
< Simulation ended at time: 456.00
---
> Simulation ended at time: 456.00.

TEST FAILED on ts-sim-build-ba : meso junction_control network_problem control.limited_tlsPenalty ( Last six runs Jun2024 )

---------- Differences in output ----------
4c4
< Simulation ended at time: 2682.00
---
> Simulation ended at time: 2682.00.

TEST FAILED on ts-sim-build-ba : meso junction_control no_control ( Last six runs Jun2024 )

---------- Differences in output ----------
4c4
< Simulation ended at time: 3688.00
---
> Simulation ended at time: 3688.00.

2 TESTS FAILED on ts-sim-build-ba :

---------- Differences in output ----------
4c4
< Simulation ended at time: 4354.00
---
> Simulation ended at time: 4354.00.
meso junction_control no_control_flowPenalty0 ( Last six runs Jun2024 )
meso junction_control no_control_flowPenalty0.5 ( Last six runs Jun2024 )

TEST FAILED on ts-sim-build-ba : meso junction_control no_control_flowPenalty1 ( Last six runs Jun2024 )

---------- Differences in output ----------
4c4
< Simulation ended at time: 4359.00
---
> Simulation ended at time: 4359.00.

TEST FAILED on ts-sim-build-ba : meso junction_control no_tls ( Last six runs Jun2024 )

---------- Differences in output ----------
5c5
< Simulation ended at time: 6320.00
---
> Simulation ended at time: 6320.00.

TEST FAILED on ts-sim-build-ba : meso junction_control no_tls_multique ( Last six runs Jun2024 )

---------- Differences in output ----------
5c5
< Simulation ended at time: 10950.00
---
> Simulation ended at time: 10950.00.

TEST FAILED on ts-sim-build-ba : meso junction_control plain ( Last six runs Jun2024 )

---------- Differences in output ----------
4c4
< Simulation ended at time: 4778.00
---
> Simulation ended at time: 4778.00.

TEST FAILED on ts-sim-build-ba : meso junction_control priority ( Last six runs Jun2024 )

---------- Differences in output ----------
4c4
< Simulation ended at time: 1436.00
---
> Simulation ended at time: 1436.00.

TEST FAILED on ts-sim-build-ba : meso junction_control priority_no_control ( Last six runs Jun2024 )

---------- Differences in output ----------
4c4
< Simulation ended at time: 618.00
---
> Simulation ended at time: 618.00.

TEST FAILED on ts-sim-build-ba : meso junction_control tlsPenalty_minorPenalty ( Last six runs Jun2024 )

---------- Differences in output ----------
4c4
< Simulation ended at time: 323.00
---
> Simulation ended at time: 323.00.

TEST FAILED on ts-sim-build-ba : meso junction_control tls_coordination average control ( Last six runs Jun2024 )

---------- Differences in output ----------
5c5
< Simulation ended at time: 179.00
---
> Simulation ended at time: 179.00.

3 TESTS FAILED on ts-sim-build-ba :

---------- Differences in output ----------
5c5
< Simulation ended at time: 123.00
---
> Simulation ended at time: 123.00.
meso junction_control tls_coordination average control.limited ( Last six runs Jun2024 )
meso junction_control tls_coordination bad control.limited ( Last six runs Jun2024 )
meso junction_control tls_coordination good control.limited ( Last six runs Jun2024 )

6 TESTS FAILED on ts-sim-build-ba :

---------- Differences in output ----------
5c5
< Simulation ended at time: 160.00
---
> Simulation ended at time: 160.00.
meso junction_control tls_coordination average control.limited_tlsPenalty ( Last six runs Jun2024 )
meso junction_control tls_coordination average control_tlsPenalty ( Last six runs Jun2024 )
meso junction_control tls_coordination bad control.limited_tlsPenalty ( Last six runs Jun2024 )
meso junction_control tls_coordination bad control_tlsPenalty ( Last six runs Jun2024 )
meso junction_control tls_coordination good control.limited_tlsPenalty ( Last six runs Jun2024 )
meso junction_control tls_coordination good control_tlsPenalty ( Last six runs Jun2024 )

TEST FAILED on ts-sim-build-ba : meso junction_control tls_coordination average control.limited_tlsPenalty_scaled ( Last six runs Jun2024 )

---------- Differences in output ----------
5c5
< Simulation ended at time: 143.00
---
> Simulation ended at time: 143.00.

3 TESTS FAILED on ts-sim-build-ba :

---------- Differences in output ----------
5c5
< Simulation ended at time: 111.00
---
> Simulation ended at time: 111.00.
meso junction_control tls_coordination average no_control ( Last six runs Jun2024 )
meso junction_control tls_coordination bad no_control ( Last six runs Jun2024 )
meso junction_control tls_coordination good no_control ( Last six runs Jun2024 )

TEST FAILED on ts-sim-build-ba : meso junction_control tls_coordination bad control ( Last six runs Jun2024 )

---------- Differences in output ----------
5c5
< Simulation ended at time: 202.00
---
> Simulation ended at time: 202.00.

TEST FAILED on ts-sim-build-ba : meso junction_control tls_coordination good control ( Last six runs Jun2024 )

---------- Differences in output ----------
5c5
< Simulation ended at time: 168.00
---
> Simulation ended at time: 168.00.

TEST FAILED on ts-sim-build-ba : meso lane_queue closingLane ( Last six runs Jun2024 )

---------- Differences in output ----------
5c5
< Simulation ended at time: 350.00
---
> Simulation ended at time: 350.00.

TEST FAILED on ts-sim-build-ba : meso teleport jump_to_end ( Last six runs Jun2024 )

---------- Differences in output ----------
5c5
< Simulation ended at time: 15104.00
---
> Simulation ended at time: 15104.00.

TEST FAILED on ts-sim-build-ba : meso teleport multiple_jumps ( Last six runs Jun2024 )

---------- Differences in output ----------
5c5
< Simulation ended at time: 15169.00
---
> Simulation ended at time: 15169.00.

TEST FAILED on ts-sim-build-ba : meso teleport single_jump ( Last six runs Jun2024 )

---------- Differences in output ----------
5c5
< Simulation ended at time: 7520.00
---
> Simulation ended at time: 7520.00.

TEST FAILED on ts-sim-build-ba : meso teleport single_jump_to_end ( Last six runs Jun2024 )

---------- Differences in output ----------
5c5
< Simulation ended at time: 15008.00
---
> Simulation ended at time: 15008.00.

3 TESTS FAILED on ts-sim-build-ba :

---------- Differences in output ----------
4c4
< Simulation ended at time: 261.00
---
> Simulation ended at time: 261.00.
output duration_log statistics ( Last six runs Jun2024 )
output duration_log upscale ( Last six runs Jun2024 )
output duration_log upscale_with_flows ( Last six runs Jun2024 )

TEST FAILED on ts-sim-build-ba : output duration_log statistics_running ( Last six runs Jun2024 )

---------- Differences in output ----------
4c4
< Simulation ended at time: 45.00
---
> Simulation ended at time: 45.00.

TEST FAILED on ts-sim-build-ba : output duration_log teleports_and_collisions ( Last six runs Jun2024 )

---------- Differences in output ----------
5c5
< Simulation ended at time: 500.00
---
> Simulation ended at time: 500.00.

TEST FAILED on ts-sim-build-ba : output duration_log vaporizer_on_depart_edge ( Last six runs Jun2024 )

---------- Differences in output ----------
6c6
< Simulation ended at time: 10.00
---
> Simulation ended at time: 10.00.

TEST FAILED on ts-sim-build-ba : output duration_log vehicles_exceeding_max_depart_delay ( Last six runs Jun2024 )

---------- Differences in output ----------
4c4
< Simulation ended at time: 215.00
---
> Simulation ended at time: 215.00.

2 TESTS FAILED on ts-sim-build-ba :

---------- Differences in logPrefixed ----------
6c6
< Simulation ended at time: 100.00
---
> Simulation ended at time: 100.00.
output examples cross3ltl_prefixed_meandata_and_tripinfo_and_log ( Last six runs Jun2024 )
output examples cross3ltl_prefixed_nul ( Last six runs Jun2024 )

TEST FAILED on ts-sim-build-ba : output fcd-output params_caccVehicleMode ( Last six runs Jun2024 )

---------- Differences in output ----------
6c6
< Simulation ended at time: 60.00
---
> Simulation ended at time: 60.00.

3 TESTS FAILED on ts-sim-build-ba :

---------- Differences in output ----------
6c6
< Simulation ended at time: 1000.00
---
> Simulation ended at time: 1000.00.
output tripinfo probability_by_type ( Last six runs Jun2024 )
spec flow probability_0.1 ( Last six runs Jun2024 )
spec flow probability_0.1_step-length_0.2 ( Last six runs Jun2024 )

TEST FAILED on ts-sim-build-ba : output tripinfo write_undeparted ( Last six runs Jun2024 )

---------- Differences in output ----------
6c6
< Simulation ended at time: 5.00
---
> Simulation ended at time: 5.00.

TEST FAILED on ts-sim-build-ba : pedestrian_model nonInteracting pedestrian_interactions jam_trafficlight ( Last six runs Jun2024 )

---------- Differences in output ----------
5c5
< Simulation ended at time: 409.00
---
> Simulation ended at time: 409.00.

TEST FAILED on ts-sim-build-ba : rail tramwayLoop basic ( Last six runs Jun2024 )

---------- Differences in output ----------
5c5
< Simulation ended at time: 1940.00
---
> Simulation ended at time: 1940.00.

TEST FAILED on ts-sim-build-ba : rail tramwayLoop track_closed ( Last six runs Jun2024 )

---------- Differences in output ----------
6c6
< Simulation ended at time: 1941.00
---
> Simulation ended at time: 1941.00.

6 TESTS FAILED on ts-sim-build-ba :

---------- Differences in output ----------
6c6
< Simulation ended at time: 360.00
---
> Simulation ended at time: 360.00.
spec departure departPos pos_last_speed_given ( Last six runs Jun2024 )
spec departure departPos pos_last_speed_max ( Last six runs Jun2024 )
spec departure departSpeed speed_avg ( Last six runs Jun2024 )
spec departure departSpeed speed_desired ( Last six runs Jun2024 )
spec departure departSpeed speed_last ( Last six runs Jun2024 )
spec departure departSpeed speed_speedLimit ( Last six runs Jun2024 )

TEST FAILED on ts-sim-build-ba : spec departure departSpeed speed_max__leader ( Last six runs Jun2024 )

---------- Differences in output ----------
6c6
< Simulation ended at time: 50.00
---
> Simulation ended at time: 50.00.

TEST FAILED on ts-sim-build-ba : spec departure extrapolate_departpos ( Last six runs Jun2024 )

---------- Differences in output ----------
5c5
< Simulation ended at time: 1684.00
---
> Simulation ended at time: 1684.00.

TEST FAILED on ts-sim-build-ba : spec distribution errors speedDev_invalid ( Last six runs Jun2024 )

---------- Differences in output ----------
3c3
< Simulation ended at time: 0.00
---
> Simulation ended at time: 0.00.

3 TESTS FAILED on ts-sim-build-ba :

---------- Differences in output ----------
5c5
< Simulation ended at time: 1000.00
---
> Simulation ended at time: 1000.00.
spec distribution speedDev ( Last six runs Jun2024 )
spec distribution speedDev_option ( Last six runs Jun2024 )
spec distribution speedFactorNormc ( Last six runs Jun2024 )

2 TESTS FAILED on ts-sim-build-ba :

---------- Differences in output ----------
6c6
< Simulation ended at time: 49.00
---
> Simulation ended at time: 49.00.
spec flow number_instant ( Last six runs Jun2024 )
spec flow number_instant2 ( Last six runs Jun2024 )

TEST FAILED on ts-sim-build-ba : spec flow poisson_0.0001 ( Last six runs Jun2024 )

---------- Differences in output ----------
6c6
< Simulation ended at time: 100001.00
---
> Simulation ended at time: 100001.00.

TEST FAILED on ts-sim-build-ba : spec flow poisson_0.1 ( Last six runs Jun2024 )

---------- Differences in output ----------
6c6
< Simulation ended at time: 144.00
---
> Simulation ended at time: 144.00.

TEST FAILED on ts-sim-build-ba : spec flow poisson_0.1_number ( Last six runs Jun2024 )

---------- Differences in output ----------
6c6
< Simulation ended at time: 140.00
---
> Simulation ended at time: 140.00.

TEST FAILED on ts-sim-build-ba : spec flow poisson_1 ( Last six runs Jun2024 )

---------- Differences in output ----------
6c6
< Simulation ended at time: 147.00
---
> Simulation ended at time: 147.00.

TEST FAILED on ts-sim-build-ba : spec flow probability_0.1_begin_100 ( Last six runs Jun2024 )

---------- Differences in output ----------
6c6
< Simulation ended at time: 1122.00
---
> Simulation ended at time: 1122.00.

TEST FAILED on ts-sim-build-ba : spec flow probability_0.5 ( Last six runs Jun2024 )

---------- Differences in output ----------
6c6
< Simulation ended at time: 1035.00
---
> Simulation ended at time: 1035.00.

TEST FAILED on ts-sim-build-ba : spec flow probability_0.5_start_1000 ( Last six runs Jun2024 )

---------- Differences in output ----------
6c6
< Simulation ended at time: 2035.00
---
> Simulation ended at time: 2035.00.

Detailed information for the tests that had known bugs:

TEST had known bugs (see #1044) on ts-sim-build-ba : bugs 1xxx ticket1044 ( Last six runs Jun2024 )

bug in lcModel DK2004, fixed in JE2013
(This bug was triggered by FAILING to find text in file 'output' matching 'Simulation ended at time: 16.00')
---------- Differences in output ----------
4c4
< Simulation ended at time: 16.00
---
> Simulation ended at time: 17.00.

TEST had known bugs (see #1097) on ts-sim-build-ba : bugs 1xxx ticket1097 ( Last six runs Jun2024 )

vehicles use the wrong lane and thereby slow down the flow of traffic
(This bug was triggered by FAILING to find text in file 'output' matching 'Simulation ended at time: 3352.00')
---------- Differences in output ----------
1c1
< Loading net-file from 'net.net.xml'...  done ((TIME)).
---
> Loading net-file from 'net.net.xml' ... done ((TIME)).
3,4c3,4
< Simulation started with time: 0.00..
< Simulation ended at time: 3352.00
---
> Simulation started with time: 0.00.
> Simulation ended at time: 3004.00.

TEST had known bugs (bug 1224 (NONEXISTENT)) on ts-sim-build-ba : bugs 1xxx ticket1224 ( Last six runs Jun2024 )

Failed to open URL 'https://sumo.dlr.de/trac.wsgi/ticket/1224?format=tab': HTTP Error 406: Not Acceptable.

Please make sure that bug 1224 exists
and that the configuration entry 'bug_system_location' points to the correct trac instance.
The current value is 'https://sumo.dlr.de/trac.wsgi/'.
(This bug was triggered by FAILING to find text in file 'rawdump' matching 'pos="25.00"')
---------- Differences in rawdump ----------
7,9c7
<             <lane id="3/1to2/1_0">
<                 <vehicle id="0" pos="350.00" speed="10.00"/>
<             </lane>
---
>             <vehicle id="0" pos="300.00" speed="10.00"/>
14,16c12
<             <lane id="3/1to2/1_0">
<                 <vehicle id="0" pos="351.00" speed="10.00"/>
<             </lane>
---
>             <vehicle id="0" pos="300.00" speed="10.00"/>
21,23c17
<             <lane id="3/1to2/1_0">
<                 <vehicle id="0" pos="352.00" speed="10.00"/>
<             </lane>
---
>             <vehicle id="0" pos="300.00" speed="10.00"/>
28,30c22
<             <lane id="3/1to2/1_0">
<                 <vehicle id="0" pos="353.00" speed="10.00"/>
<             </lane>
---
>             <vehicle id="0" pos="300.00" speed="10.00"/>
35,37c27
<             <lane id="3/1to2/1_0">
<                 <vehicle id="0" pos="354.00" speed="10.00"/>
<             </lane>
---
>             <vehicle id="0" pos="300.00" speed="10.00"/>
<truncated after showing first 30 lines>

TEST had known bugs (see #3108) on ts-sim-build-ba : bugs 3xxx ticket3108 ( Last six runs Jun2024 )

invalid vehicle counts
(This bug was triggered by FAILING to find text in file 'detector' matching 'vehicleSum="60"')
---------- Differences in detector ----------
5,8c5,8
<    <interval begin="0.00" end="993.00" id="e3_0_1i" meanTravelTime="26.60" meanOverlapTravelTime="31.06" meanSpeed="7.37" meanHaltsPerVehicle="1.40" meanTimeLoss="25.94" vehicleSum="30" meanSpeedWithin="-1.00" meanHaltsPerVehicleWithin="-1.00" meanDurationWithin="-1.00" vehicleSumWithin="0" meanIntervalSpeedWithin="-1.00" meanIntervalHaltsPerVehicleWithin="-1.00" meanIntervalDurationWithin="-1.00" meanTimeLossWithin="-1.00"/>
<    <interval begin="0.00" end="993.00" id="e3_0_2i" meanTravelTime="29.82" meanOverlapTravelTime="31.16" meanSpeed="8.04" meanHaltsPerVehicle="0.67" meanTimeLoss="26.02" vehicleSum="30" meanSpeedWithin="-1.00" meanHaltsPerVehicleWithin="-1.00" meanDurationWithin="-1.00" vehicleSumWithin="0" meanIntervalSpeedWithin="-1.00" meanIntervalHaltsPerVehicleWithin="-1.00" meanIntervalDurationWithin="-1.00" meanTimeLossWithin="-1.00"/>
<    <interval begin="0.00" end="993.00" id="e3_0_3i" meanTravelTime="32.81" meanOverlapTravelTime="33.81" meanSpeed="7.18" meanHaltsPerVehicle="0.72" meanTimeLoss="28.51" vehicleSum="60" meanSpeedWithin="-1.00" meanHaltsPerVehicleWithin="-1.00" meanDurationWithin="-1.00" vehicleSumWithin="0" meanIntervalSpeedWithin="-1.00" meanIntervalHaltsPerVehicleWithin="-1.00" meanIntervalDurationWithin="-1.00" meanTimeLossWithin="-1.00"/>
<    <interval begin="0.00" end="993.00" id="e3_0_4i" meanTravelTime="-1.00" meanOverlapTravelTime="-1.00" meanSpeed="-1.00" meanHaltsPerVehicle="-1.00" meanTimeLoss="-1.00" vehicleSum="0" meanSpeedWithin="-1.00" meanHaltsPerVehicleWithin="-1.00" meanDurationWithin="-1.00" vehicleSumWithin="0" meanIntervalSpeedWithin="-1.00" meanIntervalHaltsPerVehicleWithin="-1.00" meanIntervalDurationWithin="-1.00" meanTimeLossWithin="-1.00"/>
---
>    <interval begin="0.00" end="977.00" id="e3_0_1i" meanTravelTime="-1.00" meanOverlapTravelTime="-1.00" meanSpeed="-1.00" meanHaltsPerVehicle="-1.00" meanTimeLoss="-1.00" vehicleSum="0" meanSpeedWithin="-1.00" meanHaltsPerVehicleWithin="-1.00" meanDurationWithin="-1.00" vehicleSumWithin="0" meanIntervalSpeedWithin="-1.00" meanIntervalHaltsPerVehicleWithin="-1.00" meanIntervalDurationWithin="-1.00" meanTimeLossWithin="-1.00"/>
>    <interval begin="0.00" end="977.00" id="e3_0_2i" meanTravelTime="-1.00" meanOverlapTravelTime="-1.00" meanSpeed="-1.00" meanHaltsPerVehicle="-1.00" meanTimeLoss="-1.00" vehicleSum="0" meanSpeedWithin="-1.00" meanHaltsPerVehicleWithin="-1.00" meanDurationWithin="-1.00" vehicleSumWithin="0" meanIntervalSpeedWithin="-1.00" meanIntervalHaltsPerVehicleWithin="-1.00" meanIntervalDurationWithin="-1.00" meanTimeLossWithin="-1.00"/>
>    <interval begin="0.00" end="977.00" id="e3_0_3i" meanTravelTime="-1.00" meanOverlapTravelTime="-1.00" meanSpeed="-1.00" meanHaltsPerVehicle="-1.00" meanTimeLoss="-1.00" vehicleSum="0" meanSpeedWithin="-1.00" meanHaltsPerVehicleWithin="-1.00" meanDurationWithin="-1.00" vehicleSumWithin="0" meanIntervalSpeedWithin="-1.00" meanIntervalHaltsPerVehicleWithin="-1.00" meanIntervalDurationWithin="-1.00" meanTimeLossWithin="-1.00"/>
>    <interval begin="0.00" end="977.00" id="e3_0_4i" meanTravelTime="-1.00" meanOverlapTravelTime="-1.00" meanSpeed="-1.00" meanHaltsPerVehicle="-1.00" meanTimeLoss="-1.00" vehicleSum="0" meanSpeedWithin="-1.00" meanHaltsPerVehicleWithin="-1.00" meanDurationWithin="-1.00" vehicleSumWithin="0" meanIntervalSpeedWithin="-1.00" meanIntervalHaltsPerVehicleWithin="-1.00" meanIntervalDurationWithin="-1.00" meanTimeLossWithin="-1.00"/>

TEST had known bugs (see #10246) on ts-sim-build-ba : devices rerouting single_edge ( Last six runs Jun2024 )

consistent handling of unreachable arrivalPos
(This bug was triggered by text found in file 'errors' matching 'Error: Vehicle '2' has no valid route')
---------- Differences in errors ----------
1c1,3
< Error: Vehicle '2' has no valid route. No connection between edge 'beg' and edge 'end'.
---
> Warning: No connection between edge 'end' and edge 'end' found.
> Warning: No route for vehicle '2' found.
> Error: Vehicle '2' has no valid route.
---------- Differences in vehroutes ----------
5,8d4
<     <vehicle id="1" depart="0.00" arrival="18.00">
<         <route edges="beg"/>
<     </vehicle>
< 

2 TESTS had known bugs (see #3404) on ts-sim-build-ba :

consider via
(This bug was triggered by FAILING to find text in file 'vehroutes' matching 'route edges=.*A1toA2')
---------- Differences in vehroutes ----------
5c5
<     <vehicle id="0" depart="0.00" arrival="53.00">
---
>     <vehicle id="0" depart="0.00" arrival="40.00">
7,8c7,8
<             <route replacedOnEdge="" replacedAtTime="0.00" probability="0" edges="A0toB0 B0toC0 C0toD0 D0toD1 D1toC1 C1toB1 B1toA1 A1toA2 A2toB2 B2toC2 C2toD2 D2toD3"/>
<             <route edges="A0toB0 B0toB1 B1toA1 A1toA2 A2toB2 B2toC2 C2toD2 D2toD3"/>
---
>             <route replacedOnEdge="" reason="device.rerouting" replacedAtTime="0.00" probability="0" edges="A0toB0 B0toC0 C0toD0 D0toD1 D1toC1 C1toB1 B1toA1 A1toA2 A2toB2 B2toC2 C2toD2 D2toD3"/>
>             <route edges="A0toB0 B0toB1 B1toB2 B2toC2 C2toD2 D2toD3"/>
devices rerouting via route ( Last six runs Jun2024 )
devices rerouting via route_embedded ( Last six runs Jun2024 )

TEST had known bugs (see #14498) on ts-sim-build-ba : devices taxi bugs ticket8578 ( Last six runs Jun2024 )

idling failure
(This bug was triggered by text found in file 'errors' matching 'no next segment')
---------- Differences in errors ----------
0a1,4
> Warning: Idle taxi 'taxi' has no next segment to stop. time=0.00.
> Warning: No connection between edge 'a' and edge 'a' found.
> Error: Vehicle 'taxi' has no valid route from edge 'a' to stop edge 'a'.
> Quitting (on error).
---------- Differences in tripinfos ----------
5,11c5,6
<     <personinfo id="p1" depart="0.00" type="DEFAULT_PEDTYPE" speedFactor="1.01" duration="223.00" waitingTime="122.00" timeLoss="3.51" traveltime="80.00">
<         <stop duration="1.00" arrival="1.00" arrivalPos="200.00" actType="waiting"/>
<         <ride waitingTime="122.00" vehicle="taxi" depart="123.00" arrival="203.00" arrivalPos="100.00" duration="80.00" routeLength="250.20" timeLoss="3.51"/>
<         <stop duration="20.00" arrival="223.00" arrivalPos="100.00" actType="waiting"/>
<     </personinfo>
<     <tripinfo id="taxi" depart="0.00" departLane="a_0" departPos="5.10" departSpeed="0.00" departDelay="0.00" arrival="-1.00" arrivalLane="" arrivalPos="-1.00" arrivalSpeed="-1.00" duration="2000.00" routeLength="395.20" waitingTime="0.00" waitingCount="0" stopTime="1961.00" timeLoss="11.38" rerouteNo="4" devices="tripinfo_taxi routing_taxi taxi_taxi person_taxi" vType="taxiType" speedFactor="1.03" vaporized="">
<         <taxi customers="2" occupiedDistance="320.30" occupiedTime="34.00"/>
---
>     <tripinfo id="taxi" depart="0.00" departLane="" departPos="0.00" departSpeed="14.31" departDelay="0.00" arrival="-1.00" arrivalLane="" arrivalPos="-1.00" arrivalSpeed="-1.00" duration="0.00" routeLength="0.00" waitingTime="0.00" waitingCount="0" stopTime="0.00" timeLoss="0.00" rerouteNo="2" devices="tripinfo_taxi routing_taxi taxi_taxi" vType="taxiType" speedFactor="1.03" vaporized="end">
>         <taxi customers="0" occupiedDistance="0.00" occupiedTime="0.00"/>
13,15c8,15
<     <personinfo id="p0" depart="0.00" type="DEFAULT_PEDTYPE" speedFactor="0.94" duration="-1" waitingTime="1932.00" timeLoss="-1" traveltime="-1">
<         <ride waitingTime="11.00" vehicle="taxi" depart="11.00" arrival="79.00" arrivalPos="50.00" duration="68.00" routeLength="70.10" timeLoss="4.10"/>
<         <ride waitingTime="1921.00" vehicle="NULL" depart="-1" arrival="-1" arrivalPos="-1" duration="-1" routeLength="-1" timeLoss="-1"/>
---
>     <personinfo id="p0" depart="0.00" type="DEFAULT_PEDTYPE" speedFactor="0.94" duration="-1" waitingTime="-1" timeLoss="-1" traveltime="-1">
>         <ride waitingTime="0.00" vehicle="NULL" depart="-1" arrival="-1" arrivalPos="-1" duration="-1" routeLength="-1" timeLoss="-1"/>
>         <ride waitingTime="-1" vehicle="NULL" depart="-1" arrival="-1" arrivalPos="-1" duration="-1" routeLength="-1" timeLoss="-1"/>
>     </personinfo>
>     <personinfo id="p1" depart="0.00" type="DEFAULT_PEDTYPE" speedFactor="1.01" duration="-1" waitingTime="-1" timeLoss="-1" traveltime="-1">
>         <stop duration="-1" arrival="-0.00" arrivalPos="200.00" actType="waiting"/>
>         <ride waitingTime="-1" vehicle="NULL" depart="-1" arrival="-1" arrivalPos="-1" duration="-1" routeLength="-1" timeLoss="-1"/>
>         <stop duration="-1" arrival="-0.00" arrivalPos="100.00" actType="waiting"/>
---------- New result in exitcode ----------
1

TEST had known bugs (see #14825) on ts-sim-build-ba : devices taxi idling stop reuse_stop_laneEnd ( Last six runs Jun2024 )

end of work not recognized for non-parking idle stop
(This bug was triggered by FAILING to find text in file 'errors' matching 'reaches scheduled end of service')
---------- Differences in errors ----------
1d0
< Warning: Taxi 'trip_0' reaches scheduled end of service at time=400.00.
---------- Differences in tripinfos ----------
5,6c5,6
<     <personinfo id="p0" depart="0.00" type="DEFAULT_PEDTYPE" speedFactor="1.00" duration="228.00" waitingTime="48.00" timeLoss="20.20" traveltime="180.00">
<         <ride waitingTime="48.00" vehicle="trip_0" depart="48.00" arrival="228.00" arrivalPos="287.60" duration="180.00" routeLength="1372.08" timeLoss="20.20"/>
---
>     <personinfo id="p0" depart="0.00" type="DEFAULT_PEDTYPE" speedFactor="1.00" duration="122.00" waitingTime="34.15" timeLoss="0.00" traveltime="87.86">
>         <ride waitingTime="34.15" vehicle="trip_0" depart="34.15" arrival="122.00" arrivalPos="191.73" duration="87.86" routeLength="1221.73" timeLoss="0.00"/>
8,9c8,9
<     <personinfo id="p1" depart="0.00" type="DEFAULT_PEDTYPE" speedFactor="1.00" duration="229.00" waitingTime="48.00" timeLoss="20.20" traveltime="181.00">
<         <ride waitingTime="48.00" vehicle="trip_0" depart="48.00" arrival="229.00" arrivalPos="287.60" duration="181.00" routeLength="1372.08" timeLoss="20.20"/>
---
>     <personinfo id="p1" depart="0.00" type="DEFAULT_PEDTYPE" speedFactor="1.00" duration="122.00" waitingTime="34.15" timeLoss="0.00" traveltime="87.86">
>         <ride waitingTime="34.15" vehicle="trip_0" depart="34.15" arrival="122.00" arrivalPos="191.73" duration="87.86" routeLength="1221.73" timeLoss="0.00"/>
11,13d10
<     <tripinfo id="trip_0" depart="0.00" departLane="A0B0_1" departPos="5.10" departSpeed="0.00" departDelay="0.00" arrival="401.00" arrivalLane="A0B0_1" arrivalPos="287.60" arrivalSpeed="1.70" duration="401.00" routeLength="1868.34" waitingTime="4.00" waitingCount="2" stopTime="233.00" timeLoss="30.13" rerouteNo="2" devices="vehroute_trip_0 tripinfo_trip_0 routing_trip_0 taxi_trip_0 person_trip_0" vType="taxi" speedFactor="1.00" vaporized="">
<         <taxi customers="2" occupiedDistance="1372.08" occupiedTime="182.00"/>
<     </tripinfo>
---------- Differences in vehroutes ----------
5,6c5,6
<     <person id="p0" depart="0.00" arrival="228.00">
<         <ride from="B2C2" to="A0B0" arrivalPos="287.60" lines="taxi"/>
---
>     <person id="p0" depart="0.00" arrival="122.00">
>         <ride from="B2C2" to="A0B0" arrivalPos="191.73" lines="taxi"/>
9,10c9,10
<     <person id="p1" depart="0.00" arrival="229.00">
<         <ride from="B2C2" to="A0B0" arrivalPos="287.60" lines="taxi"/>
---
>     <person id="p1" depart="0.00" arrival="122.00">
>         <ride from="B2C2" to="A0B0" arrivalPos="191.73" lines="taxi"/>
12,21d11
< 
<     <vehicle id="trip_0" type="taxi" depart="0.00" arrival="401.00">
<         <routeDistribution>
<             <route replacedOnEdge="A0B0" reason="taxi:prepare_dispatch" replacedAtTime="0.00" probability="0" edges="A0B0 B0C0"/>
<             <route replacedOnEdge="A0B0" reason="taxi:dispatch" replacedAtTime="0.00" probability="0" edges="A0B0 B2C2 A0B0"/>
<             <route edges="A0B0 B0B1 B1B2 B2C2 C2B2 B2A2 A2A1 A1A0 A0B0"/>
<         </routeDistribution>
<         <stop lane="B2C2_1" permitted="p0 p1" actType="pickup p0 p1 (0)"/>
<         <stop lane="A0B0_1" actType="dropOff p0 p1 (0)"/>
<     </vehicle>

TEST had known bugs (see #2622) on ts-sim-build-ba : extended rerouter closingLaneReroute closingLane ( Last six runs Jun2024 )

flow should be reduced
(This bug was triggered by FAILING to find text in file 'output' matching 'time: 342.00')
---------- Differences in output ----------
5c5
< Simulation ended at time: 288.00
---
> Simulation ended at time: 288.00.

TEST had known bugs (see #2622) on ts-sim-build-ba : extended rerouter closingLaneReroute closingLane_all ( Last six runs Jun2024 )

flow should be reduced
(This bug was triggered by FAILING to find text in file 'output' matching 'time: 342.00')
---------- Differences in output ----------
5c5
< Simulation ended at time: 283.00
---
> Simulation ended at time: 283.00.

TEST had known bugs (see #2622) on ts-sim-build-ba : extended rerouter closingLaneReroute closingLane_with_rerouting ( Last six runs Jun2024 )

flow should be reduced
(This bug was triggered by FAILING to find text in file 'output' matching 'time: 342.00')
---------- Differences in output ----------
5c5
< Simulation ended at time: 130.00
---
> Simulation ended at time: 130.00.

TEST had known bugs (see #14496) on ts-sim-build-ba : extended rerouter closing_disallows_dest ( Last six runs Jun2024 )

rerouting only triggered on entering rerouter edge
(This bug was triggered by FAILING to find text in file 'errors' matching 'veh0')
---------- Differences in errors ----------
1,2d0
< Warning: Vehicle 'veh0' is not allowed on destination edge 'left'.
< Warning: No route for vehicle 'veh0' found.

TEST had known bugs (see #14208) on ts-sim-build-ba : extended rerouter person destProb ( Last six runs Jun2024 )

meandata for meso persons not working
(This bug was triggered by text found in file 'aggregated' matching '<edge id="end" arrived="0"')
---------- Differences in aggregated ----------
5,8c5,15
<     <interval begin="0.00" end="283.00" id="ed0">
<         <edge id="left" arrived="41"/>
<         <edge id="middle" arrived="29"/>
<         <edge id="right" arrived="30"/>
---
>     <interval begin="0.00" end="1358.00" id="ed0">
>         <edge id="beg" arrived="0"/>
>         <edge id="beg2left" arrived="0"/>
>         <edge id="beg2right" arrived="0"/>
>         <edge id="end" arrived="0"/>
>         <edge id="left" arrived="0"/>
>         <edge id="left2end" arrived="0"/>
>         <edge id="middle" arrived="0"/>
>         <edge id="rend" arrived="0"/>
>         <edge id="right" arrived="0"/>
>         <edge id="right2end" arrived="0"/>

TEST had known bugs (see #14208) on ts-sim-build-ba : extended rerouter person optional ( Last six runs Jun2024 )

meandata for meso persons not working
(This bug was triggered by text found in file 'aggregated' matching '<edge id="end" arrived="0"')
---------- Differences in aggregated ----------
5,8c5,15
<     <interval begin="0.00" end="283.00" id="ed0">
<         <edge id="left" arrived="41"/>
<         <edge id="middle" arrived="29"/>
<         <edge id="right" arrived="30"/>
---
>     <interval begin="0.00" end="2071.00" id="ed0">
>         <edge id="beg" arrived="0" entered="0"/>
>         <edge id="beg2left" arrived="0" entered="0"/>
>         <edge id="beg2right" arrived="0" entered="0"/>
>         <edge id="end" arrived="0" entered="0"/>
>         <edge id="left" arrived="0" entered="0"/>
>         <edge id="left2end" arrived="0" entered="0"/>
>         <edge id="middle" arrived="0" entered="0"/>
>         <edge id="rend" arrived="0" entered="0"/>
>         <edge id="right" arrived="0" entered="0"/>
>         <edge id="right2end" arrived="0" entered="0"/>

TEST had known bugs (see #14208) on ts-sim-build-ba : extended rerouter person viaProb ( Last six runs Jun2024 )

meandata for meso persons not working
(This bug was triggered by text found in file 'aggregated' matching '<edge id="end" arrived="0"')
---------- Differences in aggregated ----------
5,8c5,15
<     <interval begin="0.00" end="283.00" id="ed0">
<         <edge id="left" arrived="41"/>
<         <edge id="middle" arrived="29"/>
<         <edge id="right" arrived="30"/>
---
>     <interval begin="0.00" end="2086.00" id="ed0">
>         <edge id="beg" arrived="0" entered="0"/>
>         <edge id="beg2left" arrived="0" entered="0"/>
>         <edge id="beg2right" arrived="0" entered="0"/>
>         <edge id="end" arrived="0" entered="0"/>
>         <edge id="left" arrived="0" entered="0"/>
>         <edge id="left2end" arrived="0" entered="0"/>
>         <edge id="middle" arrived="0" entered="0"/>
>         <edge id="rend" arrived="0" entered="0"/>
>         <edge id="right" arrived="0" entered="0"/>
>         <edge id="right2end" arrived="0" entered="0"/>

TEST had known bugs (see #6928) on ts-sim-build-ba : rail rail_signal siding_deadend ( Last six runs Jun2024 )

routing error
(This bug was triggered by text found in file 'errors' matching 'Warning: No connection between edge 'gneE2' and edge '-gneE0' found')
---------- Differences in errors ----------
1c1,4
< Warning: Railway routing failure due to turn-around on short edge 'gneE2' for vehicle 't0' time=0.00.
---
> Warning: No connection between edge 'gneE2' and edge '-gneE0' found.
> Warning: No route for vehicle 't0' found.
> Error: Vehicle 't0' has no valid route.
> Quitting (on error).
---------- Differences in railsignalblocks ----------
6,23c6,7
<         <link linkIndex="0" from="-gneE1_0" to="-gneE0_0">
<             <driveWay edges="-gneE0">
<                 <forward lanes="-gneE0_0"/>
<                 <bidi lanes="gneE0_0"/>
<                 <flank lanes=""/>
<                 <protectingSwitches links=""/>
<                 <conflictLinks signals=""/>
<             </driveWay>
<         </link>
<         <link linkIndex="1" from="gneE0_0" to="gneE1_0">
<             <driveWay edges="gneE1 gneE2">
<                 <forward lanes="gneE1_0 gneE2_0"/>
<                 <bidi lanes="-gneE1_0 -gneE2_0"/>
<                 <flank lanes="-gneE3_0"/>
<                 <protectingSwitches links=""/>
<                 <conflictLinks signals=""/>
<             </driveWay>
<         </link>
---
>         <link linkIndex="0" from="-gneE1_0" to="-gneE0_0"/>
>         <link linkIndex="1" from="gneE0_0" to="gneE1_0"/>
---------- Differences in vehroutes ----------
5,12d4
<     <vehicle id="t0" type="train" depart="0.00" arrival="42.00">
<         <route edges="gneE0 gneE1 gneE3 -gneE3 -gneE1 -gneE0"/>
<     </vehicle>
< 
<     <vehicle id="t1" type="train" depart="100.00" arrival="142.00">
<         <route edges="gneE0 gneE1 gneE3 -gneE3 -gneE1 -gneE0"/>
<     </vehicle>
< 
---------- New result in exitcode ----------
1

TEST had known bugs (see #6928) on ts-sim-build-ba : rail routing reverse_on_short_start ( Last six runs Jun2024 )

routing failure
(This bug was triggered by text found in file 'errors' matching 'Warning: No connection between edge 'gneE2' and edge '-gneE0' found.')
---------- Differences in errors ----------
1c1,4
< Warning: Railway routing failure due to turn-around on short edge 'gneE2' for vehicle 't0' time=0.00.
---
> Warning: No connection between edge 'gneE2' and edge '-gneE0' found.
> Warning: No route for vehicle 't0' found.
> Error: Vehicle 't0' has no valid route.
> Quitting (on error).
---------- Differences in railsignalblocks ----------
6,23c6,7
<         <link linkIndex="0" from="-gneE1_0" to="-gneE0_0">
<             <driveWay edges="-gneE0">
<                 <forward lanes="-gneE0_0"/>
<                 <bidi lanes="gneE0_0"/>
<                 <flank lanes=""/>
<                 <protectingSwitches links=""/>
<                 <conflictLinks signals=""/>
<             </driveWay>
<         </link>
<         <link linkIndex="1" from="gneE0_0" to="gneE1_0">
<             <driveWay edges="gneE1 gneE2">
<                 <forward lanes="gneE1_0 gneE2_0"/>
<                 <bidi lanes="-gneE1_0 -gneE2_0"/>
<                 <flank lanes="-gneE3_0"/>
<                 <protectingSwitches links=""/>
<                 <conflictLinks signals=""/>
<             </driveWay>
<         </link>
---
>         <link linkIndex="0" from="-gneE1_0" to="-gneE0_0"/>
>         <link linkIndex="1" from="gneE0_0" to="gneE1_0"/>
---------- Differences in vehroutes ----------
5,8d4
<     <vehicle id="t0" type="train" depart="0.00" arrival="28.00">
<         <route edges="gneE3 -gneE3 -gneE1 -gneE0"/>
<     </vehicle>
< 
---------- New result in exitcode ----------
1