23Sep2026 - detailed test results for COMPLEX.libtraci

To reconnect the TextTest GUI to these results, run:

texttest -a complex -d /home/delphi/extraGcc/sumo/tests -reconnect /home/delphi/extraGcc/texttesttmp/extra_gcc.29Sep091459.1804078 -g

To start TextTest for these tests, run:

texttest -a complex -d /home/delphi/extraGcc/sumo/tests


libtraci: 604 tests: 591 succeeded 12 FAILED 1 known bugs

Detailed information for the tests that FAILED:

TEST FAILED on bsvusimbld : traci connection close_instance ( Last six runs Sep2026 )

---------- Differences in errors ----------
0a1,7
> Traceback (most recent call last):
>   File "/home/delphi/extraGcc/sumo/tests/../tests/complex/traci/connection/close_instance/runner.py", line 36, in <module>
>     conn = traci.connect(sumoPort, proc=sumoProcess)
>            ^^^^^^^^^^^^^
> AttributeError: module 'traci' has no attribute 'connect'. Did you mean: 'connection'?
> /usr/lib/python3.12/subprocess.py:1127: ResourceWarning: subprocess 1397090 is still running
>   _warn("subprocess %s is still running" % self.pid,

TEST FAILED on bsvusimbld : traci connection close_named ( Last six runs Sep2026 )

---------- Differences in errors ----------
0a1,5
> Traceback (most recent call last):
>   File "/home/delphi/extraGcc/sumo/tests/../tests/complex/traci/connection/close_named/runner.py", line 34, in <module>
>     conn = traci.getConnection('default')
>            ^^^^^^^^^^^^^^^^^^^
> AttributeError: module 'traci' has no attribute 'getConnection'. Did you mean: 'connection'?

TEST FAILED on bsvusimbld : traci connection multiconnect ( Last six runs Sep2026 )

---------- Differences in errors ----------
0a1,5
> Traceback (most recent call last):
>   File "/home/delphi/extraGcc/sumo/tests/../tests/complex/traci/connection/multiconnect/runner.py", line 37, in <module>
>     conns.append(traci.getConnection(str(i)))
>                  ^^^^^^^^^^^^^^^^^^^
> AttributeError: module 'traci' has no attribute 'getConnection'. Did you mean: 'connection'?
---------- Differences in output ----------
1,32d0
< step 0
< step 1
< step 2
< step 0
< step 1
< step 2
< routes ('horizontal', 'vertical', 'withTaz2')
< route count 3
< examining horizontal
< edges ('2fi', '2si', '1o', '1fi', '1si', '3o', '3fi', '3si', '4o', '4fi', '4si')
< routes ('horizontal', 'vertical', 'withTaz2')
< route count 3
< examining horizontal
< edges ('2fi', '2si', '1o', '1fi', '1si', '3o', '3fi', '3si', '4o', '4fi', '4si')
< {0: ('horizontal', 'vertical', 'withTaz2')}
< step 3
< {0: ('horizontal', 'vertical', 'withTaz2')}
< step 4
< {0: ('horizontal', 'vertical', 'withTaz2')}
< step 5
< {0: ('horizontal', 'vertical', 'withTaz2')}
< routes ('h2', 'horizontal', 'vertical', 'withTaz2')
< edges ('1o',)
< {0: ('horizontal', 'vertical', 'withTaz2')}
< step 3
< {0: ('horizontal', 'vertical', 'withTaz2')}
< step 4
< {0: ('horizontal', 'vertical', 'withTaz2')}
< step 5
<truncated after showing first 30 lines>

2 TESTS FAILED on bsvusimbld :

---------- Differences in output ----------
8c8
< Connection already closed.
---
> Not connected.
16d15
< Connection '2' is not known.
traci connection parallelConnection sumo ( Last six runs Sep2026 )
traci connection parallelConnection sumo-gui ( Last six runs Sep2026 )

TEST FAILED on bsvusimbld : traci connection tracing ( Last six runs Sep2026 )

---------- Differences in errors ----------
0a1,5
> Traceback (most recent call last):
>   File "/home/delphi/extraGcc/sumo/tests/../tests/complex/traci/connection/tracing/runner.py", line 46, in <module>
>     con = traci.getConnection()
>           ^^^^^^^^^^^^^^^^^^^
> AttributeError: module 'traci' has no attribute 'getConnection'. Did you mean: 'connection'?
---------- Differences in log ----------
3,27d2
< traci.simulation.getTime()
< traci.simulationStep()
< traci.vehicle.getParameter('veh0', 'foo')
< traci.vehicle.setParameter('veh0', 'foo', '42')
< traci.vehicle.getParameter('veh0', 'foo')
< traci.person.getParameter('ped0', 'foo')
< traci.person.setParameter('ped0', 'foo', '42')
< traci.person.getParameter('ped0', 'foo')
< traci.edge.getParameter('1o', 'foo')
< traci.edge.setParameter('1o', 'foo', '42')
< traci.edge.getParameter('1o', 'foo')
< traci.lane.getParameter('1o_0', 'foo')
< traci.lane.setParameter('1o_0', 'foo', '42')
< traci.lane.getParameter('1o_0', 'foo')
< traci.vehicletype.getParameter('pType', 'foo')
< traci.vehicletype.setParameter('pType', 'foo', '42')
< traci.vehicletype.getParameter('pType', 'foo')
< traci.route.getParameter('horizontal', 'foo')
< traci.route.setParameter('horizontal', 'foo', '42')
< traci.route.getParameter('horizontal', 'foo')
< traci.trafficlight.getParameter('0', 'foo')
< traci.trafficlight.setParameter('0', 'foo', '42')
< traci.trafficlight.getParameter('0', 'foo')
< traci.simulation.getTime()
< traci.simulationStep()
---------- Differences in output ----------
1,16d0
< step 0.0
< vehicle foo=""
< vehicle foo="42"
< person foo=""
< person foo="42"
< edge foo=""
< edge foo="42"
< lane foo=""
< lane foo="42"
< vType foo=""
< vType foo="42"
< route foo=""
< route foo="42"
< trafficlight foo=""
< trafficlight foo="42"
< step 1.0

TEST FAILED on bsvusimbld : traci misc subscription ( Last six runs Sep2026 )

---------- Differences in output ----------
742c742,774
<            52: (),
---
>            52: ('private',
>                 'emergency',
>                 'authority',
>                 'army',
>                 'vip',
>                 'pedestrian',
>                 'passenger',
>                 'hov',
>                 'taxi',
>                 'bus',
>                 'coach',
>                 'delivery',
>                 'truck',
>                 'trailer',
>                 'motorcycle',
>                 'moped',
>                 'bicycle',
>                 'evehicle',
>                 'tram',
>                 'rail_urban',
>                 'rail',
>                 'rail_electric',
>                 'rail_fast',
>                 'ship',
>                 'container',
>                 'cable_car',
>                 'subway',
<truncated after showing first 30 lines>

TEST FAILED on bsvusimbld : traci_java api ( Last six runs Sep2026 )

---------- Differences in errors ----------
1,2c1,5
< Warning: Missing yellow phase in tlLogic 'gneJ1', program '2' for tl-index 6 when switching from phase 2 to phase 0.
< Warning: Missing yellow phase in tlLogic 'gneJ1', program '2' for tl-index 6 when switching from phase 2 to phase 0.
---
> Traceback (most recent call last):
>   File "/home/delphi/extraGcc/sumo/tests/../tests/complex/traci_java/runner.py", line 42, in <module>
>     traciJar = max(files, key=os.path.getmtime)
>                ^^^^^^^^^^^^^^^^^^^^^^^^^^^^^^^^
> ValueError: max() iterable argument is empty
---------- Differences in output ----------
1,80d0
< deltaT:1.0
< findRoute result stage:
<   gneE0
<   -gneE2
<   gneE2
< findIntermodalRoute result stages:
<   gneE0
<   gneE2
< Step 1.0, tlsPhase 0 (North-South)
< Step 2.0, tlsPhase 0 (North-South)
< Step 3.0, tlsPhase 0 (North-South)
< Step 4.0, tlsPhase 0 (North-South)
< Step 5.0, tlsPhase 0 (North-South)
< Step 6.0, tlsPhase 0 (North-South)
< Step 7.0, tlsPhase 0 (North-South)
< Step 8.0, tlsPhase 0 (North-South)
< Step 9.0, tlsPhase 0 (North-South)
< Step 10.0, tlsPhase 0 (North-South)
< Step 11.0, tlsPhase 0 (North-South)
< Step 12.0, tlsPhase 0 (North-South)
< Step 13.0, tlsPhase 0 (North-South)
< Step 14.0, tlsPhase 0 (North-South)
< Step 15.0, tlsPhase 0 (North-South)
< Step 16.0, tlsPhase 0 (North-South)
< Step 17.0, tlsPhase 0 (North-South)
< Step 18.0, tlsPhase 0 (North-South)
< Step 19.0, tlsPhase 0 (North-South)
< Step 20.0, tlsPhase 0 (North-South)
< Step 21.0, tlsPhase 0 (North-South)
<truncated after showing first 30 lines>

TEST FAILED on bsvusimbld : traci_java concurrent ( Last six runs Sep2026 )

---------- Differences in errors ----------
1c1,5
< Warning: Missing yellow phase in tlLogic 'gneJ1', program '2' for tl-index 6 when switching from phase 2 to phase 0.
---
> Traceback (most recent call last):
>   File "/home/delphi/extraGcc/sumo/tests/../tests/complex/traci_java/runner.py", line 42, in <module>
>     traciJar = max(files, key=os.path.getmtime)
>                ^^^^^^^^^^^^^^^^^^^^^^^^^^^^^^^^
> ValueError: max() iterable argument is empty
---------- Differences in output ----------
1,100d0
< Thread started
< Thread started
< Thread started
< Thread started
< Thread started
< Thread started
< Thread started
< Thread started
< Thread started
< Thread started
< Thread started
< Thread started
< Thread started
< Thread started
< Thread started
< Thread started
< Thread started
< Thread started
< Thread started
< Thread started
< Thread started
< Thread started
< Thread started
< Thread started
< Thread started
< Thread started
< Thread started
< Thread started
< Thread started
<truncated after showing first 30 lines>

TEST FAILED on bsvusimbld : traci_java multiclient ( Last six runs Sep2026 )

---------- Differences in errors ----------
1c1,5
< Warning: Missing yellow phase in tlLogic 'gneJ1', program '2' for tl-index 6 when switching from phase 2 to phase 0.
---
> Traceback (most recent call last):
>   File "/home/delphi/extraGcc/sumo/tests/../tests/complex/traci_java/runner.py", line 42, in <module>
>     traciJar = max(files, key=os.path.getmtime)
>                ^^^^^^^^^^^^^^^^^^^^^^^^^^^^^^^^
> ValueError: max() iterable argument is empty
---------- Differences in output ----------
1,4652d0
< Step 0.1, tlsPhase 0 (North-South)
< Step 0.1
< Step 0.2
< Step 0.3
< Step 0.4
< Step 0.5
< Step 0.6
< Step 0.7
< Step 0.8
< Step 0.9
< Step 1.0
< Step 1.1
< Step 1.2
< Step 1.3
< Step 1.4
< Step 1.5
< Step 1.6
< Step 1.7
< Step 1.8
< Step 1.9
< Step 2.0
< Step 2.1
< Step 2.2
< Step 2.3
< Step 2.4
< Step 2.5
< Step 2.6
< Step 2.7
< Step 2.8
<truncated after showing first 30 lines>

TEST FAILED on bsvusimbld : traci_java simple ( Last six runs Sep2026 )

---------- Differences in errors ----------
1c1,5
< Warning: Missing yellow phase in tlLogic 'gneJ1', program '2' for tl-index 6 when switching from phase 2 to phase 0.
---
> Traceback (most recent call last):
>   File "/home/delphi/extraGcc/sumo/tests/../tests/complex/traci_java/runner.py", line 42, in <module>
>     traciJar = max(files, key=os.path.getmtime)
>                ^^^^^^^^^^^^^^^^^^^^^^^^^^^^^^^^
> ValueError: max() iterable argument is empty
---------- Differences in output ----------
1,4639d0
< Step 0.1, tlsPhase 0 (North-South)
< Step 0.2, tlsPhase 0 (North-South)
< Step 0.3, tlsPhase 0 (North-South)
< Step 0.4, tlsPhase 0 (North-South)
< Step 0.5, tlsPhase 0 (North-South)
< Step 0.6, tlsPhase 0 (North-South)
< Step 0.7, tlsPhase 0 (North-South)
< Step 0.8, tlsPhase 0 (North-South)
< Step 0.9, tlsPhase 0 (North-South)
< Step 1.0, tlsPhase 0 (North-South)
< Step 1.1, tlsPhase 0 (North-South)
< Step 1.2, tlsPhase 0 (North-South)
< Step 1.3, tlsPhase 0 (North-South)
< Step 1.4, tlsPhase 0 (North-South)
< Step 1.5, tlsPhase 0 (North-South)
< Step 1.6, tlsPhase 0 (North-South)
< Step 1.7, tlsPhase 0 (North-South)
< Step 1.8, tlsPhase 0 (North-South)
< Step 1.9, tlsPhase 0 (North-South)
< Step 2.0, tlsPhase 0 (North-South)
< Step 2.1, tlsPhase 0 (North-South)
< Step 2.2, tlsPhase 0 (North-South)
< Step 2.3, tlsPhase 0 (North-South)
< Step 2.4, tlsPhase 0 (North-South)
< Step 2.5, tlsPhase 0 (North-South)
< Step 2.6, tlsPhase 0 (North-South)
< Step 2.7, tlsPhase 0 (North-South)
< Step 2.8, tlsPhase 0 (North-South)
< Step 2.9, tlsPhase 0 (North-South)
<truncated after showing first 30 lines>

TEST FAILED on bsvusimbld : traci_java subscription ( Last six runs Sep2026 )

---------- Differences in errors ----------
1c1,5
< Warning: Missing yellow phase in tlLogic 'gneJ1', program '2' for tl-index 6 when switching from phase 2 to phase 0.
---
> Traceback (most recent call last):
>   File "/home/delphi/extraGcc/sumo/tests/../tests/complex/traci_java/runner.py", line 42, in <module>
>     traciJar = max(files, key=os.path.getmtime)
>                ^^^^^^^^^^^^^^^^^^^^^^^^^^^^^^^^
> ValueError: max() iterable argument is empty
---------- Differences in output ----------
1,147d0
< Step: 0
< Step: 1
< Subscription Departed vehicles: v0
< Vehicle Subscription: id=v0
<    variable id: 64  value: 14.7234
<    variable id: 66  value: TraCIPosition(0,-4.8)
< Step: 2
< Subscription Departed vehicles: v1
< Vehicle Subscription: id=v0
<    variable id: 64  value: 14.7234
<    variable id: 66  value: TraCIPosition(14.7234,-4.8)
< Vehicle Subscription: id=v1
<    variable id: 64  value: 13.033
<    variable id: 66  value: TraCIPosition(0,-4.8)
< Step: 3
< Subscription Departed vehicles: v2
< Vehicle Subscription: id=v0
<    variable id: 64  value: 14.7234
<    variable id: 66  value: TraCIPosition(29.4468,-4.8)
< Vehicle Subscription: id=v1
<    variable id: 64  value: 13.033
<    variable id: 66  value: TraCIPosition(13.033,-4.8)
< Vehicle Subscription: id=v2
<    variable id: 64  value: 11.791
<    variable id: 66  value: TraCIPosition(0,-4.8)
< Step: 4
< Subscription Departed vehicles: v3
< Vehicle Subscription: id=v0
<    variable id: 64  value: 14.7234
<truncated after showing first 30 lines>

Detailed information for the tests that had known bugs:

TEST had known bugs (see #3263) on bsvusimbld : traci vehicle moveToXY keepRoute2 ( Last six runs Sep2026 )

mapping failure
(This bug was triggered by text found in file 'output' matching 'failed')
---------- Differences in output ----------
0a1
> internal corner (inside, segment2) failed: x=198, x2=198.0,   y=1.9, y2=1.9,   lane=middle_0, lane2=middle_0, pos=102, pos2=98.0   posLat=2.0 posLat2=1.9