23Oct19rv1_3_1+0673-8c371fdc03 - detailed test results for COMPLEX

To reconnect the TextTest GUI to these results, run:

texttest -a complex -d /home/delphi/gcc/sumo/tests -reconnect /home/delphi/gcc/texttesttmp/gcc4_64.31Oct001536.23012 -g

To start TextTest for these tests, run:

texttest -a complex -d /home/delphi/gcc/sumo/tests


default: 303 tests: 262 succeeded 33 FAILED 8 known bugs

Detailed information for the tests that FAILED:

TEST FAILED on ts-sim-build-ba : netconvert osm_roundtrip ( Last six runs Oct2019 )

---------- Differences in net ----------
22c22
<     <type id="highway.secondary" priority="11" numLanes="2" speed="27.78" disallow="tram rail_urban rail rail_electric rail_fast ship" oneway="0"/>
---
>     <type id="highway.secondary" priority="11" numLanes="1" speed="27.78" disallow="tram rail_urban rail rail_electric rail_fast ship" oneway="0"/>

20 TESTS FAILED on ts-sim-build-ba :

---------- Differences in errors ----------
0a1
> Warning: The given time value 9223372036854776.00 is not a multiple of the step length 1.00 for meandata dump 'dump_60'.
sumo ToCDevice CF_situation1 ( Last six runs Oct2019 )
sumo ToCDevice CF_situation2 ( Last six runs Oct2019 )
sumo ToCDevice CF_situation3 ( Last six runs Oct2019 )
sumo ToCDevice ToC_overflow ( Last six runs Oct2019 )
sumo ToCDevice ToC_with_sampled_responseTime ( Last six runs Oct2019 )
sumo ToCDevice complete_MRM ( Last six runs Oct2019 )
sumo ToCDevice incomplete_MRM ( Last six runs Oct2019 )
sumo ToCDevice output CF_situation1 ( Last six runs Oct2019 )
sumo ToCDevice output CF_situation2 ( Last six runs Oct2019 )
sumo ToCDevice output complete_MRM ( Last six runs Oct2019 )
sumo ToCDevice output incomplete_MRM ( Last six runs Oct2019 )
sumo ToCDevice output request_MRMs ( Last six runs Oct2019 )
sumo ToCDevice output successful_ToC ( Last six runs Oct2019 )
sumo ToCDevice output two_with_different_outfile ( Last six runs Oct2019 )
sumo ToCDevice output two_with_same_outfile ( Last six runs Oct2019 )
sumo ToCDevice output two_with_same_outfile_global_option ( Last six runs Oct2019 )
sumo ToCDevice request_MRMs ( Last six runs Oct2019 )
sumo ToCDevice start_automated ( Last six runs Oct2019 )
sumo ToCDevice start_manual ( Last six runs Oct2019 )
sumo ToCDevice successful_ToC ( Last six runs Oct2019 )

TEST FAILED on ts-sim-build-ba : sumo output one_vehicle ( Last six runs Oct2019 )

---------- Differences in errors ----------
0a1,12
> Warning: The given time value 0.10 is not a multiple of the step length 1.00 (in e2Detector 'e2_3/1to2/1_0').
> Warning: The given time value 0.10 is not a multiple of the step length 1.00 (in e3Detector 'e3_3/1to2/1_0').
> Warning: The given time value 0.10 is not a multiple of the step length 1.00 for meandata dump 'dump_15'.
> Warning: The given time value 0.10 is not a multiple of the step length 1.00 for meandata dump 'dump_15'.
> Warning: The given time value 0.10 is not a multiple of the step length 1.00 (in e2Detector 'e2_3/1to2/1_0').
> Warning: The given time value 0.10 is not a multiple of the step length 1.00 (in e3Detector 'e3_3/1to2/1_0').
> Warning: The given time value 0.10 is not a multiple of the step length 1.00 for meandata dump 'dump_15'.
> Warning: The given time value 0.10 is not a multiple of the step length 1.00 for meandata dump 'dump_15'.
> Warning: The given time value 0.10 is not a multiple of the step length 1.00 (in e2Detector 'e2_3/1to2/1_0').
> Warning: The given time value 0.10 is not a multiple of the step length 1.00 (in e3Detector 'e3_3/1to2/1_0').
> Warning: The given time value 0.10 is not a multiple of the step length 1.00 for meandata dump 'dump_15'.
> Warning: The given time value 0.10 is not a multiple of the step length 1.00 for meandata dump 'dump_15'.
---------- Differences in output ----------
10c10
< success 0.1 ['--step-length', '.1', '--end', '100'] ['3/1to2/1_0']
---
> failed 0.1 ['--step-length', '.1', '--end', '100'] 3/1to2/1_0 (71.3, 71.4) [('e2', 10.0), ('e3', -1.0), ('edge', -1.0), ('lane', -1.0)]
12c12
< success 1 ['--step-length', '.1', '--end', '100'] ['3/1to2/1_0']
---
> failed 1 ['--step-length', '.1', '--end', '100'] 3/1to2/1_0 (72.0, 73.0) [('e2', 10.0), ('e3', -1.0), ('edge', -1.0), ('lane', -1.0)]
14c14
< success 10 ['--step-length', '.1', '--end', '100'] ['3/1to2/1_0']
---
> failed 10 ['--step-length', '.1', '--end', '100'] 3/1to2/1_0 (80.0, 90.0) [('e2', 10.0), ('e3', -1.0), ('edge', -1.0), ('lane', -1.0)]
18c18
< success 0.1 ['--step-length', '.1', '--end', '1000'] ['3/1to2/1_0']
---
> failed 0.1 ['--step-length', '.1', '--end', '1000'] 3/1to2/1_0 (71.3, 71.4) [('e2', 10.0), ('e3', -1.0), ('edge', -1.0), ('lane', -1.0)]
20c20
< success 1 ['--step-length', '.1', '--end', '1000'] ['3/1to2/1_0']
---
> failed 1 ['--step-length', '.1', '--end', '1000'] 3/1to2/1_0 (72.0, 73.0) [('e2', 10.0), ('e3', -1.0), ('edge', -1.0), ('lane', -1.0)]
22c22
< success 10 ['--step-length', '.1', '--end', '1000'] ['3/1to2/1_0']
---
> failed 10 ['--step-length', '.1', '--end', '1000'] 3/1to2/1_0 (80.0, 90.0) [('e2', 10.0), ('e3', -1.0), ('edge', -1.0), ('lane', -1.0)]
24c24
< success 100 ['--step-length', '.1', '--end', '1000'] ['3/1to2/1_0']
---
> failed 100 ['--step-length', '.1', '--end', '1000'] 3/1to2/1_0 (100.0, 200.0) [('e1', -1.0), ('e2', 10.0), ('e3', -1.0), ('edge', -1.0), ('lane', -1.0)]
34c34
< success 0.1 ['--step-length', '1', '--end', '100'] ['3/1to2/1_0']
<truncated after showing first 30 lines>

TEST FAILED on ts-sim-build-ba : sumo output teleport ( Last six runs Oct2019 )

---------- Differences in errors ----------
32a33,56
> Warning: The given time value 0.10 is not a multiple of the step length 1.00 (in e2Detector 'e2_2/1to1/1_0').
> Warning: The given time value 0.10 is not a multiple of the step length 1.00 (in e3Detector 'e3_2/1to1/1_0').
> Warning: The given time value 0.10 is not a multiple of the step length 1.00 for meandata dump 'dump_15'.
> Warning: The given time value 0.10 is not a multiple of the step length 1.00 for meandata dump 'dump_15'.
> Warning: The given time value 0.10 is not a multiple of the step length 1.00 (in e2Detector 'e2_2/1to1/1_0').
> Warning: The given time value 0.10 is not a multiple of the step length 1.00 (in e3Detector 'e3_2/1to1/1_0').
> Warning: The given time value 0.10 is not a multiple of the step length 1.00 (in e2Detector 'e2_1/1to0/1_0').
> Warning: The given time value 0.10 is not a multiple of the step length 1.00 (in e3Detector 'e3_1/1to0/1_0').
> Warning: The given time value 0.10 is not a multiple of the step length 1.00 for meandata dump 'dump_15'.
> Warning: The given time value 0.10 is not a multiple of the step length 1.00 for meandata dump 'dump_15'.
> Warning: The given time value 0.10 is not a multiple of the step length 1.00 (in e2Detector 'e2_2/1to1/1_0').
> Warning: The given time value 0.10 is not a multiple of the step length 1.00 (in e3Detector 'e3_2/1to1/1_0').
> Warning: The given time value 0.10 is not a multiple of the step length 1.00 for meandata dump 'dump_15'.
> Warning: The given time value 0.10 is not a multiple of the step length 1.00 for meandata dump 'dump_15'.
> Warning: The given time value 0.10 is not a multiple of the step length 1.00 (in e2Detector 'e2_2/1to1/1_0').
> Warning: The given time value 0.10 is not a multiple of the step length 1.00 (in e3Detector 'e3_2/1to1/1_0').
> Warning: The given time value 0.10 is not a multiple of the step length 1.00 (in e2Detector 'e2_1/1to0/1_0').
> Warning: The given time value 0.10 is not a multiple of the step length 1.00 (in e3Detector 'e3_1/1to0/1_0').
> Warning: The given time value 0.10 is not a multiple of the step length 1.00 for meandata dump 'dump_15'.
> Warning: The given time value 0.10 is not a multiple of the step length 1.00 for meandata dump 'dump_15'.
> Warning: The given time value 0.10 is not a multiple of the step length 1.00 (in e2Detector 'e2_2/1to1/1_0').
> Warning: The given time value 0.10 is not a multiple of the step length 1.00 (in e3Detector 'e3_2/1to1/1_0').
> Warning: The given time value 0.10 is not a multiple of the step length 1.00 for meandata dump 'dump_15'.
> Warning: The given time value 0.10 is not a multiple of the step length 1.00 for meandata dump 'dump_15'.
35a60,65
> Warning: The given time value 0.10 is not a multiple of the step length 1.00 (in e2Detector 'e2_2/1to1/1_0').
> Warning: The given time value 0.10 is not a multiple of the step length 1.00 (in e3Detector 'e3_2/1to1/1_0').
> Warning: The given time value 0.10 is not a multiple of the step length 1.00 (in e2Detector 'e2_1/1to0/1_0').
> Warning: The given time value 0.10 is not a multiple of the step length 1.00 (in e3Detector 'e3_1/1to0/1_0').
<truncated after showing first 30 lines>
---------- Differences in output ----------
2c2
< success ['--step-length', '.1', '--end', '51'] ['2/1to1/1_0']
---
> success 0.1 ['--step-length', '.1', '--end', '51'] ['2/1to1/1_0']
4c4
< success ['--step-length', '.1', '--end', '51'] ['2/1to1/1_0', '1/1to0/1_0']
---
> success 0.1 ['--step-length', '.1', '--end', '51'] ['2/1to1/1_0', '1/1to0/1_0']
6c6
< success ['--step-length', '.1', '--end', '51'] ['2/1to1/1_0']
---
> success 1 ['--step-length', '.1', '--end', '51'] ['2/1to1/1_0']
8c8
< success ['--step-length', '.1', '--end', '51'] ['2/1to1/1_0', '1/1to0/1_0']
---
> success 1 ['--step-length', '.1', '--end', '51'] ['2/1to1/1_0', '1/1to0/1_0']
10c10
< success ['--step-length', '.1', '--end', '51'] ['2/1to1/1_0']
---
> success 10 ['--step-length', '.1', '--end', '51'] ['2/1to1/1_0']
12c12
< success ['--step-length', '.1', '--end', '51'] ['2/1to1/1_0', '1/1to0/1_0']
---
> success 10 ['--step-length', '.1', '--end', '51'] ['2/1to1/1_0', '1/1to0/1_0']
14c14
< success ['--step-length', '.1', '--end', '51'] ['2/1to1/1_0']
---
> success 100 ['--step-length', '.1', '--end', '51'] ['2/1to1/1_0']
16c16
< success ['--step-length', '.1', '--end', '51'] ['2/1to1/1_0', '1/1to0/1_0']
<truncated after showing first 30 lines>

TEST FAILED on ts-sim-build-ba : sumo output teleport_multihop ( Last six runs Oct2019 )

---------- Differences in errors ----------
24a25,48
> Warning: The given time value 0.10 is not a multiple of the step length 1.00 (in e2Detector 'e2_2/1to1/1_0').
> Warning: The given time value 0.10 is not a multiple of the step length 1.00 (in e3Detector 'e3_2/1to1/1_0').
> Warning: The given time value 0.10 is not a multiple of the step length 1.00 for meandata dump 'dump_15'.
> Warning: The given time value 0.10 is not a multiple of the step length 1.00 for meandata dump 'dump_15'.
> Warning: The given time value 0.10 is not a multiple of the step length 1.00 (in e2Detector 'e2_2/1to1/1_0').
> Warning: The given time value 0.10 is not a multiple of the step length 1.00 (in e3Detector 'e3_2/1to1/1_0').
> Warning: The given time value 0.10 is not a multiple of the step length 1.00 (in e2Detector 'e2_1/1to0/1_0').
> Warning: The given time value 0.10 is not a multiple of the step length 1.00 (in e3Detector 'e3_1/1to0/1_0').
> Warning: The given time value 0.10 is not a multiple of the step length 1.00 for meandata dump 'dump_15'.
> Warning: The given time value 0.10 is not a multiple of the step length 1.00 for meandata dump 'dump_15'.
> Warning: The given time value 0.10 is not a multiple of the step length 1.00 (in e2Detector 'e2_2/1to1/1_0').
> Warning: The given time value 0.10 is not a multiple of the step length 1.00 (in e3Detector 'e3_2/1to1/1_0').
> Warning: The given time value 0.10 is not a multiple of the step length 1.00 for meandata dump 'dump_15'.
> Warning: The given time value 0.10 is not a multiple of the step length 1.00 for meandata dump 'dump_15'.
> Warning: The given time value 0.10 is not a multiple of the step length 1.00 (in e2Detector 'e2_2/1to1/1_0').
> Warning: The given time value 0.10 is not a multiple of the step length 1.00 (in e3Detector 'e3_2/1to1/1_0').
> Warning: The given time value 0.10 is not a multiple of the step length 1.00 (in e2Detector 'e2_1/1to0/1_0').
> Warning: The given time value 0.10 is not a multiple of the step length 1.00 (in e3Detector 'e3_1/1to0/1_0').
> Warning: The given time value 0.10 is not a multiple of the step length 1.00 for meandata dump 'dump_15'.
> Warning: The given time value 0.10 is not a multiple of the step length 1.00 for meandata dump 'dump_15'.
> Warning: The given time value 0.10 is not a multiple of the step length 1.00 (in e2Detector 'e2_2/1to1/1_0').
> Warning: The given time value 0.10 is not a multiple of the step length 1.00 (in e3Detector 'e3_2/1to1/1_0').
> Warning: The given time value 0.10 is not a multiple of the step length 1.00 for meandata dump 'dump_15'.
> Warning: The given time value 0.10 is not a multiple of the step length 1.00 for meandata dump 'dump_15'.
27a52,57
> Warning: The given time value 0.10 is not a multiple of the step length 1.00 (in e2Detector 'e2_2/1to1/1_0').
> Warning: The given time value 0.10 is not a multiple of the step length 1.00 (in e3Detector 'e3_2/1to1/1_0').
> Warning: The given time value 0.10 is not a multiple of the step length 1.00 (in e2Detector 'e2_1/1to0/1_0').
> Warning: The given time value 0.10 is not a multiple of the step length 1.00 (in e3Detector 'e3_1/1to0/1_0').
<truncated after showing first 30 lines>
---------- Differences in output ----------
34c34
< success 0.1 ['--step-length', '.1', '--end', '1000'] 2/1to1/1_0 (230.0, 230.1) [('e2', 9.99), ('e3', 10.0), ('edge', 9.99), ('lane', 9.99)]
---
> failed 0.1 ['--step-length', '.1', '--end', '1000'] 2/1to1/1_0 (149.0, 149.1) [('e2', 9.99), ('e3', 10.0), ('edge', 10.0), ('lane', 10.0)]
36c36
< success 0.1 ['--step-length', '.1', '--end', '1000'] 1/1to0/1_0 (148.1, 148.2) [('e2', 9.99), ('e3', 10.0), ('edge', 9.99), ('lane', 9.99)]
---
> failed 0.1 ['--step-length', '.1', '--end', '1000'] 2/1to1/1_0 (149.0, 149.1) [('e2', 9.99), ('e3', 10.0), ('edge', 10.0), ('lane', 10.0)]
38c38
< success 1 ['--step-length', '.1', '--end', '1000'] 2/1to1/1_0 (230.0, 231.0) [('e2', 9.99), ('e3', 10.0), ('edge', 9.99), ('lane', 9.99)]
---
> failed 1 ['--step-length', '.1', '--end', '1000'] 2/1to1/1_0 (149.0, 150.0) [('e2', 9.93), ('e3', 10.0), ('edge', 10.0), ('lane', 10.0)]
40c40
< success 1 ['--step-length', '.1', '--end', '1000'] 1/1to0/1_0 (148.0, 149.0) [('e2', 9.91), ('e3', 10.0), ('edge', 9.91), ('lane', 9.91)]
---
> failed 1 ['--step-length', '.1', '--end', '1000'] 2/1to1/1_0 (149.0, 150.0) [('e2', 9.93), ('e3', 10.0), ('edge', 10.0), ('lane', 10.0)]
42c42
< success 10 ['--step-length', '.1', '--end', '1000'] 2/1to1/1_0 (230.0, 240.0) [('e2', 9.42), ('e3', 9.9), ('edge', 9.42), ('lane', 9.42)]
---
> failed 10 ['--step-length', '.1', '--end', '1000'] 2/1to1/1_0 (140.0, 150.0) [('e2', 9.99), ('e3', 10.0), ('edge', 10.0), ('lane', 10.0)]
44c44
< success 10 ['--step-length', '.1', '--end', '1000'] 1/1to0/1_0 (140.0, 150.0) [('e2', 9.96), ('e3', 9.99), ('edge', 9.96), ('lane', 9.96)]
---
> failed 10 ['--step-length', '.1', '--end', '1000'] 2/1to1/1_0 (140.0, 150.0) [('e2', 9.99), ('e3', 10.0), ('edge', 10.0), ('lane', 10.0)]
46c46
< success 100 ['--step-length', '.1', '--end', '1000'] 2/1to1/1_0 (200.0, 300.0) [('e1', 10.0), ('e2', 9.22), ('e3', 5.71), ('edge', 9.22), ('lane', 9.22)]
---
> failed 100 ['--step-length', '.1', '--end', '1000'] 2/1to1/1_0 (100.0, 200.0) [('e1', 10.0), ('e2', 7.95), ('e3', 10.0), ('edge', 10.0), ('lane', 10.0)]
48c48
< success 100 ['--step-length', '.1', '--end', '1000'] 1/1to0/1_0 (100.0, 200.0) [('e1', 9.53), ('e2', 5.82), ('e3', 6.93), ('edge', 5.82), ('lane', 5.82)]
<truncated after showing first 30 lines>

TEST FAILED on ts-sim-build-ba : sumo output teleport_multihop_newDefaults ( Last six runs Oct2019 )

---------- Differences in errors ----------
24a25,48
> Warning: The given time value 0.10 is not a multiple of the step length 1.00 (in e2Detector 'e2_2/1to1/1_0').
> Warning: The given time value 0.10 is not a multiple of the step length 1.00 (in e3Detector 'e3_2/1to1/1_0').
> Warning: The given time value 0.10 is not a multiple of the step length 1.00 for meandata dump 'dump_15'.
> Warning: The given time value 0.10 is not a multiple of the step length 1.00 for meandata dump 'dump_15'.
> Warning: The given time value 0.10 is not a multiple of the step length 1.00 (in e2Detector 'e2_2/1to1/1_0').
> Warning: The given time value 0.10 is not a multiple of the step length 1.00 (in e3Detector 'e3_2/1to1/1_0').
> Warning: The given time value 0.10 is not a multiple of the step length 1.00 (in e2Detector 'e2_1/1to0/1_0').
> Warning: The given time value 0.10 is not a multiple of the step length 1.00 (in e3Detector 'e3_1/1to0/1_0').
> Warning: The given time value 0.10 is not a multiple of the step length 1.00 for meandata dump 'dump_15'.
> Warning: The given time value 0.10 is not a multiple of the step length 1.00 for meandata dump 'dump_15'.
> Warning: The given time value 0.10 is not a multiple of the step length 1.00 (in e2Detector 'e2_2/1to1/1_0').
> Warning: The given time value 0.10 is not a multiple of the step length 1.00 (in e3Detector 'e3_2/1to1/1_0').
> Warning: The given time value 0.10 is not a multiple of the step length 1.00 for meandata dump 'dump_15'.
> Warning: The given time value 0.10 is not a multiple of the step length 1.00 for meandata dump 'dump_15'.
> Warning: The given time value 0.10 is not a multiple of the step length 1.00 (in e2Detector 'e2_2/1to1/1_0').
> Warning: The given time value 0.10 is not a multiple of the step length 1.00 (in e3Detector 'e3_2/1to1/1_0').
> Warning: The given time value 0.10 is not a multiple of the step length 1.00 (in e2Detector 'e2_1/1to0/1_0').
> Warning: The given time value 0.10 is not a multiple of the step length 1.00 (in e3Detector 'e3_1/1to0/1_0').
> Warning: The given time value 0.10 is not a multiple of the step length 1.00 for meandata dump 'dump_15'.
> Warning: The given time value 0.10 is not a multiple of the step length 1.00 for meandata dump 'dump_15'.
> Warning: The given time value 0.10 is not a multiple of the step length 1.00 (in e2Detector 'e2_2/1to1/1_0').
> Warning: The given time value 0.10 is not a multiple of the step length 1.00 (in e3Detector 'e3_2/1to1/1_0').
> Warning: The given time value 0.10 is not a multiple of the step length 1.00 for meandata dump 'dump_15'.
> Warning: The given time value 0.10 is not a multiple of the step length 1.00 for meandata dump 'dump_15'.
27a52,57
> Warning: The given time value 0.10 is not a multiple of the step length 1.00 (in e2Detector 'e2_2/1to1/1_0').
> Warning: The given time value 0.10 is not a multiple of the step length 1.00 (in e3Detector 'e3_2/1to1/1_0').
> Warning: The given time value 0.10 is not a multiple of the step length 1.00 (in e2Detector 'e2_1/1to0/1_0').
> Warning: The given time value 0.10 is not a multiple of the step length 1.00 (in e3Detector 'e3_1/1to0/1_0').
<truncated after showing first 30 lines>
---------- Differences in output ----------
18c18
< success 0.1 ['--step-length', '.1', '--end', '100'] ['2/1to1/1_0']
---
> failed 0.1 ['--step-length', '.1', '--end', '100'] 2/1to1/1_0 (76.2, 76.3) [('e2', 10.49), ('e3', 10.35), ('edge', 10.49), ('lane', 10.49)]
20c20
< success 0.1 ['--step-length', '.1', '--end', '100'] ['2/1to1/1_0', '1/1to0/1_0']
---
> failed 0.1 ['--step-length', '.1', '--end', '100'] 2/1to1/1_0 (76.2, 76.3) [('e2', 10.49), ('e3', 10.35), ('edge', 10.49), ('lane', 10.49)]
22c22
< success 1 ['--step-length', '.1', '--end', '100'] ['2/1to1/1_0']
---
> failed 1 ['--step-length', '.1', '--end', '100'] 2/1to1/1_0 (76.0, 77.0) [('e2', 10.39), ('e3', 10.35), ('edge', 10.39), ('lane', 10.39)]
24c24
< success 1 ['--step-length', '.1', '--end', '100'] ['2/1to1/1_0', '1/1to0/1_0']
---
> failed 1 ['--step-length', '.1', '--end', '100'] 2/1to1/1_0 (76.0, 77.0) [('e2', 10.39), ('e3', 10.35), ('edge', 10.39), ('lane', 10.39)]
26c26
< success 10 ['--step-length', '.1', '--end', '100'] ['2/1to1/1_0']
---
> failed 10 ['--step-length', '.1', '--end', '100'] 2/1to1/1_0 (70.0, 80.0) [('e2', 10.42), ('e3', 10.25), ('edge', 10.42), ('lane', 10.42)]
28c28
< success 10 ['--step-length', '.1', '--end', '100'] ['2/1to1/1_0', '1/1to0/1_0']
---
> failed 10 ['--step-length', '.1', '--end', '100'] 2/1to1/1_0 (70.0, 80.0) [('e2', 10.42), ('e3', 10.25), ('edge', 10.42), ('lane', 10.42)]
30c30
< success 100 ['--step-length', '.1', '--end', '100'] ['2/1to1/1_0']
---
> failed 100 ['--step-length', '.1', '--end', '100'] 2/1to1/1_0 (0.0, 100.0) [('e1', 10.27), ('e2', 10.24), ('e3', 9.59), ('edge', 10.24), ('lane', 10.24)]
32c32
< success 100 ['--step-length', '.1', '--end', '100'] ['2/1to1/1_0', '1/1to0/1_0']
<truncated after showing first 30 lines>

TEST FAILED on ts-sim-build-ba : sumo output two_same_vehicles ( Last six runs Oct2019 )

---------- Differences in errors ----------
0a1,12
> Warning: The given time value 0.10 is not a multiple of the step length 1.00 (in e2Detector 'e2_3/1to2/1_0').
> Warning: The given time value 0.10 is not a multiple of the step length 1.00 (in e3Detector 'e3_3/1to2/1_0').
> Warning: The given time value 0.10 is not a multiple of the step length 1.00 for meandata dump 'dump_15'.
> Warning: The given time value 0.10 is not a multiple of the step length 1.00 for meandata dump 'dump_15'.
> Warning: The given time value 0.10 is not a multiple of the step length 1.00 (in e2Detector 'e2_3/1to2/1_0').
> Warning: The given time value 0.10 is not a multiple of the step length 1.00 (in e3Detector 'e3_3/1to2/1_0').
> Warning: The given time value 0.10 is not a multiple of the step length 1.00 for meandata dump 'dump_15'.
> Warning: The given time value 0.10 is not a multiple of the step length 1.00 for meandata dump 'dump_15'.
> Warning: The given time value 0.10 is not a multiple of the step length 1.00 (in e2Detector 'e2_3/1to2/1_0').
> Warning: The given time value 0.10 is not a multiple of the step length 1.00 (in e3Detector 'e3_3/1to2/1_0').
> Warning: The given time value 0.10 is not a multiple of the step length 1.00 for meandata dump 'dump_15'.
> Warning: The given time value 0.10 is not a multiple of the step length 1.00 for meandata dump 'dump_15'.
---------- Differences in output ----------
10c10
< success 0.1 ['--step-length', '.1', '--end', '100'] ['3/1to2/1_0']
---
> failed 0.1 ['--step-length', '.1', '--end', '100'] 3/1to2/1_0 (75.4, 75.5) [('e2', 10.0), ('e3', -1.0), ('edge', -1.0), ('lane', -1.0)]
12c12
< success 1 ['--step-length', '.1', '--end', '100'] ['3/1to2/1_0']
---
> failed 1 ['--step-length', '.1', '--end', '100'] 3/1to2/1_0 (76.0, 77.0) [('e2', 10.0), ('e3', -1.0), ('edge', -1.0), ('lane', -1.0)]
14c14
< success 10 ['--step-length', '.1', '--end', '100'] ['3/1to2/1_0']
---
> failed 10 ['--step-length', '.1', '--end', '100'] 3/1to2/1_0 (80.0, 90.0) [('e2', 10.0), ('e3', -1.0), ('edge', -1.0), ('lane', -1.0)]
18c18
< success 0.1 ['--step-length', '.1', '--end', '1000'] ['3/1to2/1_0']
---
> failed 0.1 ['--step-length', '.1', '--end', '1000'] 3/1to2/1_0 (75.4, 75.5) [('e2', 10.0), ('e3', -1.0), ('edge', -1.0), ('lane', -1.0)]
20c20
< success 1 ['--step-length', '.1', '--end', '1000'] ['3/1to2/1_0']
---
> failed 1 ['--step-length', '.1', '--end', '1000'] 3/1to2/1_0 (76.0, 77.0) [('e2', 10.0), ('e3', -1.0), ('edge', -1.0), ('lane', -1.0)]
22c22
< success 10 ['--step-length', '.1', '--end', '1000'] ['3/1to2/1_0']
---
> failed 10 ['--step-length', '.1', '--end', '1000'] 3/1to2/1_0 (80.0, 90.0) [('e2', 10.0), ('e3', -1.0), ('edge', -1.0), ('lane', -1.0)]
24c24
< success 100 ['--step-length', '.1', '--end', '1000'] ['3/1to2/1_0']
---
> failed 100 ['--step-length', '.1', '--end', '1000'] 3/1to2/1_0 (100.0, 200.0) [('e1', -1.0), ('e2', 10.0), ('e3', -1.0), ('edge', -1.0), ('lane', -1.0)]
34c34
< success 0.1 ['--step-length', '1', '--end', '100'] ['3/1to2/1_0']
<truncated after showing first 30 lines>

TEST FAILED on ts-sim-build-ba : sumo output two_vehicles_diff_length ( Last six runs Oct2019 )

---------- Differences in errors ----------
0a1,12
> Warning: The given time value 0.10 is not a multiple of the step length 1.00 (in e2Detector 'e2_3/1to2/1_0').
> Warning: The given time value 0.10 is not a multiple of the step length 1.00 (in e3Detector 'e3_3/1to2/1_0').
> Warning: The given time value 0.10 is not a multiple of the step length 1.00 for meandata dump 'dump_15'.
> Warning: The given time value 0.10 is not a multiple of the step length 1.00 for meandata dump 'dump_15'.
> Warning: The given time value 0.10 is not a multiple of the step length 1.00 (in e2Detector 'e2_3/1to2/1_0').
> Warning: The given time value 0.10 is not a multiple of the step length 1.00 (in e3Detector 'e3_3/1to2/1_0').
> Warning: The given time value 0.10 is not a multiple of the step length 1.00 for meandata dump 'dump_15'.
> Warning: The given time value 0.10 is not a multiple of the step length 1.00 for meandata dump 'dump_15'.
> Warning: The given time value 0.10 is not a multiple of the step length 1.00 (in e2Detector 'e2_3/1to2/1_0').
> Warning: The given time value 0.10 is not a multiple of the step length 1.00 (in e3Detector 'e3_3/1to2/1_0').
> Warning: The given time value 0.10 is not a multiple of the step length 1.00 for meandata dump 'dump_15'.
> Warning: The given time value 0.10 is not a multiple of the step length 1.00 for meandata dump 'dump_15'.
---------- Differences in output ----------
10c10
< success 0.1 ['--step-length', '.1', '--end', '100'] ['3/1to2/1_0']
---
> failed 0.1 ['--step-length', '.1', '--end', '100'] 3/1to2/1_0 (76.4, 76.5) [('e2', 10.0), ('e3', -1.0), ('edge', -1.0), ('lane', -1.0)]
12c12
< success 1 ['--step-length', '.1', '--end', '100'] ['3/1to2/1_0']
---
> failed 1 ['--step-length', '.1', '--end', '100'] 3/1to2/1_0 (77.0, 78.0) [('e2', 10.0), ('e3', -1.0), ('edge', -1.0), ('lane', -1.0)]
14c14
< success 10 ['--step-length', '.1', '--end', '100'] ['3/1to2/1_0']
---
> failed 10 ['--step-length', '.1', '--end', '100'] 3/1to2/1_0 (80.0, 90.0) [('e2', 10.0), ('e3', -1.0), ('edge', -1.0), ('lane', -1.0)]
18c18
< success 0.1 ['--step-length', '.1', '--end', '1000'] ['3/1to2/1_0']
---
> failed 0.1 ['--step-length', '.1', '--end', '1000'] 3/1to2/1_0 (76.4, 76.5) [('e2', 10.0), ('e3', -1.0), ('edge', -1.0), ('lane', -1.0)]
20c20
< success 1 ['--step-length', '.1', '--end', '1000'] ['3/1to2/1_0']
---
> failed 1 ['--step-length', '.1', '--end', '1000'] 3/1to2/1_0 (77.0, 78.0) [('e2', 10.0), ('e3', -1.0), ('edge', -1.0), ('lane', -1.0)]
22c22
< success 10 ['--step-length', '.1', '--end', '1000'] ['3/1to2/1_0']
---
> failed 10 ['--step-length', '.1', '--end', '1000'] 3/1to2/1_0 (80.0, 90.0) [('e2', 10.0), ('e3', -1.0), ('edge', -1.0), ('lane', -1.0)]
24c24
< success 100 ['--step-length', '.1', '--end', '1000'] ['3/1to2/1_0']
---
> failed 100 ['--step-length', '.1', '--end', '1000'] 3/1to2/1_0 (100.0, 200.0) [('e1', -1.0), ('e2', 10.0), ('e3', -1.0), ('edge', -1.0), ('lane', -1.0)]
34c34
< success 0.1 ['--step-length', '1', '--end', '100'] ['3/1to2/1_0']
<truncated after showing first 30 lines>

TEST FAILED on ts-sim-build-ba : sumo output two_vehicles_diff_speed ( Last six runs Oct2019 )

---------- Differences in errors ----------
0a1,12
> Warning: The given time value 0.10 is not a multiple of the step length 1.00 (in e2Detector 'e2_3/1to2/1_0').
> Warning: The given time value 0.10 is not a multiple of the step length 1.00 (in e3Detector 'e3_3/1to2/1_0').
> Warning: The given time value 0.10 is not a multiple of the step length 1.00 for meandata dump 'dump_15'.
> Warning: The given time value 0.10 is not a multiple of the step length 1.00 for meandata dump 'dump_15'.
> Warning: The given time value 0.10 is not a multiple of the step length 1.00 (in e2Detector 'e2_3/1to2/1_0').
> Warning: The given time value 0.10 is not a multiple of the step length 1.00 (in e3Detector 'e3_3/1to2/1_0').
> Warning: The given time value 0.10 is not a multiple of the step length 1.00 for meandata dump 'dump_15'.
> Warning: The given time value 0.10 is not a multiple of the step length 1.00 for meandata dump 'dump_15'.
> Warning: The given time value 0.10 is not a multiple of the step length 1.00 (in e2Detector 'e2_3/1to2/1_0').
> Warning: The given time value 0.10 is not a multiple of the step length 1.00 (in e3Detector 'e3_3/1to2/1_0').
> Warning: The given time value 0.10 is not a multiple of the step length 1.00 for meandata dump 'dump_15'.
> Warning: The given time value 0.10 is not a multiple of the step length 1.00 for meandata dump 'dump_15'.
---------- Differences in output ----------
0a1,48
> Loading configuration... done.
> failed 0.1 ['--step-length', '.1', '--end', '51'] 3/1to2/1_0 (38.4, 38.5) [('e2', 9.6), ('e3', 9.5), ('edge', 9.6), ('lane', 9.6)]
> Loading configuration... done.
> failed 1 ['--step-length', '.1', '--end', '51'] 3/1to2/1_0 (38.0, 39.0) [('e2', 9.64), ('e3', 9.5), ('edge', 9.64), ('lane', 9.64)]
> Loading configuration... done.
> failed 10 ['--step-length', '.1', '--end', '51'] 3/1to2/1_0 (30.0, 40.0) [('e2', 9.86), ('e3', 9.5), ('edge', 9.86), ('lane', 9.86)]
> Loading configuration... done.
> failed 100 ['--step-length', '.1', '--end', '51'] 3/1to2/1_0 (0.0, 51.0) [('e2', 9.62), ('e3', 9.5), ('edge', 9.62), ('lane', 9.62)]
> Loading configuration... done.
> failed 0.1 ['--step-length', '.1', '--end', '100'] 3/1to2/1_0 (38.4, 38.5) [('e2', 9.6), ('e3', 9.5), ('edge', 9.6), ('lane', 9.6)]
> Loading configuration... done.
> failed 1 ['--step-length', '.1', '--end', '100'] 3/1to2/1_0 (38.0, 39.0) [('e2', 9.64), ('e3', 9.5), ('edge', 9.64), ('lane', 9.64)]
> Loading configuration... done.
> failed 10 ['--step-length', '.1', '--end', '100'] 3/1to2/1_0 (30.0, 40.0) [('e2', 9.86), ('e3', 9.5), ('edge', 9.86), ('lane', 9.86)]
> Loading configuration... done.
> failed 100 ['--step-length', '.1', '--end', '100'] 3/1to2/1_0 (0.0, 100.0) [('e1', 9.5), ('e2', 9.53), ('e3', 9.5), ('edge', 9.47), ('lane', 9.47)]
> Loading configuration... done.
> failed 0.1 ['--step-length', '.1', '--end', '1000'] 3/1to2/1_0 (38.4, 38.5) [('e2', 9.6), ('e3', 9.5), ('edge', 9.6), ('lane', 9.6)]
> Loading configuration... done.
> failed 1 ['--step-length', '.1', '--end', '1000'] 3/1to2/1_0 (38.0, 39.0) [('e2', 9.64), ('e3', 9.5), ('edge', 9.64), ('lane', 9.64)]
> Loading configuration... done.
> failed 10 ['--step-length', '.1', '--end', '1000'] 3/1to2/1_0 (30.0, 40.0) [('e2', 9.86), ('e3', 9.5), ('edge', 9.86), ('lane', 9.86)]
> Loading configuration... done.
> failed 100 ['--step-length', '.1', '--end', '1000'] 3/1to2/1_0 (0.0, 100.0) [('e1', 9.5), ('e2', 9.53), ('e3', 9.5), ('edge', 9.47), ('lane', 9.47)]
> Loading configuration... done.
> failed 0.1 ['--step-length', '1', '--end', '51'] 3/1to2/1_0 (39.0, 40.0) [('e2', 9.6), ('e3', 9.5), ('edge', 9.6), ('lane', 9.6)]
> Loading configuration... done.
> failed 1 ['--step-length', '1', '--end', '51'] 3/1to2/1_0 (39.0, 40.0) [('e2', 9.6), ('e3', 9.5), ('edge', 9.6), ('lane', 9.6)]
> Loading configuration... done.
<truncated after showing first 30 lines>

TEST FAILED on ts-sim-build-ba : traas api ( Last six runs Oct2019 )

---------- Differences in errors ----------
2a3
> Received null repsonse for command 203 149. (Maybe you need to use do_job_set?)

TEST FAILED on ts-sim-build-ba : traas webservice ( Last six runs Oct2019 )

---------- Differences in errors ----------
0a1,65
> WARNUNG: Using deprecated META-INF/services mechanism with non-standard property: javax.xml.soap.MetaFactory. Property javax.xml.soap.SAAJMetaFactory should be used instead.
> WARNUNG: Using deprecated META-INF/services mechanism with non-standard property: javax.xml.soap.MetaFactory. Property javax.xml.soap.SAAJMetaFactory should be used instead.
> WARNUNG: Using deprecated META-INF/services mechanism with non-standard property: javax.xml.soap.MetaFactory. Property javax.xml.soap.SAAJMetaFactory should be used instead.
> WARNUNG: Using deprecated META-INF/services mechanism with non-standard property: javax.xml.soap.MetaFactory. Property javax.xml.soap.SAAJMetaFactory should be used instead.
> WARNUNG: Using deprecated META-INF/services mechanism with non-standard property: javax.xml.soap.MetaFactory. Property javax.xml.soap.SAAJMetaFactory should be used instead.
> WARNUNG: Using deprecated META-INF/services mechanism with non-standard property: javax.xml.soap.MetaFactory. Property javax.xml.soap.SAAJMetaFactory should be used instead.
> WARNUNG: Using deprecated META-INF/services mechanism with non-standard property: javax.xml.soap.MetaFactory. Property javax.xml.soap.SAAJMetaFactory should be used instead.
> WARNUNG: Using deprecated META-INF/services mechanism with non-standard property: javax.xml.soap.MetaFactory. Property javax.xml.soap.SAAJMetaFactory should be used instead.
> Okt. 23, 2019 12:17:08 VORM. com.sun.xml.ws.server.sei.TieHandler createResponse
> SCHWERWIEGEND: null
> java.lang.NullPointerException
> 	at de.tudresden.sumo.util.Sumo.start_ws(Sumo.java:140)
> 	at de.tudresden.ws.ServiceImpl.start(ServiceImpl.java:66)
> 	at java.base/jdk.internal.reflect.NativeMethodAccessorImpl.invoke0(Native Method)
> 	at java.base/jdk.internal.reflect.NativeMethodAccessorImpl.invoke(NativeMethodAccessorImpl.java:62)
> 	at java.base/jdk.internal.reflect.DelegatingMethodAccessorImpl.invoke(DelegatingMethodAccessorImpl.java:43)
> 	at java.base/java.lang.reflect.Method.invoke(Method.java:566)
> 	at com.sun.xml.ws.util.Trampoline.invoke(MethodUtil.java:82)
> 	at java.base/jdk.internal.reflect.NativeMethodAccessorImpl.invoke0(Native Method)
> 	at java.base/jdk.internal.reflect.NativeMethodAccessorImpl.invoke(NativeMethodAccessorImpl.java:62)
> 	at java.base/jdk.internal.reflect.DelegatingMethodAccessorImpl.invoke(DelegatingMethodAccessorImpl.java:43)
> 	at java.base/java.lang.reflect.Method.invoke(Method.java:566)
> 	at com.sun.xml.ws.util.MethodUtil.invoke(MethodUtil.java:107)
> 	at com.sun.xml.ws.api.server.MethodUtil.invoke(MethodUtil.java:64)
> 	at com.sun.xml.ws.api.server.InstanceResolver$1.invoke(InstanceResolver.java:250)
> 	at com.sun.xml.ws.server.InvokerTube$2.invoke(InvokerTube.java:149)
> 	at com.sun.xml.ws.server.sei.SEIInvokerTube.processRequest(SEIInvokerTube.java:88)
> 	at com.sun.xml.ws.api.pipe.Fiber.__doRun(Fiber.java:1136)
> 	at com.sun.xml.ws.api.pipe.Fiber._doRun(Fiber.java:1050)
<truncated after showing first 30 lines>
---------- Differences in output ----------
6c6
< Die WSDL und die zugeh÷rigen Metadaten werden heruntergeladen
---
> Die WSDL und die zugeh├Ârigen Metadaten werden heruntergeladen

TEST FAILED on ts-sim-build-ba : traffic_lights loop_flow ( Last six runs Oct2019 )

---------- Differences in errors ----------
0a1,512
> Warning: The given time value 9223372036854776.00 is not a multiple of the step length 1.00 for meandata dump 'edges'.
> Warning: The given time value 9223372036854776.00 is not a multiple of the step length 1.00 for meandata dump 'lanes'.
> Warning: The given time value 9223372036854776.00 is not a multiple of the step length 1.00 for meandata dump 'edgesEmissions'.
> Warning: The given time value 9223372036854776.00 is not a multiple of the step length 1.00 for meandata dump 'lanesEmissions'.
> Warning: The given time value 9223372036854776.00 is not a multiple of the step length 1.00 for meandata dump 'edges'.
> Warning: The given time value 9223372036854776.00 is not a multiple of the step length 1.00 for meandata dump 'lanes'.
> Warning: The given time value 9223372036854776.00 is not a multiple of the step length 1.00 for meandata dump 'edgesEmissions'.
> Warning: The given time value 9223372036854776.00 is not a multiple of the step length 1.00 for meandata dump 'lanesEmissions'.
> Warning: The given time value 9223372036854776.00 is not a multiple of the step length 1.00 for meandata dump 'edges'.
> Warning: The given time value 9223372036854776.00 is not a multiple of the step length 1.00 for meandata dump 'lanes'.
> Warning: The given time value 9223372036854776.00 is not a multiple of the step length 1.00 for meandata dump 'edgesEmissions'.
> Warning: The given time value 9223372036854776.00 is not a multiple of the step length 1.00 for meandata dump 'lanesEmissions'.
> Warning: The given time value 9223372036854776.00 is not a multiple of the step length 1.00 for meandata dump 'edges'.
> Warning: The given time value 9223372036854776.00 is not a multiple of the step length 1.00 for meandata dump 'lanes'.
> Warning: The given time value 9223372036854776.00 is not a multiple of the step length 1.00 for meandata dump 'edgesEmissions'.
> Warning: The given time value 9223372036854776.00 is not a multiple of the step length 1.00 for meandata dump 'lanesEmissions'.
> Warning: The given time value 9223372036854776.00 is not a multiple of the step length 1.00 for meandata dump 'edges'.
> Warning: The given time value 9223372036854776.00 is not a multiple of the step length 1.00 for meandata dump 'lanes'.
> Warning: The given time value 9223372036854776.00 is not a multiple of the step length 1.00 for meandata dump 'edgesEmissions'.
> Warning: The given time value 9223372036854776.00 is not a multiple of the step length 1.00 for meandata dump 'lanesEmissions'.
> Warning: The given time value 9223372036854776.00 is not a multiple of the step length 1.00 for meandata dump 'edges'.
> Warning: The given time value 9223372036854776.00 is not a multiple of the step length 1.00 for meandata dump 'lanes'.
> Warning: The given time value 9223372036854776.00 is not a multiple of the step length 1.00 for meandata dump 'edgesEmissions'.
> Warning: The given time value 9223372036854776.00 is not a multiple of the step length 1.00 for meandata dump 'lanesEmissions'.
> Warning: The given time value 9223372036854776.00 is not a multiple of the step length 1.00 for meandata dump 'edges'.
> Warning: The given time value 9223372036854776.00 is not a multiple of the step length 1.00 for meandata dump 'lanes'.
> Warning: The given time value 9223372036854776.00 is not a multiple of the step length 1.00 for meandata dump 'edgesEmissions'.
> Warning: The given time value 9223372036854776.00 is not a multiple of the step length 1.00 for meandata dump 'lanesEmissions'.
> Warning: The given time value 9223372036854776.00 is not a multiple of the step length 1.00 for meandata dump 'edges'.
<truncated after showing first 30 lines>

TEST FAILED on ts-sim-build-ba : tutorial city_mobil ( Last six runs Oct2019 )

---------- Differences in errors ----------
0a1,2
> Warning: The given time value 9223372036854776.00 is not a multiple of the step length 1.00 for meandata dump 'dump'.
> Warning: The given time value 9223372036854776.00 is not a multiple of the step length 1.00 for meandata dump 'dump'.
---------- Differences in output ----------
4c4
< waiting time (max, mean, dev): True True True
---
> waiting time (max, mean, dev): False True False
22c22
< waiting time (max, mean, dev): True True True
---
> waiting time (max, mean, dev): False True False

TEST FAILED on ts-sim-build-ba : tutorial san_pablo_dam ( Last six runs Oct2019 )

---------- Differences in errors ----------
1,79c1,18
< Warning: Value of tau=0.904054570616 in car following model 'carFollowing-Krauss' lower than simulation step size may cause collisions
< Warning: Teleporting vehicle '912'; collision with vehicle '911', lane='1to7_0', gap=-0.16, time=26957.00 stage=move.
< Warning: Vehicle '912' ends teleporting on edge '7to8', time 26980.00.
< Warning: Teleporting vehicle '852'; collision with vehicle '851', lane='1to7_0', gap=-0.03, time=27110.00 stage=move.
< Warning: Vehicle '852' ends teleporting on edge '7to8', time 27110.00.
< Warning: Teleporting vehicle '938'; collision with vehicle '937', lane='1to7_0', gap=-0.05, time=27137.00 stage=move.
< Warning: Vehicle '938' ends teleporting on edge '7to8', time 27144.00.
< Warning: Teleporting vehicle '949'; collision with vehicle '948', lane='1to7_0', gap=-0.01, time=27226.00 stage=move.
< Warning: Vehicle '949' ends teleporting on edge '7to8', time 27226.00.
< Warning: Teleporting vehicle '872'; collision with vehicle '871', lane='1to7_0', gap=-0.00, time=27352.00 stage=move.
< Warning: Vehicle '872' ends teleporting on edge '7to8', time 27352.00.
< Warning: Teleporting vehicle '929'; collision with vehicle '928', lane='1to7_0', gap=-0.02, time=27379.00 stage=move.
< Warning: Vehicle '929' ends teleporting on edge '7to8', time 27379.00.
< Warning: Teleporting vehicle '977'; collision with vehicle '976', lane='1to7_0', gap=-0.10, time=27383.00 stage=move.
< Warning: Vehicle '977' ends teleporting on edge '7to8', time 27383.00.
< Warning: Teleporting vehicle '926'; collision with vehicle '925', lane='1to7_0', gap=-0.02, time=27387.00 stage=move.
< Warning: Vehicle '926' ends teleporting on edge '7to8', time 27388.00.
< Warning: Teleporting vehicle '982'; collision with vehicle '981', lane='1to7_0', gap=-0.11, time=27406.00 stage=move.
< Warning: Vehicle '982' ends teleporting on edge '7to8', time 27411.00.
< Warning: Teleporting vehicle '919'; collision with vehicle '918', lane='1to7_0', gap=-0.16, time=27417.00 stage=move.
< Warning: Vehicle '919' ends teleporting on edge '7to8', time 27418.00.
< Warning: Teleporting vehicle '958'; collision with vehicle '957', lane='1to7_0', gap=-0.01, time=27423.00 stage=move.
< Warning: Vehicle '958' ends teleporting on edge '7to8', time 27423.00.
< Warning: Teleporting vehicle '1007'; collision with vehicle '1006', lane='1to7_0', gap=-0.00, time=27428.00 stage=move.
< Warning: Teleporting vehicle '1030'; collision with vehicle '1029', lane='1to7_0', gap=-0.07, time=27429.00 stage=move.
< Warning: Vehicle '1007' ends teleporting on edge '7to8', time 27429.00.
< Warning: Vehicle '1030' ends teleporting on edge '7to8', time 27437.00.
< Warning: Teleporting vehicle '1089'; collision with vehicle '1088', lane='1to7_0', gap=-0.05, time=27482.00 stage=move.
< Warning: Vehicle '1089' ends teleporting on edge '7to8', time 27482.00.
<truncated after showing first 30 lines>
---------- Differences in output ----------
61,286d60
< Loading configuration... done.
< #### yields rmse: 1161.5321
< # simulation with: vMax:23.000 aMax:2.000 bMax:3.000 lCar:5.000 sigA:0.500 tTau:2.500
< Loading configuration... done.
< #### yields rmse: 321.8880
< # simulation with: vMax:23.037 aMax:1.241 bMax:3.235 lCar:4.784 sigA:0.100 tTau:1.100
< Loading configuration... done.
< #### yields rmse: 87.9460
< # simulation with: vMax:23.043 aMax:2.239 bMax:3.279 lCar:4.744 sigA:0.100 tTau:1.100
< Loading configuration... done.
< #### yields rmse: 86.5421
< # simulation with: vMax:23.101 aMax:2.244 bMax:3.645 lCar:4.409 sigA:0.100 tTau:1.100
< Loading configuration... done.
< #### yields rmse: 90.1311
< # simulation with: vMax:23.291 aMax:2.239 bMax:3.240 lCar:4.744 sigA:0.100 tTau:1.100
< Loading configuration... done.
< #### yields rmse: 86.9809
< # simulation with: vMax:22.945 aMax:2.274 bMax:2.866 lCar:4.482 sigA:0.100 tTau:1.100
< Loading configuration... done.
< #### yields rmse: 88.4326
< # simulation with: vMax:23.043 aMax:2.239 bMax:3.279 lCar:4.744 sigA:-0.077 tTau:1.277
< Loading configuration... done.
< #### yields rmse: 85.2090
< # simulation with: vMax:22.960 aMax:2.319 bMax:3.242 lCar:5.160 sigA:0.100 tTau:1.100
< Loading configuration... done.
< #### yields rmse: 79.1584
< # simulation with: vMax:22.887 aMax:2.385 bMax:3.099 lCar:5.629 sigA:0.100 tTau:1.100
< Loading configuration... done.
< #### yields rmse: 68.9712
<truncated after showing first 30 lines>
---------- Differences in results ----------
6,79d5
< 23.000 2.000 3.000 5.000 1.500 1.500 1161.53206027
< 23.000 2.000 3.000 5.000 0.500 2.500 321.888011822
< 23.037 1.241 3.235 4.784 0.100 1.100 87.9459779998
< 23.043 2.239 3.279 4.744 0.100 1.100 86.5420793074
< 23.101 2.244 3.645 4.409 0.100 1.100 90.13106821
< 23.291 2.239 3.240 4.744 0.100 1.100 86.9808538177
< 22.945 2.274 2.866 4.482 0.100 1.100 88.4326458656
< 23.043 2.239 3.279 4.744 -0.077 1.277 85.2089548362
< 22.960 2.319 3.242 5.160 0.100 1.100 79.1583887736
< 22.887 2.385 3.099 5.629 0.100 1.100 68.971208791
< 22.891 2.426 2.878 6.075 0.100 1.100 65.1921181665
< 22.549 2.542 3.094 6.346 0.100 1.100 62.5333267206
< 22.835 2.726 3.347 6.611 0.100 1.100 63.8786397834
< 22.569 2.324 3.170 6.403 0.041 1.053 64.8360860592
< 22.476 2.993 2.909 6.260 0.100 1.100 63.6058813565
< 22.549 2.542 3.094 6.346 0.255 0.904 27687.5396788
< 22.549 2.542 3.094 6.346 0.100 1.600 203.105904424
< 22.274 2.374 2.917 6.684 0.100 1.100 64.5588459734
< 22.425 2.530 3.273 6.225 0.100 1.100 62.9929757374
< 22.622 2.488 3.053 6.270 0.100 1.100 63.1665708754
< 22.549 2.542 3.094 6.346 0.051 1.061 64.6478853192
< 22.549 2.542 3.094 6.346 0.100 1.225 93.2607360628
< 22.520 2.571 3.056 6.317 0.100 1.100 62.6161137238
< 22.552 2.547 3.095 6.348 0.225 1.100 100.12985119
< 22.584 2.589 3.113 6.335 0.097 1.100 62.8700781782
< 22.477 2.466 3.060 6.404 0.100 1.100 63.2332633877
< 22.569 2.592 3.112 6.371 0.100 1.100 63.5179785788
< 22.522 2.533 3.137 6.311 0.100 1.100 62.5720511663
< 22.566 2.526 3.085 6.327 0.100 1.100 62.5138161772
<truncated after showing first 30 lines>

Detailed information for the tests that had known bugs:

TEST had known bugs (bug 1691 (NONEXISTENT)) on ts-sim-build-ba : netconvert dlr-navteq_roundtrip ( Last six runs Oct2019 )

Failed to open URL 'https://sumo.dlr.de/trac.wsgi/ticket/1691?format=tab': HTTP Error 404: Not Found.

Please make sure that bug 1691 exists
and that the configuration entry 'bug_system_location' points to the correct trac instance.
The current value is 'https://sumo.dlr.de/trac.wsgi/'.
(This bug was triggered by text found in file 'net' matching '.*')
---------- Differences in net ----------
4c4
< <net version="1.1" junctionCornerDetail="5" limitTurnSpeed="5.50" xmlns:xsi="http://www.w3.org/2001/XMLSchema-instance" xsi:noNamespaceSchemaLocation="http://sumo.dlr.de/xsd/net_file.xsd">
---
> <net version="1.3" junctionCornerDetail="5" limitTurnSpeed="5.50" xmlns:xsi="http://www.w3.org/2001/XMLSchema-instance" xsi:noNamespaceSchemaLocation="http://sumo.dlr.de/xsd/net_file.xsd">
2768c2768
<     <connection from="-26816553" to="26816541" fromLane="0" toLane="0" via=":294168098_5_0" dir="L" state="="/>
---
>     <connection from="-26816553" to="26816541" fromLane="0" toLane="0" via=":294168098_5_0" dir="l" state="="/>
2975c2975
<     <connection from="27445116" to="27445117" fromLane="0" toLane="0" via=":294169338_0_0" dir="s" state="="/>
---
>     <connection from="27445116" to="27445117" fromLane="0" toLane="0" via=":294169338_0_0" dir="R" state="="/>
3216c3216
<     <connection from=":294168098_5" to="26816541" fromLane="0" toLane="0" dir="L" state="M"/>
---
>     <connection from=":294168098_5" to="26816541" fromLane="0" toLane="0" dir="l" state="M"/>
3241c3241
<     <connection from=":294169338_0" to="27445117" fromLane="0" toLane="0" dir="s" state="M"/>
---
>     <connection from=":294169338_0" to="27445117" fromLane="0" toLane="0" dir="R" state="M"/>

TEST had known bugs (bug 1691 (NONEXISTENT)) on ts-sim-build-ba : netconvert matsim_roundtrip ( Last six runs Oct2019 )

Failed to open URL 'https://sumo.dlr.de/trac.wsgi/ticket/1691?format=tab': HTTP Error 404: Not Found.

Please make sure that bug 1691 exists
and that the configuration entry 'bug_system_location' points to the correct trac instance.
The current value is 'https://sumo.dlr.de/trac.wsgi/'.
(This bug was triggered by text found in file 'net' matching '.*')
---------- Differences in net ----------
4c4
< <net version="1.1" junctionCornerDetail="5" limitTurnSpeed="5.50" xmlns:xsi="http://www.w3.org/2001/XMLSchema-instance" xsi:noNamespaceSchemaLocation="http://sumo.dlr.de/xsd/net_file.xsd">
---
> <net version="1.3" junctionCornerDetail="5" limitTurnSpeed="5.50" xmlns:xsi="http://www.w3.org/2001/XMLSchema-instance" xsi:noNamespaceSchemaLocation="http://sumo.dlr.de/xsd/net_file.xsd">
880c880
<         <lane id=":294830184_7_0" index="0" speed="5.56" length="14.38" shape="915.07,462.77 918.06,460.17 921.14,459.20 924.29,459.87 927.52,462.17"/>
---
>         <lane id=":294830184_7_0" index="0" speed="5.56" length="13.52" shape="915.07,462.77 917.74,460.95 921.19,460.22 924.69,460.61 927.52,462.17"/>
3708c3708
<     <connection from="-26004787#2" to="26004966#2" fromLane="0" toLane="0" via=":283722837_12_0" dir="s" state="="/>
---
>     <connection from="-26004787#2" to="26004966#2" fromLane="0" toLane="0" via=":283722837_12_0" dir="R" state="="/>
3724c3724
<     <connection from="-26004868#0" to="-5198585#7" fromLane="0" toLane="0" via=":283719736_13_0" dir="R" state="m"/>
---
>     <connection from="-26004868#0" to="-5198585#7" fromLane="0" toLane="0" via=":283719736_13_0" dir="r" state="m"/>
3747c3747
<     <connection from="-26816553" to="-26816413#1" fromLane="0" toLane="0" via=":294168098_4_0" dir="R" state="="/>
---
>     <connection from="-26816553" to="-26816413#1" fromLane="0" toLane="0" via=":294168098_4_0" dir="r" state="="/>
4015c4015
<     <connection from="26816413#1" to="26816553" fromLane="0" toLane="0" via=":294168098_1_0" dir="L" state="="/>
---
>     <connection from="26816413#1" to="26816553" fromLane="0" toLane="0" via=":294168098_1_0" dir="l" state="="/>
4023c4023
<     <connection from="26816590#0" to="26816590#1" fromLane="0" toLane="0" via=":294169338_0_0" dir="s" state="="/>
---
>     <connection from="26816590#0" to="26816590#1" fromLane="0" toLane="0" via=":294169338_0_0" dir="R" state="="/>
4037c4037
<     <connection from="26843038#0" to="26843038#1" fromLane="0" toLane="0" via=":294830184_7_0" dir="L" state="="/>
<truncated after showing first 30 lines>

TEST had known bugs (#4727) on ts-sim-build-ba : traci ContextSubscriptionFilters leadFollow carFollowing ( Last six runs Oct2019 )

#4727
(This bug was triggered by text found in file 'output' matching '.')
---------- Differences in output ----------
4d3
< lead_straight
6d4
< [002] Context results for vehicle 'ego':
7a6
> [002] Context results for vehicle 'ego':
9d7
< [003] Context results for vehicle 'ego':
10a9
> [003] Context results for vehicle 'ego':
12d10
< [004] Context results for vehicle 'ego':
13a12
> [004] Context results for vehicle 'ego':
15d13
< [005] Context results for vehicle 'ego':
16a15
> [005] Context results for vehicle 'ego':
18d16
< [006] Context results for vehicle 'ego':
19a18
> [006] Context results for vehicle 'ego':
21d19
< [007] Context results for vehicle 'ego':
22a21
> [007] Context results for vehicle 'ego':
24d22
< [008] Context results for vehicle 'ego':
25a24
> [008] Context results for vehicle 'ego':
<truncated after showing first 30 lines>

2 TESTS had known bugs (#4727) on ts-sim-build-ba :

#4727
(This bug was triggered by text found in file 'output' matching '.')
---------- Differences in output ----------
4a5
> follow_straight
7d7
< follow_straight
9a10
> follow_straight
12d12
< follow_straight
14a15
> follow_straight
17d17
< follow_straight
19a20
> follow_straight
22d22
< follow_straight
24a25
> follow_straight
27d27
< follow_straight
29a30
> follow_straight
32d32
< follow_straight
34a35
> follow_straight
37d37
< follow_straight
39a40
> follow_straight
<truncated after showing first 30 lines>
traci ContextSubscriptionFilters leadFollow laneChangeLeft ( Last six runs Oct2019 )
traci ContextSubscriptionFilters leadFollow laneChangeRight ( Last six runs Oct2019 )

TEST had known bugs (#4727) on ts-sim-build-ba : traci ContextSubscriptionFilters leadFollow laneChangeNeighbors ( Last six runs Oct2019 )

#4727
(This bug was triggered by text found in file 'output' matching '.')
---------- Differences in output ----------
4,5d3
< follow_straight
< follow_right
6a5,7
> follow_right
> follow_straight
> lead_left
9d9
< lead_left
11,12d10
< follow_straight
< follow_right
13a12,14
> follow_right
> follow_straight
> lead_left
16d16
< lead_left
18,19d17
< follow_straight
< follow_right
20a19,21
> follow_right
> follow_straight
> lead_left
23d23
< lead_left
25,26d24
< follow_straight
< follow_right
<truncated after showing first 30 lines>

TEST had known bugs (see #3263) on ts-sim-build-ba : traci pythonApi moveToXY keepRoute2 ( Last six runs Oct2019 )

mapping failure
(This bug was triggered by text found in file 'output' matching 'failed')
---------- Differences in output ----------
0a1,2
> internal corner (inside, segment2) failed: x=198, x2=198.0,   y=1.9, y2=1.9,   lane=middle_0, lane2=middle_0, pos=102, pos2=98.0   posLat=2.0 posLat2=1.9
> internal corner (outside, far) failed: x=203, x2=203.0,   y=-4, y2=-4.0,   lane=, lane2=middle_0, pos=-1073741824.0, pos2=100.0   posLat=-1073741824.0 posLat2=-1.41421356237

TEST had known bugs (see #5383) on ts-sim-build-ba : traci pythonApi moveToXY permissions ( Last six runs Oct2019 )

mapping failure
(This bug was triggered by text found in file 'output' matching 'failed')
---------- Differences in output ----------
0a1,2
> shifted to left lane (permissions) failed: mode=2 x=40, x2=40.0,   y=-1.5, y2=-1.5,   lane=beg_1, lane2=, pos=40, pos2=-1073741824.0   posLat=0.0 posLat2=-1073741824.0
> right lane (ignore permissions) failed: mode=6 x=40, x2=40.0,   y=-1.6, y2=-1.6,   lane=beg_0, lane2=, pos=40, pos2=-1073741824.0   posLat=0.0 posLat2=-1073741824.0