25Sep22rv1_14_1+1238-9b9cc23eb8f - detailed test results for COMPLEX

To reconnect the TextTest GUI to these results, run:

texttest -a complex -d /home/delphi/gcc/sumo/tests -reconnect /home/delphi/gcc/texttesttmp/gcc4_64.30Sep001913.3994844 -g

To start TextTest for these tests, run:

texttest -a complex -d /home/delphi/gcc/sumo/tests


default: 674 tests: 661 succeeded 10 known bugs 3 FAILED

Detailed information for the tests that FAILED:

TEST FAILED on ts-sim-build-ba : sumo protobuf ( Last six runs Sep2022 )

---------- Differences in errors ----------
0a1,58
> Traceback (most recent call last):
>   File "/home/delphi/gcc/sumo/tools/xml/protobuf2xml.py", line 130, in <module>
>     main()
>   File "/home/delphi/gcc/sumo/tools/xml/protobuf2xml.py", line 124, in main
>     module = xml2protobuf.generateProto(attrFinder.tagAttrs, attrFinder.depthTags,
>   File "/home/delphi/gcc/sumo/tools/xml/xml2protobuf.py", line 187, in generateProto
>     return importlib.import_module("%s_pb2" % base)
>   File "/usr/lib/python3.8/importlib/__init__.py", line 127, in import_module
>     return _bootstrap._gcd_import(name[level:], package, level)
>   File "<frozen importlib._bootstrap>", line 1014, in _gcd_import
>   File "<frozen importlib._bootstrap>", line 991, in _find_and_load
>   File "<frozen importlib._bootstrap>", line 975, in _find_and_load_unlocked
>   File "<frozen importlib._bootstrap>", line 671, in _load_unlocked
>   File "<frozen importlib._bootstrap_external>", line 848, in exec_module
>   File "<frozen importlib._bootstrap>", line 219, in _call_with_frames_removed
>   File "/home/delphi/gcc/texttesttmp/gcc4_64.25Sep001802.405070/complex/sumo/protobuf/trajectories_pb2.py", line 32, in <module>
>     _descriptor.EnumValueDescriptor(
>   File "/home/delphi/.local/lib/python3.8/site-packages/google/protobuf/descriptor.py", line 755, in __new__
>     _message.Message._CheckCalledFromGeneratedFile()
> TypeError: Descriptors cannot not be created directly.
> If this call came from a _pb2.py file, your generated code is out of date and must be regenerated with protoc >= 3.19.0.
> If you cannot immediately regenerate your protos, some other possible workarounds are:
>  1. Downgrade the protobuf package to 3.20.x or lower.
>  2. Set PROTOCOL_BUFFERS_PYTHON_IMPLEMENTATION=python (but this will use pure-Python parsing and will be much slower).
> 
> More information: https://developers.google.com/protocol-buffers/docs/news/2022-05-06#python-updates
> Traceback (most recent call last):
>   File "/home/delphi/gcc/sumo/tools/xml/xml2protobuf.py", line 210, in <module>
>     main()
<truncated after showing first 30 lines>
---------- Differences in output ----------
1,5d0
< --- 
< +++ 
< -
< -<trajectories xmlns:xsi="http://www.w3.org/2001/XMLSchema-instance" xsi:noNamespaceSchemaLocation="http://sumo.dlr.de/xsd/amitran/trajectories.xsd" timeStepSize="1000">
< +<trajectories timeStepSize="1000">

TEST FAILED on ts-sim-build-ba : tutorial city_mobil taxi_cyber ( Last six runs Sep2022 )

---------- Differences in errors ----------
1,2c1
< Warning: Person 'v-7.5p0' is jammed on edge 'cyber6to7', time=644.00.
< Warning: Person 'v7.6p2' is jammed on edge 'cyber6to7', time=648.00.
---
> Warning: Person 'v-7.6p0' is jammed on edge 'cyber6to7', time=681.00.

TEST FAILED on ts-sim-build-ba : tutorial gtfs plain ( Last six runs Sep2022 )

---------- Differences in errors ----------
19,20d18
< Warning: Unused state in tlLogic '7465967492', program '0' at tl-index 0
< Warning: 6 total messages of type: Unused state in tlLogic '%', program '%' at tl-index %
33a32,33
> Warning: Unused state in tlLogic '7465967492', program '0' at tl-index 0
> Warning: 6 total messages of type: Unused state in tlLogic '%', program '%' at tl-index %
---------- Differences in gtfs_additional ----------
811,819c811,812
<     <route id="62_257252" edges="171419641 319292807">
<         <stop busStop="171419641:225.64" duration="10" until="0"/>
<         <stop busStop="319292807:97.87" duration="10" until="60"/>
<         <stop busStop="319292807:460.19" duration="10" until="120"/>
<         <stop busStop="319292807:844.67" duration="10" until="180"/>
<         <stop busStop="319292807:1137.13" duration="10" until="240"/>
<         <stop busStop="319292807:1477.14" duration="10" until="300"/>
<         <stop busStop="319292807:1926.71" duration="10" until="360"/>
<         <stop busStop="319292807:2090.24" duration="10" until="420"/>
---
>     <route id="S45_92570" edges="31094941">
>         <stop busStop="31094941:102.98" duration="10" until="0"/>
821,829c814,815
<     <route id="62_257260" edges="171419641 319292807">
<         <stop busStop="171419641:225.64" duration="10" until="0"/>
<         <stop busStop="319292807:97.87" duration="10" until="60"/>
<         <stop busStop="319292807:460.19" duration="10" until="120"/>
<         <stop busStop="319292807:844.67" duration="10" until="180"/>
<         <stop busStop="319292807:1137.13" duration="10" until="240"/>
<         <stop busStop="319292807:1477.14" duration="10" until="300"/>
<         <stop busStop="319292807:1926.71" duration="10" until="360"/>
<         <stop busStop="319292807:2090.24" duration="10" until="420"/>
---
>     <route id="S45_92708" edges="31094941">
>         <stop busStop="31094941:102.98" duration="10" until="0"/>
831,834c817,821
<     <route id="62_257282.trimmed" edges="319292807">
<         <stop busStop="319292807:1477.14" duration="10" until="0"/>
<         <stop busStop="319292807:1926.71" duration="10" until="60"/>
<truncated after showing first 30 lines>
---------- Differences in gtfs_routes ----------
5,178d4
<     <vehicle id="S46_92988.0" route="92988" type="train" depart="14630" line="S46_92988"/>
<     <vehicle id="S46_92990.0" route="92988" type="train" depart="15830" line="S46_92988"/>
<     <vehicle id="S46_92929.0" route="92929" type="train" depart="17030" line="S46_92929"/>
<     <vehicle id="S46_92930.0" route="92929" type="train" depart="18230" line="S46_92929"/>
<     <vehicle id="S46_92931.0" route="92929" type="train" depart="19430" line="S46_92929"/>
<     <vehicle id="S46_92932.0" route="92929" type="train" depart="20630" line="S46_92929"/>
<     <vehicle id="S46_92933.0" route="92929" type="train" depart="21830" line="S46_92929"/>
<     <vehicle id="S46_92934.0" route="92929" type="train" depart="23030" line="S46_92929"/>
<     <vehicle id="S46_92935.0" route="92929" type="train" depart="24230" line="S46_92929"/>
<     <vehicle id="S46_92936.0" route="92929" type="train" depart="25430" line="S46_92929"/>
<     <vehicle id="S46_92937.0" route="92929" type="train" depart="26630" line="S46_92929"/>
<     <vehicle id="S46_92938.0" route="92929" type="train" depart="27830" line="S46_92929"/>
<     <vehicle id="S46_92939.0" route="92929" type="train" depart="29030" line="S46_92929"/>
<     <vehicle id="S46_92940.0" route="92929" type="train" depart="30230" line="S46_92929"/>
<     <vehicle id="S46_92941.0" route="92929" type="train" depart="31430" line="S46_92929"/>
<     <vehicle id="S46_92942.0" route="92929" type="train" depart="32630" line="S46_92929"/>
<     <vehicle id="S46_92943.0" route="92929" type="train" depart="33830" line="S46_92929"/>
<     <vehicle id="S46_92944.0" route="92929" type="train" depart="35030" line="S46_92929"/>
<     <vehicle id="S46_92945.0" route="92929" type="train" depart="36230" line="S46_92929"/>
<     <vehicle id="S46_92946.0" route="92929" type="train" depart="37430" line="S46_92929"/>
<     <vehicle id="S46_92947.0" route="92929" type="train" depart="38630" line="S46_92929"/>
<     <vehicle id="S46_92948.0" route="92929" type="train" depart="39830" line="S46_92929"/>
<     <vehicle id="S46_92949.0" route="92929" type="train" depart="41030" line="S46_92929"/>
<     <vehicle id="S46_92950.0" route="92929" type="train" depart="42230" line="S46_92929"/>
<     <vehicle id="S46_92951.0" route="92929" type="train" depart="43430" line="S46_92929"/>
<     <vehicle id="S46_92952.0" route="92929" type="train" depart="44630" line="S46_92929"/>
<     <vehicle id="S46_92953.0" route="92929" type="train" depart="45830" line="S46_92929"/>
<     <vehicle id="S46_92954.0" route="92929" type="train" depart="47030" line="S46_92929"/>
<     <vehicle id="S46_92955.0" route="92929" type="train" depart="77030" line="S46_92929"/>
<truncated after showing first 30 lines>

Detailed information for the tests that had known bugs:

TEST had known bugs (see #8973) on ts-sim-build-ba : sumo ToCDevice dynamic_ToC_stop ( Last six runs Sep2022 )

dynamic ToC triggered despite stop present on vehicle's lane continuation
(This bug was triggered by text found in file 'tocs' matching 'DYNTOR')

TEST had known bugs (see #254) on ts-sim-build-ba : sumo output one_vehicle ( Last six runs Sep2022 )

different outputs from detectors which should detect the same
(This bug was triggered by text found in file 'output' matching 'failed')
---------- Differences in output ----------
5,7c5,7
< success 0.1 ['--step-length', '.1', '--end', '100'] ['3/1to2/1_0']
< success 1 ['--step-length', '.1', '--end', '100'] ['3/1to2/1_0']
< success 10 ['--step-length', '.1', '--end', '100'] ['3/1to2/1_0']
---
> failed 0.1 ['--step-length', '.1', '--end', '100'] 3/1to2/1_0 (71.4, 71.5) <zip object at 0x7f3c272022c0>
> failed 1 ['--step-length', '.1', '--end', '100'] 3/1to2/1_0 (72.0, 73.0) <zip object at 0x7f3c2724ecc0>
> failed 10 ['--step-length', '.1', '--end', '100'] 3/1to2/1_0 (80.0, 90.0) <zip object at 0x7f3c2724e6c0>
9,12c9,12
< success 0.1 ['--step-length', '.1', '--end', '1000'] ['3/1to2/1_0']
< success 1 ['--step-length', '.1', '--end', '1000'] ['3/1to2/1_0']
< success 10 ['--step-length', '.1', '--end', '1000'] ['3/1to2/1_0']
< success 100 ['--step-length', '.1', '--end', '1000'] ['3/1to2/1_0']
---
> failed 0.1 ['--step-length', '.1', '--end', '1000'] 3/1to2/1_0 (71.4, 71.5) <zip object at 0x7f3c26ecb1c0>
> failed 1 ['--step-length', '.1', '--end', '1000'] 3/1to2/1_0 (72.0, 73.0) <zip object at 0x7f3c27204800>
> failed 10 ['--step-length', '.1', '--end', '1000'] 3/1to2/1_0 (80.0, 90.0) <zip object at 0x7f3c27257f40>
> failed 100 ['--step-length', '.1', '--end', '1000'] 3/1to2/1_0 (100.0, 200.0) <zip object at 0x7f3c27257880>
17,19c17,19
< success 0.1 ['--step-length', '1', '--end', '100'] ['3/1to2/1_0']
< success 1 ['--step-length', '1', '--end', '100'] ['3/1to2/1_0']
< success 10 ['--step-length', '1', '--end', '100'] ['3/1to2/1_0']
---
> failed 0.1 ['--step-length', '1', '--end', '100'] 3/1to2/1_0 (73.0, 74.0) <zip object at 0x7f3c2722da40>
> failed 1 ['--step-length', '1', '--end', '100'] 3/1to2/1_0 (73.0, 74.0) <zip object at 0x7f3c2722de80>
> failed 10 ['--step-length', '1', '--end', '100'] 3/1to2/1_0 (80.0, 90.0) <zip object at 0x7f3c2722d940>
21,50c21,24
< success 0.1 ['--step-length', '1', '--end', '1000'] ['3/1to2/1_0']
< success 1 ['--step-length', '1', '--end', '1000'] ['3/1to2/1_0']
< success 10 ['--step-length', '1', '--end', '1000'] ['3/1to2/1_0']
<truncated after showing first 30 lines>

TEST had known bugs (see #254) on ts-sim-build-ba : sumo output teleport ( Last six runs Sep2022 )

different outputs from detectors which should detect the same
(This bug was triggered by text found in file 'output' matching 'failed')
---------- Differences in output ----------
1,98c1,48
< success ['--step-length', '.1', '--end', '51'] ['2/1to1/1_0']
< success ['--step-length', '.1', '--end', '51'] ['2/1to1/1_0', '1/1to0/1_0']
< success ['--step-length', '.1', '--end', '51'] ['2/1to1/1_0']
< success ['--step-length', '.1', '--end', '51'] ['2/1to1/1_0', '1/1to0/1_0']
< success ['--step-length', '.1', '--end', '51'] ['2/1to1/1_0']
< success ['--step-length', '.1', '--end', '51'] ['2/1to1/1_0', '1/1to0/1_0']
< success ['--step-length', '.1', '--end', '51'] ['2/1to1/1_0']
< success ['--step-length', '.1', '--end', '51'] ['2/1to1/1_0', '1/1to0/1_0']
< success ['--step-length', '.1', '--end', '100'] ['2/1to1/1_0']
< success ['--step-length', '.1', '--end', '100'] ['2/1to1/1_0', '1/1to0/1_0']
< success ['--step-length', '.1', '--end', '100'] ['2/1to1/1_0']
< success ['--step-length', '.1', '--end', '100'] ['2/1to1/1_0', '1/1to0/1_0']
< success ['--step-length', '.1', '--end', '100'] ['2/1to1/1_0']
< success ['--step-length', '.1', '--end', '100'] ['2/1to1/1_0', '1/1to0/1_0']
< success ['--step-length', '.1', '--end', '100'] ['2/1to1/1_0']
< success ['--step-length', '.1', '--end', '100'] ['2/1to1/1_0', '1/1to0/1_0']
< failed ['--step-length', '.1', '--end', '1000'] 2/1to1/1_0 (108.6, 108.7) [9.9, 10.0, 9.9, 9.9]
< failed ['--step-length', '.1', '--end', '1000'] 2/1to1/1_0 (108.6, 108.7) [9.9, 10.0, 9.9, 9.9]
< failed ['--step-length', '.1', '--end', '1000'] 2/1to1/1_0 (108.0, 109.0) [9.87, 10.0, 9.87, 9.87]
< failed ['--step-length', '.1', '--end', '1000'] 2/1to1/1_0 (108.0, 109.0) [9.87, 10.0, 9.87, 9.87]
< failed ['--step-length', '.1', '--end', '1000'] 2/1to1/1_0 (100.0, 110.0) [9.85, 9.96, 9.85, 9.85]
< failed ['--step-length', '.1', '--end', '1000'] 2/1to1/1_0 (100.0, 110.0) [9.85, 9.96, 9.85, 9.85]
< failed ['--step-length', '.1', '--end', '1000'] 2/1to1/1_0 (100.0, 200.0) [-1.0, 2.26, 3.2, 2.27, 2.27]
< failed ['--step-length', '.1', '--end', '1000'] 2/1to1/1_0 (100.0, 200.0) [-1.0, 2.26, 3.2, 2.27, 2.27]
< success ['--step-length', '1', '--end', '51'] ['2/1to1/1_0']
< success ['--step-length', '1', '--end', '51'] ['2/1to1/1_0', '1/1to0/1_0']
< success ['--step-length', '1', '--end', '51'] ['2/1to1/1_0']
< success ['--step-length', '1', '--end', '51'] ['2/1to1/1_0', '1/1to0/1_0']
< success ['--step-length', '1', '--end', '51'] ['2/1to1/1_0']
<truncated after showing first 30 lines>

TEST had known bugs (see #254) on ts-sim-build-ba : sumo output teleport_multihop ( Last six runs Sep2022 )

different outputs from detectors which should detect the same
(This bug was triggered by text found in file 'output' matching 'failed')
---------- Differences in output ----------
17,24c17,24
< success 0.1 ['--step-length', '.1', '--end', '1000'] 2/1to1/1_0 (230.0, 230.1) [('e2', 9.99), ('e3', 10.0), ('edge', 9.99), ('lane', 9.99)]
< success 0.1 ['--step-length', '.1', '--end', '1000'] 1/1to0/1_0 (148.1, 148.2) [('e2', 9.99), ('e3', 10.0), ('edge', 9.99), ('lane', 9.99)]
< success 1 ['--step-length', '.1', '--end', '1000'] 2/1to1/1_0 (230.0, 231.0) [('e2', 9.99), ('e3', 10.0), ('edge', 9.99), ('lane', 9.99)]
< success 1 ['--step-length', '.1', '--end', '1000'] 1/1to0/1_0 (148.0, 149.0) [('e2', 9.91), ('e3', 10.0), ('edge', 9.91), ('lane', 9.91)]
< success 10 ['--step-length', '.1', '--end', '1000'] 2/1to1/1_0 (230.0, 240.0) [('e2', 9.42), ('e3', 9.9), ('edge', 9.42), ('lane', 9.42)]
< success 10 ['--step-length', '.1', '--end', '1000'] 1/1to0/1_0 (140.0, 150.0) [('e2', 9.96), ('e3', 9.99), ('edge', 9.96), ('lane', 9.96)]
< success 100 ['--step-length', '.1', '--end', '1000'] 2/1to1/1_0 (200.0, 300.0) [('e1', 10.0), ('e2', 9.22), ('e3', 5.71), ('edge', 9.22), ('lane', 9.22)]
< success 100 ['--step-length', '.1', '--end', '1000'] 1/1to0/1_0 (100.0, 200.0) [('e1', 9.53), ('e2', 5.82), ('e3', 6.93), ('edge', 5.82), ('lane', 5.82)]
---
> failed 0.1 ['--step-length', '.1', '--end', '1000'] 2/1to1/1_0 (148.9, 149.0) <zip object at 0x7f4bf236a280>
> failed 0.1 ['--step-length', '.1', '--end', '1000'] 2/1to1/1_0 (148.9, 149.0) <zip object at 0x7f4bf2054fc0>
> failed 1 ['--step-length', '.1', '--end', '1000'] 2/1to1/1_0 (149.0, 150.0) <zip object at 0x7f4bf25409c0>
> failed 1 ['--step-length', '.1', '--end', '1000'] 2/1to1/1_0 (149.0, 150.0) <zip object at 0x7f4bf282d900>
> failed 10 ['--step-length', '.1', '--end', '1000'] 2/1to1/1_0 (140.0, 150.0) <zip object at 0x7f4bf2856140>
> failed 10 ['--step-length', '.1', '--end', '1000'] 2/1to1/1_0 (140.0, 150.0) <zip object at 0x7f4bf2856bc0>
> failed 100 ['--step-length', '.1', '--end', '1000'] 2/1to1/1_0 (100.0, 200.0) <zip object at 0x7f4bf29050c0>
> failed 100 ['--step-length', '.1', '--end', '1000'] 2/1to1/1_0 (100.0, 200.0) <zip object at 0x7f4bf2856740>
41,98c41,48
< success 0.1 ['--step-length', '1', '--end', '1000'] 2/1to1/1_0 (245.0, 246.0) [('e2', 8.92), ('e3', 10.0), ('edge', 8.92), ('lane', 8.92)]
< success 0.1 ['--step-length', '1', '--end', '1000'] 1/1to0/1_0 (150.0, 151.0) [('e2', 9.82), ('e3', 10.0), ('edge', 9.82), ('lane', 9.82)]
< success 1 ['--step-length', '1', '--end', '1000'] 2/1to1/1_0 (245.0, 246.0) [('e2', 8.92), ('e3', 10.0), ('edge', 8.92), ('lane', 8.92)]
< success 1 ['--step-length', '1', '--end', '1000'] 1/1to0/1_0 (150.0, 151.0) [('e2', 9.82), ('e3', 10.0), ('edge', 9.82), ('lane', 9.82)]
< success 10 ['--step-length', '1', '--end', '1000'] 2/1to1/1_0 (240.0, 250.0) [('e2', 9.9), ('e3', 10.0), ('edge', 9.9), ('lane', 9.9)]
< success 10 ['--step-length', '1', '--end', '1000'] 1/1to0/1_0 (150.0, 160.0) [('e2', 9.15), ('e3', 9.84), ('edge', 9.15), ('lane', 9.15)]
< success 100 ['--step-length', '1', '--end', '1000'] 2/1to1/1_0 (200.0, 300.0) [('e1', 10.0), ('e2', 9.41), ('e3', 5.84), ('edge', 9.41), ('lane', 9.41)]
< success 100 ['--step-length', '1', '--end', '1000'] 1/1to0/1_0 (100.0, 200.0) [('e1', 10.0), ('e2', 5.94), ('e3', 7.08), ('edge', 5.94), ('lane', 5.94)]
< -- Unordered text as found by filter '^Loading configuration ... done.' --
< Loading configuration ... done.
< Loading configuration ... done.
<truncated after showing first 30 lines>

TEST had known bugs (see #254) on ts-sim-build-ba : sumo output teleport_multihop_newDefaults ( Last six runs Sep2022 )

different outputs from detectors which should detect the same
(This bug was triggered by text found in file 'output' matching 'failed')
---------- Differences in output ----------
9,24c9,24
< failed 0.1 ['--step-length', '.1', '--end', '100'] 2/1to1/1_0 (76.2, 76.3) [('e2', 10.49), ('e3', 10.35), ('edge', 10.49), ('lane', 10.49)]
< failed 0.1 ['--step-length', '.1', '--end', '100'] 2/1to1/1_0 (76.2, 76.3) [('e2', 10.49), ('e3', 10.35), ('edge', 10.49), ('lane', 10.49)]
< failed 1 ['--step-length', '.1', '--end', '100'] 2/1to1/1_0 (76.0, 77.0) [('e2', 10.39), ('e3', 10.35), ('edge', 10.39), ('lane', 10.39)]
< failed 1 ['--step-length', '.1', '--end', '100'] 2/1to1/1_0 (76.0, 77.0) [('e2', 10.39), ('e3', 10.35), ('edge', 10.39), ('lane', 10.39)]
< failed 10 ['--step-length', '.1', '--end', '100'] 2/1to1/1_0 (70.0, 80.0) [('e2', 10.42), ('e3', 10.25), ('edge', 10.42), ('lane', 10.42)]
< failed 10 ['--step-length', '.1', '--end', '100'] 2/1to1/1_0 (70.0, 80.0) [('e2', 10.42), ('e3', 10.25), ('edge', 10.42), ('lane', 10.42)]
< failed 100 ['--step-length', '.1', '--end', '100'] 2/1to1/1_0 (0.0, 100.0) [('e1', 10.27), ('e2', 10.24), ('e3', 9.59), ('edge', 10.24), ('lane', 10.24)]
< failed 100 ['--step-length', '.1', '--end', '100'] 2/1to1/1_0 (0.0, 100.0) [('e1', 10.27), ('e2', 10.24), ('e3', 9.59), ('edge', 10.24), ('lane', 10.24)]
< failed 0.1 ['--step-length', '.1', '--end', '1000'] 2/1to1/1_0 (76.2, 76.3) [('e2', 10.49), ('e3', 10.35), ('edge', 10.49), ('lane', 10.49)]
< failed 0.1 ['--step-length', '.1', '--end', '1000'] 2/1to1/1_0 (76.2, 76.3) [('e2', 10.49), ('e3', 10.35), ('edge', 10.49), ('lane', 10.49)]
< failed 1 ['--step-length', '.1', '--end', '1000'] 2/1to1/1_0 (76.0, 77.0) [('e2', 10.39), ('e3', 10.35), ('edge', 10.39), ('lane', 10.39)]
< failed 1 ['--step-length', '.1', '--end', '1000'] 2/1to1/1_0 (76.0, 77.0) [('e2', 10.39), ('e3', 10.35), ('edge', 10.39), ('lane', 10.39)]
< failed 10 ['--step-length', '.1', '--end', '1000'] 2/1to1/1_0 (70.0, 80.0) [('e2', 10.42), ('e3', 10.25), ('edge', 10.42), ('lane', 10.42)]
< failed 10 ['--step-length', '.1', '--end', '1000'] 2/1to1/1_0 (70.0, 80.0) [('e2', 10.42), ('e3', 10.25), ('edge', 10.42), ('lane', 10.42)]
< failed 100 ['--step-length', '.1', '--end', '1000'] 2/1to1/1_0 (0.0, 100.0) [('e1', 10.27), ('e2', 10.24), ('e3', 9.59), ('edge', 10.24), ('lane', 10.24)]
< failed 100 ['--step-length', '.1', '--end', '1000'] 2/1to1/1_0 (0.0, 100.0) [('e1', 10.27), ('e2', 10.24), ('e3', 9.59), ('edge', 10.24), ('lane', 10.24)]
---
> failed 0.1 ['--step-length', '.1', '--end', '100'] 2/1to1/1_0 (70.9, 71.0) <zip object at 0x7f783d5ca2c0>
> failed 0.1 ['--step-length', '.1', '--end', '100'] 2/1to1/1_0 (70.9, 71.0) <zip object at 0x7f783d59a1c0>
> failed 1 ['--step-length', '.1', '--end', '100'] 2/1to1/1_0 (70.0, 71.0) <zip object at 0x7f783d5b5d40>
> failed 1 ['--step-length', '.1', '--end', '100'] 2/1to1/1_0 (70.0, 71.0) <zip object at 0x7f783d5b5300>
> failed 10 ['--step-length', '.1', '--end', '100'] 2/1to1/1_0 (70.0, 80.0) <zip object at 0x7f783d5b5b80>
> failed 10 ['--step-length', '.1', '--end', '100'] 2/1to1/1_0 (70.0, 80.0) <zip object at 0x7f783d5b5e40>
> failed 100 ['--step-length', '.1', '--end', '100'] 2/1to1/1_0 (0.0, 100.0) <zip object at 0x7f783d5b51c0>
> failed 100 ['--step-length', '.1', '--end', '100'] 2/1to1/1_0 (0.0, 100.0) <zip object at 0x7f783d5ba9c0>
> failed 0.1 ['--step-length', '.1', '--end', '1000'] 2/1to1/1_0 (70.9, 71.0) <zip object at 0x7f783d0bc2c0>
> failed 0.1 ['--step-length', '.1', '--end', '1000'] 2/1to1/1_0 (70.9, 71.0) <zip object at 0x7f783cda40c0>
> failed 1 ['--step-length', '.1', '--end', '1000'] 2/1to1/1_0 (70.0, 71.0) <zip object at 0x7f783d297640>
> failed 1 ['--step-length', '.1', '--end', '1000'] 2/1to1/1_0 (70.0, 71.0) <zip object at 0x7f783d5bf740>
<truncated after showing first 30 lines>

TEST had known bugs (see #254) on ts-sim-build-ba : sumo output two_same_vehicles ( Last six runs Sep2022 )

different outputs from detectors which should detect the same
(This bug was triggered by text found in file 'output' matching 'failed')
---------- Differences in output ----------
5,7c5,7
< success 0.1 ['--step-length', '.1', '--end', '100'] ['3/1to2/1_0']
< success 1 ['--step-length', '.1', '--end', '100'] ['3/1to2/1_0']
< success 10 ['--step-length', '.1', '--end', '100'] ['3/1to2/1_0']
---
> failed 0.1 ['--step-length', '.1', '--end', '100'] 3/1to2/1_0 (75.4, 75.5) <zip object at 0x7f6ed1dd34c0>
> failed 1 ['--step-length', '.1', '--end', '100'] 3/1to2/1_0 (76.0, 77.0) <zip object at 0x7f6ed1e0b140>
> failed 10 ['--step-length', '.1', '--end', '100'] 3/1to2/1_0 (80.0, 90.0) <zip object at 0x7f6ed1e0b180>
9,12c9,12
< success 0.1 ['--step-length', '.1', '--end', '1000'] ['3/1to2/1_0']
< success 1 ['--step-length', '.1', '--end', '1000'] ['3/1to2/1_0']
< success 10 ['--step-length', '.1', '--end', '1000'] ['3/1to2/1_0']
< success 100 ['--step-length', '.1', '--end', '1000'] ['3/1to2/1_0']
---
> failed 0.1 ['--step-length', '.1', '--end', '1000'] 3/1to2/1_0 (75.4, 75.5) <zip object at 0x7f6ed1a9efc0>
> failed 1 ['--step-length', '.1', '--end', '1000'] 3/1to2/1_0 (76.0, 77.0) <zip object at 0x7f6ed1de1400>
> failed 10 ['--step-length', '.1', '--end', '1000'] 3/1to2/1_0 (80.0, 90.0) <zip object at 0x7f6ed1de1380>
> failed 100 ['--step-length', '.1', '--end', '1000'] 3/1to2/1_0 (100.0, 200.0) <zip object at 0x7f6ed1db80c0>
17,19c17,19
< success 0.1 ['--step-length', '1', '--end', '100'] ['3/1to2/1_0']
< success 1 ['--step-length', '1', '--end', '100'] ['3/1to2/1_0']
< success 10 ['--step-length', '1', '--end', '100'] ['3/1to2/1_0']
---
> failed 0.1 ['--step-length', '1', '--end', '100'] 3/1to2/1_0 (77.0, 78.0) <zip object at 0x7f6ed1e23b40>
> failed 1 ['--step-length', '1', '--end', '100'] 3/1to2/1_0 (77.0, 78.0) <zip object at 0x7f6ed1db8340>
> failed 10 ['--step-length', '1', '--end', '100'] 3/1to2/1_0 (80.0, 90.0) <zip object at 0x7f6ed1e13100>
21,50c21,24
< success 0.1 ['--step-length', '1', '--end', '1000'] ['3/1to2/1_0']
< success 1 ['--step-length', '1', '--end', '1000'] ['3/1to2/1_0']
< success 10 ['--step-length', '1', '--end', '1000'] ['3/1to2/1_0']
<truncated after showing first 30 lines>

TEST had known bugs (see #254) on ts-sim-build-ba : sumo output two_vehicles_diff_length ( Last six runs Sep2022 )

different outputs from detectors which should detect the same
(This bug was triggered by text found in file 'output' matching 'failed')
---------- Differences in output ----------
5,7c5,7
< success 0.1 ['--step-length', '.1', '--end', '100'] ['3/1to2/1_0']
< success 1 ['--step-length', '.1', '--end', '100'] ['3/1to2/1_0']
< success 10 ['--step-length', '.1', '--end', '100'] ['3/1to2/1_0']
---
> failed 0.1 ['--step-length', '.1', '--end', '100'] 3/1to2/1_0 (76.4, 76.5) <zip object at 0x7fbed48303c0>
> failed 1 ['--step-length', '.1', '--end', '100'] 3/1to2/1_0 (77.0, 78.0) <zip object at 0x7fbed48b2c00>
> failed 10 ['--step-length', '.1', '--end', '100'] 3/1to2/1_0 (80.0, 90.0) <zip object at 0x7fbed48681c0>
9,12c9,12
< success 0.1 ['--step-length', '.1', '--end', '1000'] ['3/1to2/1_0']
< success 1 ['--step-length', '.1', '--end', '1000'] ['3/1to2/1_0']
< success 10 ['--step-length', '.1', '--end', '1000'] ['3/1to2/1_0']
< success 100 ['--step-length', '.1', '--end', '1000'] ['3/1to2/1_0']
---
> failed 0.1 ['--step-length', '.1', '--end', '1000'] 3/1to2/1_0 (76.4, 76.5) <zip object at 0x7fbed44f61c0>
> failed 1 ['--step-length', '.1', '--end', '1000'] 3/1to2/1_0 (77.0, 78.0) <zip object at 0x7fbed482d3c0>
> failed 10 ['--step-length', '.1', '--end', '1000'] 3/1to2/1_0 (80.0, 90.0) <zip object at 0x7fbed480a4c0>
> failed 100 ['--step-length', '.1', '--end', '1000'] 3/1to2/1_0 (100.0, 200.0) <zip object at 0x7fbed4837880>
17,19c17,19
< success 0.1 ['--step-length', '1', '--end', '100'] ['3/1to2/1_0']
< success 1 ['--step-length', '1', '--end', '100'] ['3/1to2/1_0']
< success 10 ['--step-length', '1', '--end', '100'] ['3/1to2/1_0']
---
> failed 0.1 ['--step-length', '1', '--end', '100'] 3/1to2/1_0 (78.0, 79.0) <zip object at 0x7fbed4826840>
> failed 1 ['--step-length', '1', '--end', '100'] 3/1to2/1_0 (78.0, 79.0) <zip object at 0x7fbed4826c40>
> failed 10 ['--step-length', '1', '--end', '100'] 3/1to2/1_0 (80.0, 90.0) <zip object at 0x7fbed4826440>
21,50c21,24
< success 0.1 ['--step-length', '1', '--end', '1000'] ['3/1to2/1_0']
< success 1 ['--step-length', '1', '--end', '1000'] ['3/1to2/1_0']
< success 10 ['--step-length', '1', '--end', '1000'] ['3/1to2/1_0']
<truncated after showing first 30 lines>

TEST had known bugs (see #254) on ts-sim-build-ba : sumo output two_vehicles_diff_speed ( Last six runs Sep2022 )

different outputs from detectors which should detect the same
(This bug was triggered by text found in file 'output' matching 'failed')
---------- Differences in output ----------
0a1,24
> failed 0.1 ['--step-length', '.1', '--end', '51'] 3/1to2/1_0 (38.4, 38.5) <zip object at 0x7f538c196640>
> failed 1 ['--step-length', '.1', '--end', '51'] 3/1to2/1_0 (38.0, 39.0) <zip object at 0x7f538c1984c0>
> failed 10 ['--step-length', '.1', '--end', '51'] 3/1to2/1_0 (30.0, 40.0) <zip object at 0x7f538c19b240>
> failed 100 ['--step-length', '.1', '--end', '51'] 3/1to2/1_0 (0.0, 51.0) <zip object at 0x7f538c19b140>
> failed 0.1 ['--step-length', '.1', '--end', '100'] 3/1to2/1_0 (38.4, 38.5) <zip object at 0x7f538c14f380>
> failed 1 ['--step-length', '.1', '--end', '100'] 3/1to2/1_0 (38.0, 39.0) <zip object at 0x7f538c19b680>
> failed 10 ['--step-length', '.1', '--end', '100'] 3/1to2/1_0 (30.0, 40.0) <zip object at 0x7f538c16ec40>
> failed 100 ['--step-length', '.1', '--end', '100'] 3/1to2/1_0 (0.0, 100.0) <zip object at 0x7f538c16e940>
> failed 0.1 ['--step-length', '.1', '--end', '1000'] 3/1to2/1_0 (38.4, 38.5) <zip object at 0x7f538bda4f40>
> failed 1 ['--step-length', '.1', '--end', '1000'] 3/1to2/1_0 (38.0, 39.0) <zip object at 0x7f538c187100>
> failed 10 ['--step-length', '.1', '--end', '1000'] 3/1to2/1_0 (30.0, 40.0) <zip object at 0x7f538c187c00>
> failed 100 ['--step-length', '.1', '--end', '1000'] 3/1to2/1_0 (0.0, 100.0) <zip object at 0x7f538c187b80>
> failed 0.1 ['--step-length', '1', '--end', '51'] 3/1to2/1_0 (39.0, 40.0) <zip object at 0x7f538c166f40>
> failed 1 ['--step-length', '1', '--end', '51'] 3/1to2/1_0 (39.0, 40.0) <zip object at 0x7f538c134300>
> failed 10 ['--step-length', '1', '--end', '51'] 3/1to2/1_0 (30.0, 40.0) <zip object at 0x7f538c134700>
> failed 100 ['--step-length', '1', '--end', '51'] 3/1to2/1_0 (0.0, 51.0) <zip object at 0x7f538c134200>
> failed 0.1 ['--step-length', '1', '--end', '100'] 3/1to2/1_0 (39.0, 40.0) <zip object at 0x7f538c134380>
> failed 1 ['--step-length', '1', '--end', '100'] 3/1to2/1_0 (39.0, 40.0) <zip object at 0x7f538c134900>
> failed 10 ['--step-length', '1', '--end', '100'] 3/1to2/1_0 (30.0, 40.0) <zip object at 0x7f538c166f00>
> failed 100 ['--step-length', '1', '--end', '100'] 3/1to2/1_0 (0.0, 100.0) <zip object at 0x7f538c124c80>
> failed 0.1 ['--step-length', '1', '--end', '1000'] 3/1to2/1_0 (39.0, 40.0) <zip object at 0x7f538c1243c0>
> failed 1 ['--step-length', '1', '--end', '1000'] 3/1to2/1_0 (39.0, 40.0) <zip object at 0x7f538c126980>
> failed 10 ['--step-length', '1', '--end', '1000'] 3/1to2/1_0 (30.0, 40.0) <zip object at 0x7f538c187500>
> failed 100 ['--step-length', '1', '--end', '1000'] 3/1to2/1_0 (0.0, 100.0) <zip object at 0x7f538c187e80>

TEST had known bugs (see #3263) on ts-sim-build-ba : traci vehicle moveToXY keepRoute2 ( Last six runs Sep2022 )

mapping failure
(This bug was triggered by text found in file 'output' matching 'failed')
---------- Differences in output ----------
0a1
> internal corner (inside, segment2) failed: x=198, x2=198.0,   y=1.9, y2=1.9,   lane=middle_0, lane2=middle_0, pos=102, pos2=98.0   posLat=2.0 posLat2=1.9

TEST had known bugs (see #6192) on ts-sim-build-ba : traci vehicle openGap with_low_maxDecel_fast_CACC ( Last six runs Sep2022 )

not even failing as intended
(This bug was triggered by text found in file 'errors' matching 'Error')
---------- Differences in errors ----------
0a1,8
> Traceback (most recent call last):
>   File "/home/delphi/gcc/sumo/tests/../tests/complex/traci/vehicle/openGap/runner.py", line 156, in <module>
>     runSingle(targetTimeHeadway, targetSpaceHeadway, duration, changeRate, maxDecel, refVehID)
>   File "/home/delphi/gcc/sumo/tests/../tests/complex/traci/vehicle/openGap/runner.py", line 66, in runSingle
>     leader = results[tc.VAR_LEADER][0]
> TypeError: 'NoneType' object is not subscriptable
> Error: tcpip::Socket::recvAndCheck @ recv: peer shutdown
> Quitting (on error).
---------- Differences in output ----------
3,102c3,102
< Time 2.0: Gap 'follower'->'leader' = 5.938 (headway=0.367)
< 'follower' speed = 16.161582708
< Time 3.0: Gap 'follower'->'leader' = 8.966 (headway=0.528)
< 'follower' speed = 16.9836198736
< Time 4.0: Gap 'follower'->'leader' = 11.281 (headway=0.641)
< 'follower' speed = 17.5863190784
< Time 5.0: Gap 'follower'->'leader' = 13.069 (headway=0.725)
< 'follower' speed = 18.0379935645
< Time 6.0: Gap 'follower'->'leader' = 14.459 (headway=0.787)
< 'follower' speed = 18.3815472225
< Time 7.0: Gap 'follower'->'leader' = 15.545 (headway=0.834)
< 'follower' speed = 18.6456171431
< Time 8.0: Gap 'follower'->'leader' = 16.397 (headway=0.870)
< 'follower' speed = 18.8501483763
< Time 9.0: Gap 'follower'->'leader' = 17.068 (headway=0.898)
< 'follower' speed = 19.0094667411
< Time 10.0: Gap 'follower'->'leader' = 17.596 (headway=0.920)
< 'follower' speed = 19.1340998278
< Time 11.0: Gap 'follower'->'leader' = 18.013 (headway=0.937)
< 'follower' speed = 19.231918606
< Time 12.0: Gap 'follower'->'leader' = 18.342 (headway=0.950)
< 'follower' speed = 19.3088858604
< Time 13.0: Gap 'follower'->'leader' = 18.603 (headway=0.960)
< 'follower' speed = 19.3695649077
< Time 14.0: Gap 'follower'->'leader' = 18.810 (headway=0.969)
< 'follower' speed = 19.4174756866
< Time 15.0: Gap 'follower'->'leader' = 18.973 (headway=0.975)
< 'follower' speed = 19.4553500651
< Time 16.0: Gap 'follower'->'leader' = 19.103 (headway=0.980)
<truncated after showing first 30 lines>