10Oct22rv1_14_1+1536-db5f18cfac3 - detailed test results for NETEDIT

To reconnect the TextTest GUI to these results, run:

texttest -a netedit -d /home/delphi/gcc/sumo/tests -reconnect /home/delphi/gcc/texttesttmp/gcc4_64.31Oct001759.1271226 -g

To start TextTest for these tests, run:

texttest -a netedit -d /home/delphi/gcc/sumo/tests

Total: 3818 tests: 3727 succeeded 66 FAILED 25 known bugs


daily.additional.access: 20 tests: 20 succeeded


daily.additional.basic: 4 tests: 4 succeeded


daily.additional.busstop: 47 tests: 47 succeeded


daily.additional.calibrator: 40 tests: 40 succeeded


daily.additional.calibratorflow: 22 tests: 22 succeeded


daily.additional.calibratorlane: 40 tests: 40 succeeded


daily.additional.chargingstation: 47 tests: 47 succeeded


daily.additional.containerstop: 47 tests: 47 succeeded


daily.additional.detentry: 21 tests: 21 succeeded


daily.additional.detexit: 21 tests: 21 succeeded


daily.additional.e1detector: 33 tests: 33 succeeded


daily.additional.e1instantdetector: 29 tests: 29 succeeded


daily.additional.e2detector: 53 tests: 53 succeeded


daily.additional.e2multilanedetector: 54 tests: 54 succeeded


daily.additional.e3detector: 38 tests: 38 succeeded


daily.additional.parkingarea: 55 tests: 55 succeeded


daily.additional.parkingspace: 36 tests: 36 succeeded


daily.additional.rerouter: 10 tests: 10 succeeded


daily.additional.rerouterelements: 25 tests: 25 succeeded


daily.additional.routeprobe: 28 tests: 27 succeeded 1 FAILED

Detailed information for the tests that FAILED:

TEST FAILED on ts-sim-build-ba : additionalelements routeprobe delete ( Last six runs Oct2022 )

---------- Differences in errors ----------
25,26d24
< Debug: Removing routeProbe 'routeProbe_01' in GNEChange_Additional
< Debug: Removing routeProbe 'rp_0' in GNEChange_Additional
61c59
< Debug: Adding routeProbe 'rp_0' in GNEChange_Additional
---
> Debug: Removing routeProbe 'rp_0' in GNEChange_Additional
64,74d61
< Debug: Adding routeProbe 'routeProbe_01' in GNEChange_Additional
< Debug: Opened FXMessageBox Problem deleting edge 'gneE0'
< Debug: Closed FXMessageBox Problem deleting edge 'gneE0'
< Debug: Keys Ctrl+Y (Redo) pressed
< Debug: Calling GNEUndoList::redo()
< Debug: Removing routeProbe 'routeProbe_01' in GNEChange_Additional
< Debug: Keys Ctrl+Y (Redo) pressed
< Debug: Calling GNEUndoList::redo()
< Debug: Removing routeProbe 'rp_0' in GNEChange_Additional
< Debug: Keys Ctrl+Y (Redo) pressed
< Debug: Calling GNEUndoList::redo()
75a63,66
> Debug: Removing routeProbe 'routeProbe_01' in GNEChange_Additional
> Debug: Deleting unreferenced routeProbe
> Debug: Deleting unreferenced routeProbe
> Debug: Deleting unreferenced routeProbe
89a81,84
> Debug: Key ENTER pressed
> Debug: Keys Ctrl+Y (Redo) pressed
> Debug: Keys Ctrl+Y (Redo) pressed
> Debug: Keys Ctrl+Y (Redo) pressed
114,116d108
<truncated after showing first 30 lines>

daily.additional.trainstop: 47 tests: 47 succeeded


daily.additional.vaporizer: 21 tests: 20 succeeded 1 FAILED

Detailed information for the tests that FAILED:

TEST FAILED on ts-sim-build-ba : additionalelements vaporizer create name ( Last six runs Oct2022 )

---------- Differences in additionals ----------
6d5
<     <vaporizer id="gneE0" name="customName" begin="0.00" end="3600.00"/>
---------- Differences in errors ----------
3d2
< Debug: Adding vaporizer 'gneE0' in GNEChange_Additional
6c5
< Debug: Removing vaporizer 'gneE0' in GNEChange_Additional
---
> Debug: Removing vaporizer 'gneE1' in GNEChange_Additional
9c8
< Debug: Adding vaporizer 'gneE0' in GNEChange_Additional
---
> Debug: Adding vaporizer 'gneE1' in GNEChange_Additional
14d12
< Debug: Deleting unreferenced vaporizer
---------- Differences in guisettingsoutput ----------
2c2
<     <viewport zoom="100.00" x="3.00" y="-2.10" angle="0.00"/>
---
>     <viewport zoom="100.00" x="47.00" y="2.10" angle="0.00"/>
---------- Differences in log ----------
0a1
> Warning: Shift + click to create two additionals in the same position

daily.additional.variablespeedsign: 7 tests: 7 succeeded


daily.basic: 24 tests: 24 succeeded


daily.bugs: 24 tests: 20 succeeded 4 FAILED

Detailed information for the tests that FAILED:

TEST FAILED on ts-sim-build-ba : bugs crossings ticket3201 ( Last six runs Oct2022 )

---------- Differences in errors ----------
35d34
< Debug: Created walkingArea ':Center_w2' in retrieveGNEWalkingArea()
42d40
< Debug: Deleting unreferenced walkingArea in rebuildGNEWalkingAreas()
63,123d60
< Debug: Deleting unreferenced walkingArea in rebuildGNEWalkingAreas()
< Debug: Created walkingArea ':C_w0' in retrieveGNEWalkingArea()
< Debug: Created walkingArea ':Center_w0' in retrieveGNEWalkingArea()
< Debug: Created walkingArea ':Center_w1' in retrieveGNEWalkingArea()
< Debug: Created walkingArea ':Center_w2' in retrieveGNEWalkingArea()
< Debug: Deleting unreferenced edge '1' in AttributeCarriers destructor
< Debug: Deleting unreferenced lane '1_0' in GNEEdge destructor
< Debug: Deleting unreferenced lane '1_1' in GNEEdge destructor
< Debug: Deleting unreferenced lane '1_2' in GNEEdge destructor
< Debug: Deleting unreferenced edge '2' in AttributeCarriers destructor
< Debug: Deleting unreferenced lane '2_0' in GNEEdge destructor
< Debug: Deleting unreferenced lane '2_1' in GNEEdge destructor
< Debug: Deleting unreferenced edge '3' in AttributeCarriers destructor
< Debug: Deleting unreferenced lane '3_0' in GNEEdge destructor
< Debug: Deleting unreferenced lane '3_1' in GNEEdge destructor
< Debug: Deleting unreferenced lane '3_2' in GNEEdge destructor
< Debug: Deleting unreferenced edge '4' in AttributeCarriers destructor
< Debug: Deleting unreferenced lane '4_0' in GNEEdge destructor
< Debug: Deleting unreferenced lane '4_1' in GNEEdge destructor
< Debug: Deleting unreferenced edge '5' in AttributeCarriers destructor
< Debug: Deleting unreferenced lane '5_0' in GNEEdge destructor
< Debug: Deleting unreferenced lane '5_1' in GNEEdge destructor
< Debug: Deleting unreferenced connection 'from5_0to4_0' in GNEEdge destructor
< Debug: Deleting unreferenced connection 'from5_0to2_0' in GNEEdge destructor
< Debug: Deleting unreferenced connection 'from5_1to2_1' in GNEEdge destructor
<truncated after showing first 30 lines>
---------- Differences in log ----------
1,6d0
< Warning: Invalid pedestrian topology: crossing ':Center_c0' across [3] has no target.
< Warning: Invalid pedestrian topology: crossing ':Center_c0' across [3] has no target.
< Warning: Invalid pedestrian topology: crossing ':Center_c1' across [8] has no target.
< Warning: Invalid pedestrian topology: crossing ':Center_c0' across [8] has no target.
< Warning: Invalid pedestrian topology: crossing ':Center_c0' across [3] has no target.
< Warning: 8 total messages of type: Invalid pedestrian topology: crossing '%' across [%] has no target.
---------- Differences in output ----------
12c12
< TestFunctions: Netedit closed successfully
---
> TestFunctions: Error closing Netedit
---------- New result in errorScreenshot ----------
PNG


IHDR1cIDATxw|SOt({)UDA"(.(*H
DBTD@
UBٿ?.Ƙ&%MӦm^ܓ$|νRyNILLt7رcxFsozz{]N,$a5_Wrl6;%?5]J&
ү4xvtGzBM9?4]'d`i<l݄쩔n2j.,ZL4l	k#4YV-<UK']5aiiGbۅ\:tÆ:sqOw
NκrѐOƔjCݱ~֝SlNKئ{___7(:!ܴlKZ\78(pc:wlR,]w:v
6ioN4-Lc?s=^?j߇E9z7/g=xJ/ut۔k[KYytoCZ̞|[
]3~/tKm޹ٴkϾ%KW]ܱZju9yں=h4Zq|u~yȽ/8+ƾgManjؿ7/)-s.ݷZXnTKp~?6lNȺ:׻Mulkg
[FhT*ݣnDdKZ~d`/(RVǍkÿYvn5;箨eoX4S1:u^~e|yU?mڴsZa4ivwy^|gJKK۴iS҄Ett׀b6WCFmJ3G4JnlJRlSR<eCmܪQTʺ*j߁m;w[7+V/"G+.-ݺm]7,4[wm5!ŷ?j:e+j׷k~!A_ta*__ߚyA߽N͍kۺJZ'_~,+P۴u{qiiݮxyNn~aQ̘ˆuqgJ)y5?X%dZ;C6;RRTG06$$%{l^vq١]۝<)_;KKfW԰3w7o^\=hx7ߌ3&,,s;[<3>=7}1mąL,_V)+]9nT!A:~m"c.YБt0π~J^u2[Viv7}帑miGWYh|
سG757Z[f_cf'MXCW񧲊z	uWUcfeJ4ƻuz2}~.cG^{?/_uhƄm;9{2^lOFT*SYC:qX,LNeyM~A2***3Og+7\}yg8x7^{ko\Cc/	zRuW]^RZbAX|G3װp븘|NؿoB僃¢TڰyrLv^^=[(cuԵsE_.r;hF
z^.z>7@D&J}C
8bպJ	

jK--H`@ؑy,:<%[v_Wg]{wNјfJu}{GxEd;ul70_~A᪵R]ta>	~~grr}xMJN۫gLtT	xV_hzxڴiʄ݁%ZjժU	R?RL,Oe,[馷Юmco6ҡQD:wlwdȈ/V>IJj1ʊ7e.~u*j̈aZV*"n8q*SDlmȱӎtʊuȈaor:zԥCZM)nDĒ~Ed#=6!|3N<vFiȱt97o3L#]4بn	5U*U֙7o~TJoPP,z*[dUTjey峗ۢi={tU@[V;~rKL&Zj:vʵf_;fsT{,"h4Wr͟UUlz#h4e*{`fed)Ob0ZF[NU5M^=+*+sVz/d2uu~Gӏ^zQvl	kܐZZqdh`k&D$0_7-)-nں@)(,^/i+KJ;ulwQJ&.Lv2C/8)-oؼmJ_MvN`H{Uƾ'q{k)b@^2d`/xxWKHx/	9.EEE"/4'gs?)"-Z39'D$'7[o:TVMKJJs
j-"9yJ	4,,n׮دw|
Я%+:j'3B{tnz~OΨTА}{YpIIi^~2my׎lX}e~n^ӧ2Ow1;'`QJ2n=:__ZTmo3j~]msW=LN=-NjrkYXR{A(7;dž|!EA!:^ɺJ\T(y­vlڧSYgZh||rsp1JӒEE䢁s2Og___el(W6Wʣtz6ln
WD~YF)ժq1S?xo%CFl˓k4}5we嚃iGEk玖6;t˿۶=uFVuzΔTa)"erevz!0 eH`@@b_V9e׺̬3DaQCޢX..?-/p)47}1;~=5Z~ZcO^$hފ<b[]\*W*jT**,**Vʧ6M)Mnݱ{?7o+++KJʂeevNTdyݻHvndsl^[ng6wH;k>eJk0M&d	H٫ܬt|Ѩ(SUUf`dsYϴ9rXV'NeZ]JYYYh?X(tJBBt:z!֏h4F6n򄱖{L?aRHhu8!eS(wڻN]>fv̀Z}p\ٴu×c'LNU*%[:RPXTUjy*̞}w޵Әˆ[qgDjuؾmddx6iGEF5^qG]kVO}ֱǎڥW*@cܹsYwkagN6}!""ire4zzoG)LFr*ɤT_?Ѩl`4?j}5ޔ5[SntliKZV
??߳:ZQhMܼMɥ:K4jn!w1J4ͥe]%Z)++fϊȲ*VoБ}{cCNڱzH0vWap|}zɽYKκqϿK,(,ڻLg8nNkϾ6q;\BLחf8ѢE;z_J~r}5b֪SU֋uh׶{N1]Of8#e%C쒴#Tjxȫ']qkь)\)"kUTTVTT82"b@^`x{]{e9xܹd`hz5UUU&\!"1'c
mժ3Ýy"RV^Q}VWC]F177l6>zz~~	BJTN1AiGl5Mi4>Z{WsQ-#,ꎛS,+zb0ka*SYrwЯlMѺ؝*wknG[a{RwAe=`0uؚ»<-nvu&/mD+Ҳjd2]FQz"62Y)s
&.Fyƕ㰪J*)(GZX?SY6d2M}<<e5N6qb[E
ewQQf]|Gud6m~TnwVlM	o	ZOʿYuԻV<#L&Y&I-"z_d9x{7ʇ9}.(,*
9thfY+eOK)w9|:;7Ehh^~r>M&X~_;RĪ<ךڝ%-_GvN5ƍkwز-)++ұCGqZD~Zvh!!m[Z+(:\.o6CCBڶ
j3h@9kot!M=b#e^LYXח}NDrrj\mj
ˏvQvnVk&n?J203`ЮmRYe].xd`ڙb3N[oٶsC}|ԧsňU^mݲm9ZGaN.)-3?7뫹d'33a-RWʔȝy:w`b#ǎN+,*YkC+\@xFUCؑ~
.Lo	{#hlHX44zİK~^_v}`@QU*UiYYz	e/+V_3)\YRZvsnzs?._n%%eJ1jKJJwN5w<߰!._m,CM&e5&>Rg۰eDK	uO8eWmkukX]{MXn]o:c3mztu.gG]g׋vfyZ*:j`EEKں}ؿJ/(Xt`"vI}v޻r⢁+*gTVUǺtz+V5 `0>	GqZXƉ_VӲ!OioÆq^W^^a0l:q2Ѯp3Fqf: 6?jm
$rc%_\9%&&ێiVo4]'tQe&'^džtGs^>wGt=ԩӎ
[*a^Q&7Ώ~܋|n.h@#DV$R@m5ܩS'OwЬ4}vOw۽]h>nAOw"4/\,_zyU+W3ӽWpq|Wh`ysƍi=~\qW+W{sM~Sv&a=<qh@MnQ}`9;ՇߜgC^iT8JìY,7g͚ܹ}gMҐ=iJew@' f$S=v6WCV규cw<iohT~[ot/βL]&L޼u{Q/Nn~jߑ^1kv˿+C7f/{ᣞz
㟛&hm{["rݷwҹ6mN˜>O3襗_Ց+&]a'8r,
<truncated after showing first 30 lines>
---------- Missing result in guisettingsoutput ----------
<viewsettings>
    <viewport zoom="248.00" x="50.00" y="50.00" angle="0.00"/>
</viewsettings>
---------- Missing result in net ----------
<?xml version="1.0" encoding="UTF-8"?>


<net version="1.9" junctionCornerDetail="5" walkingareas="true" limitTurnSpeed="5.50" xmlns:xsi="http://www.w3.org/2001/XMLSchema-instance" xsi:noNamespaceSchemaLocation="http://sumo.dlr.de/xsd/net_file.xsd">

    <location netOffset="50.00,50.00" convBoundary="0.00,0.00,100.00,100.00" origBoundary="-50.00,-50.00,50.00,50.00" projParameter="!"/>

    <edge id=":C_w0" function="walkingarea">
        <lane id=":C_w0_0" index="0" allow="pedestrian" speed="1.00" length="16.00" width="3.20" shape="0.00,43.60 0.00,40.40 0.00,59.60 0.00,56.40"/>
    </edge>
    <edge id=":Center_0" function="internal">
        <lane id=":Center_0_0" index="0" disallow="pedestrian" speed="6.86" length="5.93" shape="45.20,61.10 44.81,58.34 43.62,56.38 42.90,55.94"/>
    </edge>
    <edge id=":Center_1" function="internal">
        <lane id=":Center_1_0" index="0" disallow="pedestrian" speed="13.90" length="22.20" shape="45.20,61.10 45.20,38.90"/>
        <lane id=":Center_1_1" index="1" disallow="pedestrian" speed="13.90" length="22.20" shape="48.40,61.10 48.40,38.90"/>
    </edge>
    <edge id=":Center_3" function="internal">
        <lane id=":Center_3_0" index="0" disallow="pedestrian" speed="8.94" length="2.83" shape="48.40,61.10 48.70,58.29"/>
    </edge>
    <edge id=":Center_16" function="internal">
        <lane id=":Center_16_0" index="0" disallow="pedestrian" speed="6.86" length="4.23" shape="42.90,55.94 41.66,55.19 38.90,54.80"/>
    </edge>
    <edge id=":Center_17" function="internal">
        <lane id=":Center_17_0" index="0" disallow="pedestrian" speed="8.94" length="15.15" shape="48.70,58.29 48.99,55.54 50.77,51.57 53.74,49.19 57.90,48.40"/>
    </edge>
    <edge id=":Center_4" function="internal">
        <lane id=":Center_4_0" index="0" disallow="pedestrian" speed="6.08" length="7.76" shape="57.90,54.80 56.54,55.19 55.58,56.38 54.99,58.34 54.80,61.10"/>
    </edge>
    <edge id=":Center_5" function="internal">
<truncated after showing first 30 lines>

TEST FAILED on ts-sim-build-ba : bugs processing ticket3071 ( Last six runs Oct2022 )

---------- Differences in errors ----------
292,297c292,297
< Debug: Created walkingArea ':cluster_gneJ13_gneJ17_gneJ19_w0' in retrieveGNEWalkingArea()
< Debug: Created walkingArea ':cluster_gneJ13_gneJ17_gneJ19_w1' in retrieveGNEWalkingArea()
< Debug: Created walkingArea ':cluster_gneJ13_gneJ17_gneJ19_w2' in retrieveGNEWalkingArea()
< Debug: Created walkingArea ':cluster_gneJ13_gneJ17_gneJ19_w3' in retrieveGNEWalkingArea()
< Debug: Created walkingArea ':cluster_gneJ13_gneJ17_gneJ19_w4' in retrieveGNEWalkingArea()
< Debug: Created walkingArea ':cluster_gneJ13_gneJ17_gneJ19_w5' in retrieveGNEWalkingArea()
---
> Debug: Created walkingArea ':clustergneJ13_gneJ17_gneJ19_w0' in retrieveGNEWalkingArea()
> Debug: Created walkingArea ':clustergneJ13_gneJ17_gneJ19_w1' in retrieveGNEWalkingArea()
> Debug: Created walkingArea ':clustergneJ13_gneJ17_gneJ19_w2' in retrieveGNEWalkingArea()
> Debug: Created walkingArea ':clustergneJ13_gneJ17_gneJ19_w3' in retrieveGNEWalkingArea()
> Debug: Created walkingArea ':clustergneJ13_gneJ17_gneJ19_w4' in retrieveGNEWalkingArea()
> Debug: Created walkingArea ':clustergneJ13_gneJ17_gneJ19_w5' in retrieveGNEWalkingArea()
719,724c719,724
< Debug: Created walkingArea ':cluster_gneJ13_gneJ17_gneJ19_w0' in retrieveGNEWalkingArea()
< Debug: Created walkingArea ':cluster_gneJ13_gneJ17_gneJ19_w1' in retrieveGNEWalkingArea()
< Debug: Created walkingArea ':cluster_gneJ13_gneJ17_gneJ19_w2' in retrieveGNEWalkingArea()
< Debug: Created walkingArea ':cluster_gneJ13_gneJ17_gneJ19_w3' in retrieveGNEWalkingArea()
< Debug: Created walkingArea ':cluster_gneJ13_gneJ17_gneJ19_w4' in retrieveGNEWalkingArea()
< Debug: Created walkingArea ':cluster_gneJ13_gneJ17_gneJ19_w5' in retrieveGNEWalkingArea()
---
> Debug: Created walkingArea ':clustergneJ13_gneJ17_gneJ19_w0' in retrieveGNEWalkingArea()
> Debug: Created walkingArea ':clustergneJ13_gneJ17_gneJ19_w1' in retrieveGNEWalkingArea()
> Debug: Created walkingArea ':clustergneJ13_gneJ17_gneJ19_w2' in retrieveGNEWalkingArea()
> Debug: Created walkingArea ':clustergneJ13_gneJ17_gneJ19_w3' in retrieveGNEWalkingArea()
> Debug: Created walkingArea ':clustergneJ13_gneJ17_gneJ19_w4' in retrieveGNEWalkingArea()
> Debug: Created walkingArea ':clustergneJ13_gneJ17_gneJ19_w5' in retrieveGNEWalkingArea()
1139,1144c1139,1144
< Debug: Created walkingArea ':cluster_gneJ13_gneJ17_gneJ19_w0' in retrieveGNEWalkingArea()
<truncated after showing first 30 lines>
---------- Differences in net ----------
8,9c8,9
<     <edge id=":cluster_gneJ13_gneJ17_gneJ19_0" function="internal">
<         <lane id=":cluster_gneJ13_gneJ17_gneJ19_0_0" index="0" disallow="pedestrian rail_fast" speed="6.04" length="3.41" shape="38.31,21.91 34.90,21.92"/>
---
>     <edge id=":clustergneJ13_gneJ17_gneJ19_0" function="internal">
>         <lane id=":clustergneJ13_gneJ17_gneJ19_0_0" index="0" disallow="pedestrian rail_fast" speed="6.04" length="3.41" shape="38.31,21.91 34.90,21.92"/>
11,12c11,12
<     <edge id=":cluster_gneJ13_gneJ17_gneJ19_1" function="internal">
<         <lane id=":cluster_gneJ13_gneJ17_gneJ19_1_0" index="0" disallow="pedestrian rail_fast" speed="8.64" length="2.07" shape="38.31,21.91 36.24,21.92"/>
---
>     <edge id=":clustergneJ13_gneJ17_gneJ19_1" function="internal">
>         <lane id=":clustergneJ13_gneJ17_gneJ19_1_0" index="0" disallow="pedestrian rail_fast" speed="8.64" length="2.07" shape="38.31,21.91 36.24,21.92"/>
14,15c14,15
<     <edge id=":cluster_gneJ13_gneJ17_gneJ19_2" function="internal">
<         <lane id=":cluster_gneJ13_gneJ17_gneJ19_2_0" index="0" disallow="pedestrian rail_fast" speed="13.89" length="41.92" shape="38.31,21.91 32.03,18.47 18.27,19.90 4.53,21.33 -1.69,17.89"/>
---
>     <edge id=":clustergneJ13_gneJ17_gneJ19_2" function="internal">
>         <lane id=":clustergneJ13_gneJ17_gneJ19_2_0" index="0" disallow="pedestrian rail_fast" speed="13.89" length="41.92" shape="38.31,21.91 32.03,18.47 18.27,19.90 4.53,21.33 -1.69,17.89"/>
17,18c17,18
<     <edge id=":cluster_gneJ13_gneJ17_gneJ19_3" function="internal">
<         <lane id=":cluster_gneJ13_gneJ17_gneJ19_3_0" index="0" disallow="pedestrian rail_fast" speed="13.89" length="20.38" shape="38.31,21.91 18.31,17.99"/>
---
>     <edge id=":clustergneJ13_gneJ17_gneJ19_3" function="internal">
>         <lane id=":clustergneJ13_gneJ17_gneJ19_3_0" index="0" disallow="pedestrian rail_fast" speed="13.89" length="20.38" shape="38.31,21.91 18.31,17.99"/>
20,21c20,21
<     <edge id=":cluster_gneJ13_gneJ17_gneJ19_4" function="internal">
<         <lane id=":cluster_gneJ13_gneJ17_gneJ19_4_0" index="0" disallow="pedestrian rail_fast" speed="13.89" length="3.81" shape="38.31,21.91 38.31,18.09"/>
---
>     <edge id=":clustergneJ13_gneJ17_gneJ19_4" function="internal">
>         <lane id=":clustergneJ13_gneJ17_gneJ19_4_0" index="0" disallow="pedestrian rail_fast" speed="13.89" length="3.81" shape="38.31,21.91 38.31,18.09"/>
<truncated after showing first 30 lines>

TEST FAILED on ts-sim-build-ba : bugs ticket10588 ( Last six runs Oct2022 )

---------- Differences in log ----------
13a14
> Warning: Unused state in tlLogic 'cluster_31358103_567607181_cluster_1867580179_2255293396', program '0' at tl-index 15

TEST FAILED on ts-sim-build-ba : bugs ticket10591 ( Last six runs Oct2022 )

---------- Differences in log ----------
12a13
> Warning: Unused state in tlLogic 'cluster_31358103_567607181_cluster_1867580179_2255293396', program '0' at tl-index 15

daily.data.edgedata: 8 tests: 7 succeeded 1 FAILED

Detailed information for the tests that FAILED:

TEST FAILED on ts-sim-build-ba : dataelements edgedata delete ( Last six runs Oct2022 )

---------- Differences in errors ----------
45,47d44
< Debug: Deleting unreferenced edgeData
< Debug: Deleting unreferenced dataInterval [0.00, 3600.00] in ~GNEChange_DataInterval()
< Debug: Deleting unreferenced dataSet 'newDataSet'

daily.data.edgereldata: 10 tests: 9 succeeded 1 FAILED

Detailed information for the tests that FAILED:

TEST FAILED on ts-sim-build-ba : dataelements edgereldata delete ( Last six runs Oct2022 )

---------- Differences in errors ----------
46,48d45
< Debug: Deleting unreferenced edgeRelation
< Debug: Deleting unreferenced dataInterval [0.00, 3600.00] in ~GNEChange_DataInterval()
< Debug: Deleting unreferenced dataSet 'newDataSet'

daily.data.tazreldata: 10 tests: 9 succeeded 1 FAILED

Detailed information for the tests that FAILED:

TEST FAILED on ts-sim-build-ba : dataelements tazreldata delete ( Last six runs Oct2022 )

---------- Differences in errors ----------
50,52d49
< Debug: Deleting unreferenced tazRelation
< Debug: Deleting unreferenced dataInterval [0.00, 3600.00] in ~GNEChange_DataInterval()
< Debug: Deleting unreferenced dataSet 'newDataSet'

daily.demand.basic: 1 tests: 1 succeeded


daily.demand.container: 30 tests: 28 succeeded 2 known bugs

Detailed information for the tests that had known bugs:

2 TESTS had known bugs (Test needed #3045) on ts-sim-build-ba :

#3045
(This bug was triggered by text found in file 'errors' matching 'python: can't open file 'test.py'')
---------- New result in errors ----------
python: can't open file 'test.py': [Errno 2] No such file or directory
demandelements container fix ( Last six runs Oct2022 )
demandelements container volatilerecomputing ( Last six runs Oct2022 )

daily.demand.containerflow: 55 tests: 53 succeeded 2 known bugs

Detailed information for the tests that had known bugs:

2 TESTS had known bugs () on ts-sim-build-ba :

#3045
(This bug was triggered by text found in file 'errors' matching 'python: can't open file 'test.py'')
---------- New result in errors ----------
python: can't open file 'test.py': [Errno 2] No such file or directory
demandelements containerflow fix ( Last six runs Oct2022 )
demandelements containerflow volatilerecomputing ( Last six runs Oct2022 )

daily.demand.flow: 154 tests: 153 succeeded 1 known bugs

Detailed information for the tests that had known bugs:

TEST had known bugs (Test needed #3045) on ts-sim-build-ba : demandelements flow fix ( Last six runs Oct2022 )

#3045
(This bug was triggered by text found in file 'errors' matching 'python: can't open file 'test.py'')
---------- New result in errors ----------
python: can't open file 'test.py': [Errno 2] No such file or directory

daily.demand.flow_embedded: 150 tests: 149 succeeded 1 known bugs

Detailed information for the tests that had known bugs:

TEST had known bugs (Test needed #3045) on ts-sim-build-ba : demandelements flow_embedded fix ( Last six runs Oct2022 )

#3045
(This bug was triggered by text found in file 'errors' matching 'python: can't open file 'test.py'')
---------- New result in errors ----------
python: can't open file 'test.py': [Errno 2] No such file or directory

daily.demand.flow_junctions: 153 tests: 152 succeeded 1 known bugs

Detailed information for the tests that had known bugs:

TEST had known bugs (Test needed #3045) on ts-sim-build-ba : demandelements flow_junctions fix ( Last six runs Oct2022 )

#3045
(This bug was triggered by text found in file 'errors' matching 'python: can't open file 'test.py'')
---------- New result in errors ----------
python: can't open file 'test.py': [Errno 2] No such file or directory

daily.demand.person: 37 tests: 35 succeeded 2 known bugs

Detailed information for the tests that had known bugs:

2 TESTS had known bugs (Test needed #3045) on ts-sim-build-ba :

#3045
(This bug was triggered by text found in file 'errors' matching 'python: can't open file 'test.py'')
---------- New result in errors ----------
python: can't open file 'test.py': [Errno 2] No such file or directory
demandelements person fix ( Last six runs Oct2022 )
demandelements person volatilerecomputing ( Last six runs Oct2022 )

daily.demand.personflow: 62 tests: 60 succeeded 2 known bugs

Detailed information for the tests that had known bugs:

2 TESTS had known bugs () on ts-sim-build-ba :

#3045
(This bug was triggered by text found in file 'errors' matching 'python: can't open file 'test.py'')
---------- New result in errors ----------
python: can't open file 'test.py': [Errno 2] No such file or directory
demandelements personflow fix ( Last six runs Oct2022 )
demandelements personflow volatilerecomputing ( Last six runs Oct2022 )

daily.demand.route: 48 tests: 47 succeeded 1 FAILED

Detailed information for the tests that FAILED:

TEST FAILED on ts-sim-build-ba : demandelements route load edges ( Last six runs Oct2022 )

---------- Differences in errors ----------
75d74
< Debug: Removing route 'route_2' in GNEChange_DemandElement
76a76
> Debug: Removing route 'route_2' in GNEChange_DemandElement

daily.demand.routeflow: 152 tests: 151 succeeded 1 known bugs

Detailed information for the tests that had known bugs:

TEST had known bugs (Test needed #3045) on ts-sim-build-ba : demandelements routeflow fix ( Last six runs Oct2022 )

#3045
(This bug was triggered by text found in file 'errors' matching 'python: can't open file 'test.py'')
---------- New result in errors ----------
python: can't open file 'test.py': [Errno 2] No such file or directory

daily.demand.stop.basic: 3 tests: 3 succeeded


daily.demand.stop.busstop: 49 tests: 49 succeeded


daily.demand.stop.chargingstation: 49 tests: 49 succeeded


daily.demand.stop.containerstop: 49 tests: 49 succeeded


daily.demand.stop.lane: 57 tests: 53 succeeded 4 FAILED

Detailed information for the tests that FAILED:

TEST FAILED on ts-sim-build-ba : demandelements stop lane create duration ( Last six runs Oct2022 )

---------- Differences in output ----------
6c6
< TestFunctions: Clicked over position 709 - 353
---
> TestFunctions: Clicked over position 705 - 353
8c8
< TestFunctions: Clicked over position 714 - 353
---
> TestFunctions: Clicked over position 706 - 353
10c10
< TestFunctions: Clicked over position 719 - 353
---
> TestFunctions: Clicked over position 707 - 353
12c12
< TestFunctions: Clicked over position 704 - 353
---
> TestFunctions: Clicked over position 708 - 353

TEST FAILED on ts-sim-build-ba : demandelements stop lane create extension ( Last six runs Oct2022 )

---------- Differences in output ----------
7c7
< TestFunctions: Clicked over position 709 - 353
---
> TestFunctions: Clicked over position 705 - 353
9c9
< TestFunctions: Clicked over position 714 - 353
---
> TestFunctions: Clicked over position 706 - 353
11c11
< TestFunctions: Clicked over position 719 - 353
---
> TestFunctions: Clicked over position 707 - 353
13c13
< TestFunctions: Clicked over position 704 - 353
---
> TestFunctions: Clicked over position 708 - 353
---------- Differences in routes ----------
10c10
<         <stop lane="gneE1_0" startPos="6.00" endPos="16.00" extension="0.00"/>
---
>         <stop lane="gneE1_0" startPos="7.00" endPos="17.00" extension="0.00"/>

TEST FAILED on ts-sim-build-ba : demandelements stop lane create poslat ( Last six runs Oct2022 )

---------- Differences in routes ----------
9,16c9,11
<         <stop lane="gneE1_0" startPos="18.28" endPos="28.28" duration="60.00" friendlyPos="1"/>
<         <stop lane="gneE1_0" startPos="18.15" endPos="28.15" duration="60.00" friendlyPos="1"/>
<         <stop lane="gneE1_0" startPos="18.04" endPos="28.04" duration="60.00" friendlyPos="1"/>
<         <stop lane="gneE1_0" startPos="17.95" endPos="27.95" duration="60.00" friendlyPos="1"/>
<         <stop lane="gneE1_0" startPos="17.93" endPos="27.93" duration="60.00" friendlyPos="1"/>
<         <stop lane="gneE1_0" startPos="17.89" endPos="27.89" duration="60.00" friendlyPos="1"/>
<         <stop lane="gneE1_0" startPos="17.82" endPos="27.82" duration="60.00" friendlyPos="1"/>
<         <stop lane="gneE1_0" startPos="17.78" endPos="27.78" duration="60.00" friendlyPos="1"/>
---
>         <stop lane="gneE1_0" startPos="7.00" endPos="17.00" posLat="-15.00" duration="60.00"/>
>         <stop lane="gneE1_0" startPos="7.00" endPos="17.00" posLat="7.00" duration="60.00"/>
>         <stop lane="gneE1_0" startPos="6.00" endPos="16.00" posLat="2.30" duration="60.00"/>

TEST FAILED on ts-sim-build-ba : demandelements stop lane create until ( Last six runs Oct2022 )

---------- Differences in output ----------
7c7
< TestFunctions: Clicked over position 709 - 353
---
> TestFunctions: Clicked over position 705 - 353
9c9
< TestFunctions: Clicked over position 714 - 353
---
> TestFunctions: Clicked over position 706 - 353
11c11
< TestFunctions: Clicked over position 719 - 353
---
> TestFunctions: Clicked over position 707 - 353
13c13
< TestFunctions: Clicked over position 704 - 353
---
> TestFunctions: Clicked over position 708 - 353
---------- Differences in routes ----------
10c10
<         <stop lane="gneE1_0" startPos="6.00" endPos="16.00" until="0.00"/>
---
>         <stop lane="gneE1_0" startPos="7.00" endPos="17.00" until="0.00"/>

daily.demand.stop.parkingarea: 45 tests: 45 succeeded


daily.demand.trip: 133 tests: 132 succeeded 1 known bugs

Detailed information for the tests that had known bugs:

TEST had known bugs (Test needed #3045) on ts-sim-build-ba : demandelements trip fix ( Last six runs Oct2022 )

#3045
(This bug was triggered by text found in file 'errors' matching 'python: can't open file 'test.py'')
---------- New result in errors ----------
python: can't open file 'test.py': [Errno 2] No such file or directory

daily.demand.trip_junctions: 130 tests: 129 succeeded 1 known bugs

Detailed information for the tests that had known bugs:

TEST had known bugs (Test needed #3045) on ts-sim-build-ba : demandelements trip_junctions fix ( Last six runs Oct2022 )

#3045
(This bug was triggered by text found in file 'errors' matching 'python: can't open file 'test.py'')
---------- New result in errors ----------
python: can't open file 'test.py': [Errno 2] No such file or directory

daily.demand.vehicle: 132 tests: 131 succeeded 1 known bugs

Detailed information for the tests that had known bugs:

TEST had known bugs (Test needed #3045) on ts-sim-build-ba : demandelements vehicle fix ( Last six runs Oct2022 )

#3045
(This bug was triggered by text found in file 'errors' matching 'python: can't open file 'test.py'')
---------- New result in errors ----------
python: can't open file 'test.py': [Errno 2] No such file or directory

daily.demand.vehicle_embedded: 128 tests: 127 succeeded 1 known bugs

Detailed information for the tests that had known bugs:

TEST had known bugs (Test needed #3045) on ts-sim-build-ba : demandelements vehicle_embedded fix ( Last six runs Oct2022 )

#3045
(This bug was triggered by text found in file 'errors' matching 'python: can't open file 'test.py'')
---------- New result in errors ----------
python: can't open file 'test.py': [Errno 2] No such file or directory

daily.demand.vehicletype: 173 tests: 173 succeeded


daily.demand.waypoint.basic: 3 tests: 3 succeeded


daily.demand.waypoint.busstop: 51 tests: 51 succeeded


daily.demand.waypoint.chargingstation: 49 tests: 49 succeeded


daily.demand.waypoint.containerstop: 49 tests: 48 succeeded 1 FAILED

Detailed information for the tests that FAILED:

TEST FAILED on ts-sim-build-ba : demandelements waypoint containerstop create until ( Last six runs Oct2022 )

---------- Differences in output ----------
7c7
< TestFunctions: Clicked over position 599 - 323
---
> TestFunctions: Clicked over position 595 - 323
9c9
< TestFunctions: Clicked over position 604 - 323
---
> TestFunctions: Clicked over position 596 - 323
11c11
< TestFunctions: Clicked over position 599 - 323
---
> TestFunctions: Clicked over position 597 - 323
13c13
< TestFunctions: Clicked over position 604 - 323
---
> TestFunctions: Clicked over position 598 - 323

daily.demand.waypoint.lane: 60 tests: 59 succeeded 1 FAILED

Detailed information for the tests that FAILED:

TEST FAILED on ts-sim-build-ba : demandelements waypoint lane create until ( Last six runs Oct2022 )

---------- Differences in output ----------
7c7
< TestFunctions: Clicked over position 709 - 353
---
> TestFunctions: Clicked over position 705 - 353
9c9
< TestFunctions: Clicked over position 714 - 353
---
> TestFunctions: Clicked over position 706 - 353
11c11
< TestFunctions: Clicked over position 709 - 353
---
> TestFunctions: Clicked over position 707 - 353
13c13
< TestFunctions: Clicked over position 714 - 353
---
> TestFunctions: Clicked over position 708 - 353

daily.demand.waypoint.parkingarea: 49 tests: 49 succeeded


daily.net.connections: 67 tests: 65 succeeded 2 FAILED

Detailed information for the tests that FAILED:

TEST FAILED on ts-sim-build-ba : netelements connections inspect_selected_tls linkindex ( Last six runs Oct2022 )

---------- Differences in log ----------
0a1
> Warning: Unused state in tlLogic 'Center', program '0' at tl-index 0

TEST FAILED on ts-sim-build-ba : netelements connections inspect_tls linkindex ( Last six runs Oct2022 )

---------- Differences in log ----------
0a1
> Warning: Unused state in tlLogic 'Center', program '0' at tl-index 1

daily.net.crossings: 81 tests: 75 succeeded 6 FAILED

Detailed information for the tests that FAILED:

TEST FAILED on ts-sim-build-ba : netelements crossings with_tls create_nosidewalks split_crossing ( Last six runs Oct2022 )

---------- Differences in log ----------
9c9
< Warning: Invalid pedestrian topology: crossing ':Center_c0' across [8] has no target.
---
> Warning: Invalid pedestrian topology: crossing ':Center_c0' across [4] has no target.

TEST FAILED on ts-sim-build-ba : netelements crossings with_tls inspect linkindex ( Last six runs Oct2022 )

---------- Differences in log ----------
0a1
> Warning: Unused state in tlLogic 'Center', program '0' at tl-index 17

TEST FAILED on ts-sim-build-ba : netelements crossings with_tls inspect_selected linkindex ( Last six runs Oct2022 )

---------- Differences in log ----------
0a1
> Warning: Unused state in tlLogic 'Center', program '0' at tl-index 16

3 TESTS FAILED on ts-sim-build-ba :

---------- Differences in log ----------
0a1
> Warning: Unused state in tlLogic 'C', program '0' at tl-index 16
netelements crossings with_tls load linkindex2 ( Last six runs Oct2022 )
netelements crossings without_tls load linkindex ( Last six runs Oct2022 )
netelements crossings without_tls load linkindex2 ( Last six runs Oct2022 )

daily.net.edges: 146 tests: 146 succeeded


daily.net.junctions: 101 tests: 98 succeeded 3 FAILED

Detailed information for the tests that FAILED:

TEST FAILED on ts-sim-build-ba : netelements junctions inspect pos ( Last six runs Oct2022 )

---------- Differences in additionals ----------
12c12
<     <busStop id="busStop_7_0_1" lane="7_0" startPos="21.00" endPos="30.15"/>
---
>     <busStop id="busStop_7_0_1" lane="7_0" startPos="21.00" endPos="31.00"/>
---------- Differences in errors ----------
45,48c45,46
< Debug: Opening FXMessageBox 'merge junctions'
< Debug: Closed FXMessageBox 'merge junctions' with 'No'
< Debug: Setting new attribute
< Debug: Deleting unreferenced walkingArea in rebuildGNEWalkingAreas()
---
> Debug: Value 'dummy position' for attribute pos of junction isn't valid
> Debug: Key F5 (Compute) pressed
49a48
> Debug: Created walkingArea ':A_w0' in retrieveGNEWalkingArea()
50a50
> Debug: Created walkingArea ':B_w0' in retrieveGNEWalkingArea()
51a52
> Debug: Created walkingArea ':C_w0' in retrieveGNEWalkingArea()
56,63d56
< Debug: Created crossing ':Center_c1' in retrieveGNECrossing()
< Debug: Deleting unreferenced crossing in rebuildGNECrossings()
< Debug: Key F5 (Compute) pressed
< Debug: Created walkingArea ':A_w0' in retrieveGNEWalkingArea()
< Debug: Created walkingArea ':B_w0' in retrieveGNEWalkingArea()
< Debug: Created walkingArea ':C_w0' in retrieveGNEWalkingArea()
< Debug: Created crossing ':Center_c1' in retrieveGNECrossing()
< Debug: Deleting unreferenced crossing in rebuildGNECrossings()
68,69d60
< Debug: Created walkingArea ':D_w0' in retrieveGNEWalkingArea()
< Debug: Setting new attribute
70a62,64
> Debug: Created walkingArea ':D_w0' in retrieveGNEWalkingArea()
> Debug: Value '40.00,40.00' for attribute from of edge isn't valid
> Debug: Key F5 (Compute) pressed
<truncated after showing first 30 lines>
---------- Differences in log ----------
1,4d0
< Warning: Edge's '7' from- and to-node are at the same position.
< Warning: Edge's '3' from- and to-node are at the same position.
< Warning: Discarding invalid crossing ':Center_c1' at junction 'Center' with edges [7 3] (no walkingarea found).
< Warning: Discarding invalid crossing ':Center_c1' at junction 'Center' with edges [7 3] (no walkingarea found).
---------- Differences in net ----------
9c9
<         <lane id=":A_0_0" index="0" disallow="pedestrian" speed="3.65" length="4.67" shape="48.45,-0.39 49.51,-1.36 50.39,-1.55 51.07,-0.97 51.55,0.39"/>
---
>         <lane id=":A_0_0" index="0" disallow="pedestrian" speed="3.65" length="4.67" shape="48.40,0.00 49.20,-1.20 50.00,-1.60 50.80,-1.20 51.60,0.00"/>
12c12
<         <lane id=":A_w0_0" index="0" allow="pedestrian" speed="1.00" length="14.80" width="2.00" shape="56.21,1.55 58.15,2.04 41.85,-2.04 43.79,-1.55"/>
---
>         <lane id=":A_w0_0" index="0" allow="pedestrian" speed="1.00" length="14.80" width="2.00" shape="56.40,0.00 58.40,0.00 41.60,0.00 43.60,0.00"/>
15c15
<         <lane id=":B_0_0" index="0" disallow="pedestrian" speed="3.65" length="4.67" shape="51.58,99.74 50.99,101.05 50.26,101.58 49.41,101.32 48.42,100.26"/>
---
>         <lane id=":B_0_0" index="0" disallow="pedestrian" speed="3.65" length="4.67" shape="51.60,100.00 50.80,101.20 50.00,101.60 49.20,101.20 48.40,100.00"/>
18c18
<         <lane id=":B_w0_0" index="0" allow="pedestrian" speed="1.00" length="14.80" width="2.00" shape="43.69,101.05 41.71,101.38 58.29,98.62 56.31,98.95"/>
---
>         <lane id=":B_w0_0" index="0" allow="pedestrian" speed="1.00" length="14.80" width="2.00" shape="43.60,100.00 41.60,100.00 58.40,100.00 56.40,100.00"/>
21c21
<         <lane id=":C_0_0" index="0" disallow="pedestrian" speed="3.65" length="4.67" shape="0.38,51.55 -0.97,51.06 -1.55,50.38 -1.36,49.51 -0.38,48.45"/>
---
>         <lane id=":C_0_0" index="0" disallow="pedestrian" speed="3.65" length="4.67" shape="0.00,51.60 -1.20,50.80 -1.60,50.00 -1.20,49.20 0.00,48.40"/>
24c24
<         <lane id=":C_w0_0" index="0" allow="pedestrian" speed="1.00" length="14.80" width="2.00" shape="-1.53,43.79 -2.01,41.84 2.01,58.16 1.53,56.21"/>
---
>         <lane id=":C_w0_0" index="0" allow="pedestrian" speed="1.00" length="14.80" width="2.00" shape="0.00,43.60 0.00,41.60 0.00,58.40 0.00,56.40"/>
27c27
<         <lane id=":Center_0_0" index="0" disallow="pedestrian" speed="7.04" length="11.40" shape="37.53,54.36 36.56,50.80 35.06,48.46 33.01,47.34 30.42,47.43"/>
---
>         <lane id=":Center_0_0" index="0" disallow="pedestrian" speed="6.51" length="4.75" shape="45.20,60.40 44.85,57.95 43.80,56.20 43.60,56.08"/>
30,31c30,31
<         <lane id=":Center_1_0" index="0" disallow="pedestrian" speed="13.90" length="25.98" shape="37.53,54.36 36.25,46.58 35.77,41.14 36.31,35.73 38.04,28.07"/>
<truncated after showing first 30 lines>

TEST FAILED on ts-sim-build-ba : netelements junctions inspect_selected fringe ( Last six runs Oct2022 )

---------- Differences in errors ----------
55d54
< Debug: Created walkingArea ':C_w0' in retrieveGNEWalkingArea()
76,77d74
< Debug: Created walkingArea ':C_w0' in retrieveGNEWalkingArea()
< Debug: Deleting unreferenced walkingArea in rebuildGNEWalkingAreas()
97,98d93
< Debug: Created walkingArea ':C_w0' in retrieveGNEWalkingArea()
< Debug: Deleting unreferenced walkingArea in rebuildGNEWalkingAreas()
178d172
< Debug: Deleting unreferenced walkingArea ':C_w0' in GNEJunction destructor
---------- Differences in net ----------
23,25d22
<     <edge id=":C_w0" function="walkingarea">
<         <lane id=":C_w0_0" index="0" allow="pedestrian" speed="1.00" length="14.80" width="2.00" shape="0.00,43.60 0.00,41.60 0.00,58.40 0.00,56.40"/>
<     </edge>
240,241d236
<     <connection from=":C_w0" to="7" fromLane="0" toLane="0" dir="s" state="M"/>
<     <connection from="3" to=":C_w0" fromLane="0" toLane="0" dir="s" state="M"/>

TEST FAILED on ts-sim-build-ba : netelements junctions inspect_tls_selected fringe ( Last six runs Oct2022 )

---------- Differences in errors ----------
55d54
< Debug: Created walkingArea ':C_w0' in retrieveGNEWalkingArea()
76,77d74
< Debug: Created walkingArea ':C_w0' in retrieveGNEWalkingArea()
< Debug: Deleting unreferenced walkingArea in rebuildGNEWalkingAreas()
97,98d93
< Debug: Created walkingArea ':C_w0' in retrieveGNEWalkingArea()
< Debug: Deleting unreferenced walkingArea in rebuildGNEWalkingAreas()
178d172
< Debug: Deleting unreferenced walkingArea ':C_w0' in GNEJunction destructor
---------- Differences in net ----------
23,25d22
<     <edge id=":C_w0" function="walkingarea">
<         <lane id=":C_w0_0" index="0" allow="pedestrian" speed="1.00" length="14.80" width="2.00" shape="0.00,43.60 0.00,41.60 0.00,58.40 0.00,56.40"/>
<     </edge>
319,320d315
<     <connection from=":C_w0" to="7" fromLane="0" toLane="0" dir="s" state="M"/>
<     <connection from="3" to=":C_w0" fromLane="0" toLane="0" dir="s" state="M"/>

daily.net.lanes: 91 tests: 91 succeeded


daily.net.trafficlights: 186 tests: 141 succeeded 37 FAILED 8 known bugs

Detailed information for the tests that FAILED:

2 TESTS FAILED on ts-sim-build-ba :

---------- Differences in errors ----------
51,151c51,54
< Debug: Key ENTER pressed
< Debug: Deleting TLS from junction 'J0'
< Debug: Adding TLS into junction 'J0'
< Debug: Key ESC (abort) pressed
< Debug: Keys Ctrl+Z (Undo) pressed
< Debug: Calling GNEUndoList::undo()
< Debug: Removing TLS from junction 'J0'
< Debug: Adding TLS into junction 'J0'
< Debug: Keys Ctrl+Y (Redo) pressed
< Debug: Calling GNEUndoList::redo()
< Debug: Deleting TLS from junction 'J0'
< Debug: Adding TLS into junction 'J0'
< Debug: network elements saved
< Debug: Additionals saved
< Debug: demand elements saved
< Debug: Deleting unreferenced routeEmbedded
< Debug: Deleting unreferenced vehicleWithRoute
< Debug: Deleting unreferenced routeEmbedded
< Debug: Deleting unreferenced vehicleWithRoute
< Debug: Deleting unreferenced routeEmbedded
< Debug: Deleting unreferenced vehicleWithRoute
< Debug: Deleting unreferenced routeEmbedded
< Debug: Deleting unreferenced vehicleWithRoute
< Debug: Deleting unreferenced inductionLoop
< Debug: Deleting unreferenced inductionLoop
< Debug: Deleting unreferenced inductionLoop
< Debug: Deleting unreferenced inductionLoop
< Debug: Deleting unreferenced inductionLoop
< Debug: Deleting unreferenced inductionLoop
<truncated after showing first 30 lines>
---------- Differences in output ----------
5,11d4
< dummyOffset
< -20
< 13
< TestFunctions: Clicked over position 304 - 168
< TestFunctions: Clicked over position 304 - 168
< TestFunctions: Clicked over position 304 - 168
< TestFunctions: Netedit closed successfully
---------- New result in exitcode ----------
1
---------- Missing result in additionals ----------
<?xml version="1.0" encoding="UTF-8"?>


<additional xmlns:xsi="http://www.w3.org/2001/XMLSchema-instance" xsi:noNamespaceSchemaLocation="http://sumo.dlr.de/xsd/additional_file.xsd">
    <!-- Detectors -->
    <inductionLoop id="E1_00" lane="-E2_1" pos="10.00" period="300.00" file="e1_5.xml"/>
    <inductionLoop id="E1_01" lane="-E2_2" pos="10.00" period="300.00" file="e1_4.xml"/>
    <inductionLoop id="E1_02" lane="E2_2" pos="-10.00" period="300.00" file="e1_5.xml"/>
    <inductionLoop id="E1_03" lane="E2_1" pos="-10.00" period="300.00" file="e1_4.xml"/>
    <inductionLoop id="E1_04" lane="-E1_1" pos="10.00" period="300.00" file="e1_2.xml"/>
    <inductionLoop id="E1_05" lane="-E1_2" pos="10.00" period="300.00" file="e1_3.xml"/>
    <inductionLoop id="E1_06" lane="E1_2" pos="-10.00" period="300.00" file="e1_2.xml"/>
    <inductionLoop id="E1_07" lane="E1_1" pos="-10.00" period="300.00" file="e1_7.xml"/>
    <inductionLoop id="E1_08" lane="-E3_1" pos="10.00" period="300.00" file="e1_1.xml"/>
    <inductionLoop id="E1_09" lane="-E3_2" pos="10.00" period="300.00" file="e1_6.xml"/>
    <inductionLoop id="E1_10" lane="E3_2" pos="-10.00" period="300.00" file="e1_7.xml"/>
    <inductionLoop id="E1_11" lane="E3_1" pos="-10.00" period="300.00" file="e1_0.xml"/>
    <inductionLoop id="E1_12" lane="-E0_1" pos="10.00" period="300.00" file="e1_3.xml"/>
    <inductionLoop id="E1_13" lane="-E0_2" pos="10.00" period="300.00" file="e1_1.xml"/>
    <inductionLoop id="E1_14" lane="E0_2" pos="-10.00" period="300.00" file="e1_0.xml"/>
    <inductionLoop id="E1_15" lane="E0_1" pos="-10.00" period="300.00" file="e1_6.xml"/>
</additional>
---------- Missing result in guisettingsoutput ----------
<viewsettings>
    <viewport zoom="100.00" x="0.00" y="50.00" angle="0.00"/>
</viewsettings>
---------- Missing result in net ----------
<?xml version="1.0" encoding="UTF-8"?>


<net version="1.9" junctionCornerDetail="5" limitTurnSpeed="5.50" xmlns:xsi="http://www.w3.org/2001/XMLSchema-instance" xsi:noNamespaceSchemaLocation="http://sumo.dlr.de/xsd/net_file.xsd">

    <location netOffset="0.00,0.00" convBoundary="-30.00,20.00,30.00,80.00" origBoundary="-10000000000.00,-10000000000.00,10000000000.00,10000000000.00" projParameter="!"/>

    <edge id=":J0_0" function="internal">
        <lane id=":J0_0_0" index="0" disallow="pedestrian" speed="6.86" length="10.16" shape="-4.80,61.10 -5.19,58.34 -6.37,56.38 -8.34,55.19 -11.10,54.80"/>
        <lane id=":J0_0_1" index="1" disallow="pedestrian" speed="8.29" length="15.32" shape="-1.60,61.10 -2.19,56.94 -3.97,53.98 -6.94,52.19 -11.10,51.60"/>
    </edge>
    <edge id=":J0_2" function="internal">
        <lane id=":J0_2_0" index="0" disallow="pedestrian" speed="13.89" length="22.20" shape="-1.60,61.10 -1.60,38.90"/>
    </edge>
    <edge id=":J0_3" function="internal">
        <lane id=":J0_3_0" index="0" disallow="pedestrian" speed="9.51" length="5.01" shape="-1.60,61.10 -0.89,56.14"/>
    </edge>
    <edge id=":J0_16" function="internal">
        <lane id=":J0_16_0" index="0" disallow="pedestrian" speed="9.51" length="15.47" shape="-0.89,56.14 -0.81,55.54 1.57,51.58 5.54,49.19 11.10,48.40"/>
    </edge>
    <edge id=":J0_4" function="internal">
        <lane id=":J0_4_0" index="0" disallow="pedestrian" speed="6.86" length="10.16" shape="11.10,54.80 8.34,55.19 6.37,56.37 5.19,58.34 4.80,61.10"/>
        <lane id=":J0_4_1" index="1" disallow="pedestrian" speed="8.29" length="15.32" shape="11.10,51.60 6.94,52.19 3.98,53.98 2.19,56.94 1.60,61.10"/>
    </edge>
    <edge id=":J0_6" function="internal">
        <lane id=":J0_6_0" index="0" disallow="pedestrian" speed="13.89" length="22.20" shape="11.10,51.60 -11.10,51.60"/>
    </edge>
    <edge id=":J0_7" function="internal">
        <lane id=":J0_7_0" index="0" disallow="pedestrian" speed="9.51" length="5.01" shape="11.10,51.60 6.14,50.89"/>
    </edge>
<truncated after showing first 30 lines>
---------- Missing result in routes ----------
<?xml version="1.0" encoding="UTF-8"?>


<routes xmlns:xsi="http://www.w3.org/2001/XMLSchema-instance" xsi:noNamespaceSchemaLocation="http://sumo.dlr.de/xsd/routes_file.xsd">
    <!-- Vehicles, persons and containers (sorted by depart) -->
    <vehicle id="trip_1" depart="0.00">
        <route edges="-E2 E3 -E3 E2" repeat="10"/>
    </vehicle>
    <vehicle id="trip_2" depart="0.00">
        <route edges="-E1 E0 -E0 E1" repeat="10"/>
    </vehicle>
    <vehicle id="trip_3" depart="0.00">
        <route edges="-E3 E2 -E2 E3" repeat="10"/>
    </vehicle>
    <vehicle id="trip_4" depart="0.00">
        <route edges="-E0 E1 -E1 E0" repeat="10"/>
    </vehicle>
</routes>
netelements trafficlights joined attributes offset ( Last six runs Oct2022 )
netelements trafficlights single attributes offset ( Last six runs Oct2022 )

TEST FAILED on ts-sim-build-ba : netelements trafficlights joined attributes parameters ( Last six runs Oct2022 )

---------- Differences in errors ----------
68,192c68,71
< Debug: Key ENTER pressed
< Debug: Deleting TLS from junction 'J0'
< Debug: Adding TLS into junction 'J0'
< Debug: Deleting TLS from junction 'J1'
< Debug: Adding TLS into junction 'J1'
< Debug: Deleting TLS from junction 'J2'
< Debug: Adding TLS into junction 'J2'
< Debug: Deleting TLS from junction 'J3'
< Debug: Adding TLS into junction 'J3'
< Debug: Deleting TLS from junction 'J4'
< Debug: Adding TLS into junction 'J4'
< Debug: Key ESC (abort) pressed
< Debug: Keys Ctrl+Z (Undo) pressed
< Debug: Calling GNEUndoList::undo()
< Debug: Removing TLS from junction 'J4'
< Debug: Adding TLS into junction 'J4'
< Debug: Removing TLS from junction 'J3'
< Debug: Adding TLS into junction 'J3'
< Debug: Removing TLS from junction 'J2'
< Debug: Adding TLS into junction 'J2'
< Debug: Removing TLS from junction 'J1'
< Debug: Adding TLS into junction 'J1'
< Debug: Removing TLS from junction 'J0'
< Debug: Adding TLS into junction 'J0'
< Debug: Keys Ctrl+Y (Redo) pressed
< Debug: Calling GNEUndoList::redo()
< Debug: Deleting TLS from junction 'J0'
< Debug: Adding TLS into junction 'J0'
< Debug: Deleting TLS from junction 'J1'
<truncated after showing first 30 lines>
---------- Differences in log ----------
1,10d0
< Warning: Unreachable edge '-E2' within tlLogic 'J0'
< Warning: Unreachable edge '-E1' within tlLogic 'J0'
< Warning: Unreachable edge '-E3' within tlLogic 'J0'
< Warning: Unreachable edge '-E0' within tlLogic 'J0'
< Warning: Unreachable edge 'E0' within tlLogic 'J0'
< Warning: Unreachable edge 'E1' within tlLogic 'J0'
< Warning: Unreachable edge 'E2' within tlLogic 'J0'
< Warning: Unreachable edge 'E3' within tlLogic 'J0'
< Warning: The traffic light 'J0' cannot be adapted to a cycle time of 90.00.
< Warning: The traffic light 'J0' has a high cycle time of 258.00.
---------- Differences in output ----------
9,15d8
< dummyGenericParameters
< key1|key2|key3
< keyFinal1=value1|keyFinal2=value2|keyFinal3=value3
< TestFunctions: Clicked over position 304 - 168
< TestFunctions: Clicked over position 304 - 168
< TestFunctions: Clicked over position 304 - 168
< TestFunctions: Netedit closed successfully
---------- New result in exitcode ----------
1
---------- Missing result in additionals ----------
<?xml version="1.0" encoding="UTF-8"?>


<additional xmlns:xsi="http://www.w3.org/2001/XMLSchema-instance" xsi:noNamespaceSchemaLocation="http://sumo.dlr.de/xsd/additional_file.xsd">
    <!-- Detectors -->
    <inductionLoop id="E1_00" lane="-E2_1" pos="10.00" period="300.00" file="e1_5.xml"/>
    <inductionLoop id="E1_01" lane="-E2_2" pos="10.00" period="300.00" file="e1_4.xml"/>
    <inductionLoop id="E1_02" lane="E2_2" pos="-10.00" period="300.00" file="e1_5.xml"/>
    <inductionLoop id="E1_03" lane="E2_1" pos="-10.00" period="300.00" file="e1_4.xml"/>
    <inductionLoop id="E1_04" lane="-E1_1" pos="10.00" period="300.00" file="e1_2.xml"/>
    <inductionLoop id="E1_05" lane="-E1_2" pos="10.00" period="300.00" file="e1_3.xml"/>
    <inductionLoop id="E1_06" lane="E1_2" pos="-10.00" period="300.00" file="e1_2.xml"/>
    <inductionLoop id="E1_07" lane="E1_1" pos="-10.00" period="300.00" file="e1_7.xml"/>
    <inductionLoop id="E1_08" lane="-E3_1" pos="10.00" period="300.00" file="e1_1.xml"/>
    <inductionLoop id="E1_09" lane="-E3_2" pos="10.00" period="300.00" file="e1_6.xml"/>
    <inductionLoop id="E1_10" lane="E3_2" pos="-10.00" period="300.00" file="e1_7.xml"/>
    <inductionLoop id="E1_11" lane="E3_1" pos="-10.00" period="300.00" file="e1_0.xml"/>
    <inductionLoop id="E1_12" lane="-E0_1" pos="10.00" period="300.00" file="e1_3.xml"/>
    <inductionLoop id="E1_13" lane="-E0_2" pos="10.00" period="300.00" file="e1_1.xml"/>
    <inductionLoop id="E1_14" lane="E0_2" pos="-10.00" period="300.00" file="e1_0.xml"/>
    <inductionLoop id="E1_15" lane="E0_1" pos="-10.00" period="300.00" file="e1_6.xml"/>
</additional>
---------- Missing result in guisettingsoutput ----------
<viewsettings>
    <viewport zoom="100.00" x="0.00" y="50.00" angle="0.00"/>
</viewsettings>
---------- Missing result in net ----------
<?xml version="1.0" encoding="UTF-8"?>


<net version="1.9" junctionCornerDetail="5" limitTurnSpeed="5.50" xmlns:xsi="http://www.w3.org/2001/XMLSchema-instance" xsi:noNamespaceSchemaLocation="http://sumo.dlr.de/xsd/net_file.xsd">

    <location netOffset="0.00,0.00" convBoundary="-30.00,20.00,30.00,80.00" origBoundary="-10000000000.00,-10000000000.00,10000000000.00,10000000000.00" projParameter="!"/>

    <edge id=":J0_0" function="internal">
        <lane id=":J0_0_0" index="0" disallow="pedestrian" speed="6.86" length="10.16" shape="-4.80,61.10 -5.19,58.34 -6.37,56.38 -8.34,55.19 -11.10,54.80"/>
        <lane id=":J0_0_1" index="1" disallow="pedestrian" speed="8.29" length="15.32" shape="-1.60,61.10 -2.19,56.94 -3.97,53.98 -6.94,52.19 -11.10,51.60"/>
    </edge>
    <edge id=":J0_2" function="internal">
        <lane id=":J0_2_0" index="0" disallow="pedestrian" speed="13.89" length="22.20" shape="-1.60,61.10 -1.60,38.90"/>
    </edge>
    <edge id=":J0_3" function="internal">
        <lane id=":J0_3_0" index="0" disallow="pedestrian" speed="9.51" length="5.01" shape="-1.60,61.10 -0.89,56.14"/>
    </edge>
    <edge id=":J0_16" function="internal">
        <lane id=":J0_16_0" index="0" disallow="pedestrian" speed="9.51" length="15.47" shape="-0.89,56.14 -0.81,55.54 1.57,51.58 5.54,49.19 11.10,48.40"/>
    </edge>
    <edge id=":J0_4" function="internal">
        <lane id=":J0_4_0" index="0" disallow="pedestrian" speed="6.86" length="10.16" shape="11.10,54.80 8.34,55.19 6.37,56.37 5.19,58.34 4.80,61.10"/>
        <lane id=":J0_4_1" index="1" disallow="pedestrian" speed="8.29" length="15.32" shape="11.10,51.60 6.94,52.19 3.98,53.98 2.19,56.94 1.60,61.10"/>
    </edge>
    <edge id=":J0_6" function="internal">
        <lane id=":J0_6_0" index="0" disallow="pedestrian" speed="13.89" length="22.20" shape="11.10,51.60 -11.10,51.60"/>
    </edge>
    <edge id=":J0_7" function="internal">
        <lane id=":J0_7_0" index="0" disallow="pedestrian" speed="9.51" length="5.01" shape="11.10,51.60 6.14,50.89"/>
    </edge>
<truncated after showing first 30 lines>
---------- Missing result in routes ----------
<?xml version="1.0" encoding="UTF-8"?>


<routes xmlns:xsi="http://www.w3.org/2001/XMLSchema-instance" xsi:noNamespaceSchemaLocation="http://sumo.dlr.de/xsd/routes_file.xsd">
    <!-- Vehicles, persons and containers (sorted by depart) -->
    <vehicle id="trip_1" depart="0.00">
        <route edges="-E2 E3 -E3 E2" repeat="10"/>
    </vehicle>
    <vehicle id="trip_2" depart="0.00">
        <route edges="-E1 E0 -E0 E1" repeat="10"/>
    </vehicle>
    <vehicle id="trip_3" depart="0.00">
        <route edges="-E3 E2 -E2 E3" repeat="10"/>
    </vehicle>
    <vehicle id="trip_4" depart="0.00">
        <route edges="-E0 E1 -E1 E0" repeat="10"/>
    </vehicle>
</routes>

TEST FAILED on ts-sim-build-ba : netelements trafficlights joined phases NEMA buttons add duplicate ( Last six runs Oct2022 )

---------- Differences in errors ----------
87c87
< Debug: Duplicated phase 2
---
> Debug: Duplicated phase 3
123a124,149
> Debug: network elements saved
> Debug: network elements saved
> Debug: network elements saved
> Debug: network elements saved
> Debug: network elements saved
> Debug: network elements saved
> Debug: network elements saved
> Debug: network elements saved
> Debug: network elements saved
> Debug: network elements saved
> Debug: network elements saved
> Debug: network elements saved
> Debug: network elements saved
> Debug: network elements saved
> Debug: network elements saved
> Debug: network elements saved
> Debug: network elements saved
> Debug: network elements saved
> Debug: network elements saved
> Debug: network elements saved
> Debug: network elements saved
> Debug: network elements saved
> Debug: network elements saved
> Debug: network elements saved
> Debug: network elements saved
<truncated after showing first 30 lines>
---------- Differences in net ----------
189,190c189,190
<         <phase duration="180" state="rrrrrrrrrrrrrrrrrrrrrrrrrrrrrrrrrrrrrGGr" minDur="10" maxDur="210" vehext="2" yellow="3" red="2" name="6"/>
<         <phase duration="90" state="rrrrrrrrrrrrrrrrrrrGGrrrrrrrrrrrrrrrrrrr" minDur="5" maxDur="105" vehext="2" yellow="3" red="2" name="4"/>
---
>         <phase duration="90" state="rrrrrrrrrrrrrrrrrrrrrrrrrrrrrrrrrrrrrGGr" minDur="5" maxDur="105" vehext="2" yellow="3" red="2" name="6"/>
>         <phase duration="180" state="rrrrrrrrrrrrrrrrrrrGGrrrrrrrrrrrrrrrrrrr" minDur="10" maxDur="210" vehext="2" yellow="3" red="2" name="4"/>

TEST FAILED on ts-sim-build-ba : netelements trafficlights joined phases NEMA buttons add red ( Last six runs Oct2022 )

---------- Differences in errors ----------
87c87
< Debug: Add new phase in row 2 of type: r
---
> Debug: Add new phase in row 3 of type: r
---------- Differences in net ----------
190d189
<         <phase duration="90" state="rrrrrrrrrrrrrrrrrrrrrrrrrrrrrrrrrrrrrrrr" minDur="5" maxDur="50" vehext="2" yellow="3" red="2" name="1"/>
191a191
>         <phase duration="90" state="rrrrrrrrrrrrrrrrrrrrrrrrrrrrrrrrrrrrrrrr" minDur="5" maxDur="50" vehext="2" yellow="3" red="2" name="1"/>

TEST FAILED on ts-sim-build-ba : netelements trafficlights joined phases NEMA buttons addstates ( Last six runs Oct2022 )

---------- Differences in errors ----------
110a111,113
> Debug: Keys Ctrl+Z (Undo) pressed
> Debug: Calling GNEUndoList::undo()
> Debug: Restoring previous attribute
113,122c116
< Debug: Deleting TLS from junction 'J0'
< Debug: Adding TLS into junction 'J0'
< Debug: Deleting TLS from junction 'J1'
< Debug: Adding TLS into junction 'J1'
< Debug: Deleting TLS from junction 'J2'
< Debug: Adding TLS into junction 'J2'
< Debug: Deleting TLS from junction 'J3'
< Debug: Adding TLS into junction 'J3'
< Debug: Deleting TLS from junction 'J4'
< Debug: Adding TLS into junction 'J4'
---
> Debug: Setting new attribute
---------- Differences in net ----------
16c16,19
<         <lane id=":J0_3_0" index="0" disallow="pedestrian" speed="9.51" length="20.48" shape="-1.60,61.10 -0.81,55.54 1.57,51.58 5.54,49.19 11.10,48.40"/>
---
>         <lane id=":J0_3_0" index="0" disallow="pedestrian" speed="9.51" length="5.01" shape="-1.60,61.10 -0.89,56.14"/>
>     </edge>
>     <edge id=":J0_16" function="internal">
>         <lane id=":J0_16_0" index="0" disallow="pedestrian" speed="9.51" length="15.47" shape="-0.89,56.14 -0.81,55.54 1.57,51.58 5.54,49.19 11.10,48.40"/>
26c29,32
<         <lane id=":J0_7_0" index="0" disallow="pedestrian" speed="9.51" length="20.48" shape="11.10,51.60 5.54,50.81 1.58,48.43 -0.81,44.46 -1.60,38.90"/>
---
>         <lane id=":J0_7_0" index="0" disallow="pedestrian" speed="9.51" length="5.01" shape="11.10,51.60 6.14,50.89"/>
>     </edge>
>     <edge id=":J0_17" function="internal">
>         <lane id=":J0_17_0" index="0" disallow="pedestrian" speed="9.51" length="15.47" shape="6.14,50.89 5.54,50.81 1.58,48.43 -0.81,44.46 -1.60,38.90"/>
36c42,45
<         <lane id=":J0_11_0" index="0" disallow="pedestrian" speed="9.51" length="20.48" shape="1.60,38.90 0.81,44.46 -1.57,48.42 -5.54,50.81 -11.10,51.60"/>
---
>         <lane id=":J0_11_0" index="0" disallow="pedestrian" speed="9.51" length="5.01" shape="1.60,38.90 0.89,43.86"/>
>     </edge>
>     <edge id=":J0_18" function="internal">
>         <lane id=":J0_18_0" index="0" disallow="pedestrian" speed="9.51" length="15.47" shape="0.89,43.86 0.81,44.46 -1.57,48.42 -5.54,50.81 -11.10,51.60"/>
46c55,58
<         <lane id=":J0_15_0" index="0" disallow="pedestrian" speed="9.51" length="20.48" shape="-11.10,48.40 -5.54,49.19 -1.58,51.57 0.81,55.54 1.60,61.10"/>
---
>         <lane id=":J0_15_0" index="0" disallow="pedestrian" speed="9.51" length="5.01" shape="-11.10,48.40 -6.14,49.11"/>
>     </edge>
>     <edge id=":J0_19" function="internal">
>         <lane id=":J0_19_0" index="0" disallow="pedestrian" speed="9.51" length="15.47" shape="-6.14,49.11 -5.54,49.19 -1.58,51.57 0.81,55.54 1.60,61.10"/>
53c65,68
<         <lane id=":J1_2_0" index="0" disallow="pedestrian" speed="3.65" length="4.67" shape="-23.91,51.60 -25.11,50.80 -25.51,50.00 -25.11,49.20 -23.91,48.40"/>
<truncated after showing first 30 lines>

TEST FAILED on ts-sim-build-ba : netelements trafficlights joined phases NEMA buttons movedown ( Last six runs Oct2022 )

---------- Differences in errors ----------
85a86
> Debug: Key ENTER pressed

TEST FAILED on ts-sim-build-ba : netelements trafficlights joined phases NEMA buttons ungroupsignals ( Last six runs Oct2022 )

---------- Differences in errors ----------
268d267
< X connection to :18336.0 broken (explicit kill or server shutdown).

TEST FAILED on ts-sim-build-ba : netelements trafficlights joined phases NEMA dur ( Last six runs Oct2022 )

---------- Differences in errors ----------
88,99c88,89
< Debug: Valid dur
< Debug: Key ENTER pressed
< Debug: Deleting TLS from junction 'J0'
< Debug: Adding TLS into junction 'J0'
< Debug: Deleting TLS from junction 'J1'
< Debug: Adding TLS into junction 'J1'
< Debug: Deleting TLS from junction 'J2'
< Debug: Adding TLS into junction 'J2'
< Debug: Deleting TLS from junction 'J3'
< Debug: Adding TLS into junction 'J3'
< Debug: Deleting TLS from junction 'J4'
< Debug: Adding TLS into junction 'J4'
---
> Debug: Invalid dur
> Debug: Invalid dur
103,112c93
< Debug: Removing TLS from junction 'J4'
< Debug: Adding TLS into junction 'J4'
< Debug: Removing TLS from junction 'J3'
< Debug: Adding TLS into junction 'J3'
< Debug: Removing TLS from junction 'J2'
< Debug: Adding TLS into junction 'J2'
< Debug: Removing TLS from junction 'J1'
< Debug: Adding TLS into junction 'J1'
< Debug: Removing TLS from junction 'J0'
< Debug: Adding TLS into junction 'J0'
---
> Debug: Restoring previous attribute
115,124c96
<truncated after showing first 30 lines>
---------- Differences in net ----------
16c16,19
<         <lane id=":J0_3_0" index="0" disallow="pedestrian" speed="9.51" length="20.48" shape="-1.60,61.10 -0.81,55.54 1.57,51.58 5.54,49.19 11.10,48.40"/>
---
>         <lane id=":J0_3_0" index="0" disallow="pedestrian" speed="9.51" length="5.01" shape="-1.60,61.10 -0.89,56.14"/>
>     </edge>
>     <edge id=":J0_16" function="internal">
>         <lane id=":J0_16_0" index="0" disallow="pedestrian" speed="9.51" length="15.47" shape="-0.89,56.14 -0.81,55.54 1.57,51.58 5.54,49.19 11.10,48.40"/>
26c29,32
<         <lane id=":J0_7_0" index="0" disallow="pedestrian" speed="9.51" length="20.48" shape="11.10,51.60 5.54,50.81 1.58,48.43 -0.81,44.46 -1.60,38.90"/>
---
>         <lane id=":J0_7_0" index="0" disallow="pedestrian" speed="9.51" length="5.01" shape="11.10,51.60 6.14,50.89"/>
>     </edge>
>     <edge id=":J0_17" function="internal">
>         <lane id=":J0_17_0" index="0" disallow="pedestrian" speed="9.51" length="15.47" shape="6.14,50.89 5.54,50.81 1.58,48.43 -0.81,44.46 -1.60,38.90"/>
36c42,45
<         <lane id=":J0_11_0" index="0" disallow="pedestrian" speed="9.51" length="20.48" shape="1.60,38.90 0.81,44.46 -1.57,48.42 -5.54,50.81 -11.10,51.60"/>
---
>         <lane id=":J0_11_0" index="0" disallow="pedestrian" speed="9.51" length="5.01" shape="1.60,38.90 0.89,43.86"/>
>     </edge>
>     <edge id=":J0_18" function="internal">
>         <lane id=":J0_18_0" index="0" disallow="pedestrian" speed="9.51" length="15.47" shape="0.89,43.86 0.81,44.46 -1.57,48.42 -5.54,50.81 -11.10,51.60"/>
46c55,58
<         <lane id=":J0_15_0" index="0" disallow="pedestrian" speed="9.51" length="20.48" shape="-11.10,48.40 -5.54,49.19 -1.58,51.57 0.81,55.54 1.60,61.10"/>
---
>         <lane id=":J0_15_0" index="0" disallow="pedestrian" speed="9.51" length="5.01" shape="-11.10,48.40 -6.14,49.11"/>
>     </edge>
>     <edge id=":J0_19" function="internal">
>         <lane id=":J0_19_0" index="0" disallow="pedestrian" speed="9.51" length="15.47" shape="-6.14,49.11 -5.54,49.19 -1.58,51.57 0.81,55.54 1.60,61.10"/>
53c65,68
<         <lane id=":J1_2_0" index="0" disallow="pedestrian" speed="3.65" length="4.67" shape="-23.91,51.60 -25.11,50.80 -25.51,50.00 -25.11,49.20 -23.91,48.40"/>
<truncated after showing first 30 lines>

TEST FAILED on ts-sim-build-ba : netelements trafficlights joined phases NEMA max ( Last six runs Oct2022 )

---------- Differences in errors ----------
84,100c84,85
< Debug: Setting new attribute
< Debug: Key ENTER pressed
< Debug: Invalid max
< Debug: Invalid max
< Debug: Valid max
< Debug: Key ENTER pressed
< Debug: Deleting TLS from junction 'J0'
< Debug: Adding TLS into junction 'J0'
< Debug: Deleting TLS from junction 'J1'
< Debug: Adding TLS into junction 'J1'
< Debug: Deleting TLS from junction 'J2'
< Debug: Adding TLS into junction 'J2'
< Debug: Deleting TLS from junction 'J3'
< Debug: Adding TLS into junction 'J3'
< Debug: Deleting TLS from junction 'J4'
< Debug: Adding TLS into junction 'J4'
< Debug: Key ESC (abort) pressed
---
> Debug: Open additional dialog
> Debug: Cancel additional dialog
104a90,91
> Debug: Restoring previous attribute
> Debug: Removing TLS from junction 'J4'
106a94,95
> Debug: Restoring previous attribute
> Debug: Removing TLS from junction 'J3'
108a98,99
> Debug: Restoring previous attribute
> Debug: Removing TLS from junction 'J2'
<truncated after showing first 30 lines>
---------- Differences in net ----------
16c16,19
<         <lane id=":J0_3_0" index="0" disallow="pedestrian" speed="9.51" length="20.48" shape="-1.60,61.10 -0.81,55.54 1.57,51.58 5.54,49.19 11.10,48.40"/>
---
>         <lane id=":J0_3_0" index="0" disallow="pedestrian" speed="9.51" length="5.01" shape="-1.60,61.10 -0.89,56.14"/>
>     </edge>
>     <edge id=":J0_16" function="internal">
>         <lane id=":J0_16_0" index="0" disallow="pedestrian" speed="9.51" length="15.47" shape="-0.89,56.14 -0.81,55.54 1.57,51.58 5.54,49.19 11.10,48.40"/>
26c29,32
<         <lane id=":J0_7_0" index="0" disallow="pedestrian" speed="9.51" length="20.48" shape="11.10,51.60 5.54,50.81 1.58,48.43 -0.81,44.46 -1.60,38.90"/>
---
>         <lane id=":J0_7_0" index="0" disallow="pedestrian" speed="9.51" length="5.01" shape="11.10,51.60 6.14,50.89"/>
>     </edge>
>     <edge id=":J0_17" function="internal">
>         <lane id=":J0_17_0" index="0" disallow="pedestrian" speed="9.51" length="15.47" shape="6.14,50.89 5.54,50.81 1.58,48.43 -0.81,44.46 -1.60,38.90"/>
36c42,45
<         <lane id=":J0_11_0" index="0" disallow="pedestrian" speed="9.51" length="20.48" shape="1.60,38.90 0.81,44.46 -1.57,48.42 -5.54,50.81 -11.10,51.60"/>
---
>         <lane id=":J0_11_0" index="0" disallow="pedestrian" speed="9.51" length="5.01" shape="1.60,38.90 0.89,43.86"/>
>     </edge>
>     <edge id=":J0_18" function="internal">
>         <lane id=":J0_18_0" index="0" disallow="pedestrian" speed="9.51" length="15.47" shape="0.89,43.86 0.81,44.46 -1.57,48.42 -5.54,50.81 -11.10,51.60"/>
46c55,58
<         <lane id=":J0_15_0" index="0" disallow="pedestrian" speed="9.51" length="20.48" shape="-11.10,48.40 -5.54,49.19 -1.58,51.57 0.81,55.54 1.60,61.10"/>
---
>         <lane id=":J0_15_0" index="0" disallow="pedestrian" speed="9.51" length="5.01" shape="-11.10,48.40 -6.14,49.11"/>
>     </edge>
>     <edge id=":J0_19" function="internal">
>         <lane id=":J0_19_0" index="0" disallow="pedestrian" speed="9.51" length="15.47" shape="-6.14,49.11 -5.54,49.19 -1.58,51.57 0.81,55.54 1.60,61.10"/>
53c65,68
<         <lane id=":J1_2_0" index="0" disallow="pedestrian" speed="3.65" length="4.67" shape="-23.91,51.60 -25.11,50.80 -25.51,50.00 -25.11,49.20 -23.91,48.40"/>
<truncated after showing first 30 lines>

TEST FAILED on ts-sim-build-ba : netelements trafficlights joined phases NEMA min ( Last six runs Oct2022 )

---------- Differences in errors ----------
84,100c84,85
< Debug: Setting new attribute
< Debug: Key ENTER pressed
< Debug: Invalid min
< Debug: Invalid min
< Debug: Valid min
< Debug: Key ENTER pressed
< Debug: Deleting TLS from junction 'J0'
< Debug: Adding TLS into junction 'J0'
< Debug: Deleting TLS from junction 'J1'
< Debug: Adding TLS into junction 'J1'
< Debug: Deleting TLS from junction 'J2'
< Debug: Adding TLS into junction 'J2'
< Debug: Deleting TLS from junction 'J3'
< Debug: Adding TLS into junction 'J3'
< Debug: Deleting TLS from junction 'J4'
< Debug: Adding TLS into junction 'J4'
< Debug: Key ESC (abort) pressed
---
> Debug: Open additional dialog
> Debug: Cancel additional dialog
104a90,91
> Debug: Restoring previous attribute
> Debug: Removing TLS from junction 'J4'
106a94,95
> Debug: Restoring previous attribute
> Debug: Removing TLS from junction 'J3'
108a98,99
> Debug: Restoring previous attribute
> Debug: Removing TLS from junction 'J2'
<truncated after showing first 30 lines>
---------- Differences in net ----------
16c16,19
<         <lane id=":J0_3_0" index="0" disallow="pedestrian" speed="9.51" length="20.48" shape="-1.60,61.10 -0.81,55.54 1.57,51.58 5.54,49.19 11.10,48.40"/>
---
>         <lane id=":J0_3_0" index="0" disallow="pedestrian" speed="9.51" length="5.01" shape="-1.60,61.10 -0.89,56.14"/>
>     </edge>
>     <edge id=":J0_16" function="internal">
>         <lane id=":J0_16_0" index="0" disallow="pedestrian" speed="9.51" length="15.47" shape="-0.89,56.14 -0.81,55.54 1.57,51.58 5.54,49.19 11.10,48.40"/>
26c29,32
<         <lane id=":J0_7_0" index="0" disallow="pedestrian" speed="9.51" length="20.48" shape="11.10,51.60 5.54,50.81 1.58,48.43 -0.81,44.46 -1.60,38.90"/>
---
>         <lane id=":J0_7_0" index="0" disallow="pedestrian" speed="9.51" length="5.01" shape="11.10,51.60 6.14,50.89"/>
>     </edge>
>     <edge id=":J0_17" function="internal">
>         <lane id=":J0_17_0" index="0" disallow="pedestrian" speed="9.51" length="15.47" shape="6.14,50.89 5.54,50.81 1.58,48.43 -0.81,44.46 -1.60,38.90"/>
36c42,45
<         <lane id=":J0_11_0" index="0" disallow="pedestrian" speed="9.51" length="20.48" shape="1.60,38.90 0.81,44.46 -1.57,48.42 -5.54,50.81 -11.10,51.60"/>
---
>         <lane id=":J0_11_0" index="0" disallow="pedestrian" speed="9.51" length="5.01" shape="1.60,38.90 0.89,43.86"/>
>     </edge>
>     <edge id=":J0_18" function="internal">
>         <lane id=":J0_18_0" index="0" disallow="pedestrian" speed="9.51" length="15.47" shape="0.89,43.86 0.81,44.46 -1.57,48.42 -5.54,50.81 -11.10,51.60"/>
46c55,58
<         <lane id=":J0_15_0" index="0" disallow="pedestrian" speed="9.51" length="20.48" shape="-11.10,48.40 -5.54,49.19 -1.58,51.57 0.81,55.54 1.60,61.10"/>
---
>         <lane id=":J0_15_0" index="0" disallow="pedestrian" speed="9.51" length="5.01" shape="-11.10,48.40 -6.14,49.11"/>
>     </edge>
>     <edge id=":J0_19" function="internal">
>         <lane id=":J0_19_0" index="0" disallow="pedestrian" speed="9.51" length="15.47" shape="-6.14,49.11 -5.54,49.19 -1.58,51.57 0.81,55.54 1.60,61.10"/>
53c65,68
<         <lane id=":J1_2_0" index="0" disallow="pedestrian" speed="3.65" length="4.67" shape="-23.91,51.60 -25.11,50.80 -25.51,50.00 -25.11,49.20 -23.91,48.40"/>
<truncated after showing first 30 lines>

TEST FAILED on ts-sim-build-ba : netelements trafficlights joined phases NEMA name ( Last six runs Oct2022 )

---------- Differences in errors ----------
84d83
< Debug: Setting new attribute
86d84
< Debug: Valid name
88,98c86,95
< Debug: Deleting TLS from junction 'J0'
< Debug: Adding TLS into junction 'J0'
< Debug: Deleting TLS from junction 'J1'
< Debug: Adding TLS into junction 'J1'
< Debug: Deleting TLS from junction 'J2'
< Debug: Adding TLS into junction 'J2'
< Debug: Deleting TLS from junction 'J3'
< Debug: Adding TLS into junction 'J3'
< Debug: Deleting TLS from junction 'J4'
< Debug: Adding TLS into junction 'J4'
< Debug: Key ESC (abort) pressed
---
> Debug: Key ENTER pressed
> Debug: Key ENTER pressed
> Debug: Key ENTER pressed
> Debug: Key ENTER pressed
> Debug: Key ENTER pressed
> Debug: Key ENTER pressed
> Debug: Key ENTER pressed
> Debug: Key ENTER pressed
> Debug: Open additional dialog
> Debug: Cancel additional dialog
102a100,101
> Debug: Restoring previous attribute
> Debug: Removing TLS from junction 'J4'
<truncated after showing first 30 lines>
---------- Differences in net ----------
16c16,19
<         <lane id=":J0_3_0" index="0" disallow="pedestrian" speed="9.51" length="20.48" shape="-1.60,61.10 -0.81,55.54 1.57,51.58 5.54,49.19 11.10,48.40"/>
---
>         <lane id=":J0_3_0" index="0" disallow="pedestrian" speed="9.51" length="5.01" shape="-1.60,61.10 -0.89,56.14"/>
>     </edge>
>     <edge id=":J0_16" function="internal">
>         <lane id=":J0_16_0" index="0" disallow="pedestrian" speed="9.51" length="15.47" shape="-0.89,56.14 -0.81,55.54 1.57,51.58 5.54,49.19 11.10,48.40"/>
26c29,32
<         <lane id=":J0_7_0" index="0" disallow="pedestrian" speed="9.51" length="20.48" shape="11.10,51.60 5.54,50.81 1.58,48.43 -0.81,44.46 -1.60,38.90"/>
---
>         <lane id=":J0_7_0" index="0" disallow="pedestrian" speed="9.51" length="5.01" shape="11.10,51.60 6.14,50.89"/>
>     </edge>
>     <edge id=":J0_17" function="internal">
>         <lane id=":J0_17_0" index="0" disallow="pedestrian" speed="9.51" length="15.47" shape="6.14,50.89 5.54,50.81 1.58,48.43 -0.81,44.46 -1.60,38.90"/>
36c42,45
<         <lane id=":J0_11_0" index="0" disallow="pedestrian" speed="9.51" length="20.48" shape="1.60,38.90 0.81,44.46 -1.57,48.42 -5.54,50.81 -11.10,51.60"/>
---
>         <lane id=":J0_11_0" index="0" disallow="pedestrian" speed="9.51" length="5.01" shape="1.60,38.90 0.89,43.86"/>
>     </edge>
>     <edge id=":J0_18" function="internal">
>         <lane id=":J0_18_0" index="0" disallow="pedestrian" speed="9.51" length="15.47" shape="0.89,43.86 0.81,44.46 -1.57,48.42 -5.54,50.81 -11.10,51.60"/>
46c55,58
<         <lane id=":J0_15_0" index="0" disallow="pedestrian" speed="9.51" length="20.48" shape="-11.10,48.40 -5.54,49.19 -1.58,51.57 0.81,55.54 1.60,61.10"/>
---
>         <lane id=":J0_15_0" index="0" disallow="pedestrian" speed="9.51" length="5.01" shape="-11.10,48.40 -6.14,49.11"/>
>     </edge>
>     <edge id=":J0_19" function="internal">
>         <lane id=":J0_19_0" index="0" disallow="pedestrian" speed="9.51" length="15.47" shape="-6.14,49.11 -5.54,49.19 -1.58,51.57 0.81,55.54 1.60,61.10"/>
53c65,68
<         <lane id=":J1_2_0" index="0" disallow="pedestrian" speed="3.65" length="4.67" shape="-23.91,51.60 -25.11,50.80 -25.51,50.00 -25.11,49.20 -23.91,48.40"/>
<truncated after showing first 30 lines>

TEST FAILED on ts-sim-build-ba : netelements trafficlights joined phases NEMA next ( Last six runs Oct2022 )

---------- Differences in errors ----------
84d83
< Debug: Setting new attribute
86,88d84
< Debug: Invalid next
< Debug: Valid next
< Debug: Valid next
90,99c86,87
< Debug: Deleting TLS from junction 'J0'
< Debug: Adding TLS into junction 'J0'
< Debug: Deleting TLS from junction 'J1'
< Debug: Adding TLS into junction 'J1'
< Debug: Deleting TLS from junction 'J2'
< Debug: Adding TLS into junction 'J2'
< Debug: Deleting TLS from junction 'J3'
< Debug: Adding TLS into junction 'J3'
< Debug: Deleting TLS from junction 'J4'
< Debug: Adding TLS into junction 'J4'
---
> Debug: Key ENTER pressed
> Debug: Key ENTER pressed
104a93,94
> Debug: Restoring previous attribute
> Debug: Removing TLS from junction 'J4'
106a97,98
> Debug: Restoring previous attribute
> Debug: Removing TLS from junction 'J3'
108a101,102
> Debug: Restoring previous attribute
> Debug: Removing TLS from junction 'J2'
111,112c105,106
<truncated after showing first 30 lines>
---------- Differences in net ----------
16c16,19
<         <lane id=":J0_3_0" index="0" disallow="pedestrian" speed="9.51" length="20.48" shape="-1.60,61.10 -0.81,55.54 1.57,51.58 5.54,49.19 11.10,48.40"/>
---
>         <lane id=":J0_3_0" index="0" disallow="pedestrian" speed="9.51" length="5.01" shape="-1.60,61.10 -0.89,56.14"/>
>     </edge>
>     <edge id=":J0_16" function="internal">
>         <lane id=":J0_16_0" index="0" disallow="pedestrian" speed="9.51" length="15.47" shape="-0.89,56.14 -0.81,55.54 1.57,51.58 5.54,49.19 11.10,48.40"/>
26c29,32
<         <lane id=":J0_7_0" index="0" disallow="pedestrian" speed="9.51" length="20.48" shape="11.10,51.60 5.54,50.81 1.58,48.43 -0.81,44.46 -1.60,38.90"/>
---
>         <lane id=":J0_7_0" index="0" disallow="pedestrian" speed="9.51" length="5.01" shape="11.10,51.60 6.14,50.89"/>
>     </edge>
>     <edge id=":J0_17" function="internal">
>         <lane id=":J0_17_0" index="0" disallow="pedestrian" speed="9.51" length="15.47" shape="6.14,50.89 5.54,50.81 1.58,48.43 -0.81,44.46 -1.60,38.90"/>
36c42,45
<         <lane id=":J0_11_0" index="0" disallow="pedestrian" speed="9.51" length="20.48" shape="1.60,38.90 0.81,44.46 -1.57,48.42 -5.54,50.81 -11.10,51.60"/>
---
>         <lane id=":J0_11_0" index="0" disallow="pedestrian" speed="9.51" length="5.01" shape="1.60,38.90 0.89,43.86"/>
>     </edge>
>     <edge id=":J0_18" function="internal">
>         <lane id=":J0_18_0" index="0" disallow="pedestrian" speed="9.51" length="15.47" shape="0.89,43.86 0.81,44.46 -1.57,48.42 -5.54,50.81 -11.10,51.60"/>
46c55,58
<         <lane id=":J0_15_0" index="0" disallow="pedestrian" speed="9.51" length="20.48" shape="-11.10,48.40 -5.54,49.19 -1.58,51.57 0.81,55.54 1.60,61.10"/>
---
>         <lane id=":J0_15_0" index="0" disallow="pedestrian" speed="9.51" length="5.01" shape="-11.10,48.40 -6.14,49.11"/>
>     </edge>
>     <edge id=":J0_19" function="internal">
>         <lane id=":J0_19_0" index="0" disallow="pedestrian" speed="9.51" length="15.47" shape="-6.14,49.11 -5.54,49.19 -1.58,51.57 0.81,55.54 1.60,61.10"/>
53c65,68
<         <lane id=":J1_2_0" index="0" disallow="pedestrian" speed="3.65" length="4.67" shape="-23.91,51.60 -25.11,50.80 -25.51,50.00 -25.11,49.20 -23.91,48.40"/>
<truncated after showing first 30 lines>

TEST FAILED on ts-sim-build-ba : netelements trafficlights joined phases NEMA red ( Last six runs Oct2022 )

---------- Differences in errors ----------
84,100c84,85
< Debug: Setting new attribute
< Debug: Key ENTER pressed
< Debug: Invalid red
< Debug: Invalid red
< Debug: Valid red
< Debug: Key ENTER pressed
< Debug: Deleting TLS from junction 'J0'
< Debug: Adding TLS into junction 'J0'
< Debug: Deleting TLS from junction 'J1'
< Debug: Adding TLS into junction 'J1'
< Debug: Deleting TLS from junction 'J2'
< Debug: Adding TLS into junction 'J2'
< Debug: Deleting TLS from junction 'J3'
< Debug: Adding TLS into junction 'J3'
< Debug: Deleting TLS from junction 'J4'
< Debug: Adding TLS into junction 'J4'
< Debug: Key ESC (abort) pressed
---
> Debug: Open additional dialog
> Debug: Cancel additional dialog
104a90,91
> Debug: Restoring previous attribute
> Debug: Removing TLS from junction 'J4'
106a94,95
> Debug: Restoring previous attribute
> Debug: Removing TLS from junction 'J3'
108a98,99
> Debug: Restoring previous attribute
> Debug: Removing TLS from junction 'J2'
<truncated after showing first 30 lines>
---------- Differences in net ----------
16c16,19
<         <lane id=":J0_3_0" index="0" disallow="pedestrian" speed="9.51" length="20.48" shape="-1.60,61.10 -0.81,55.54 1.57,51.58 5.54,49.19 11.10,48.40"/>
---
>         <lane id=":J0_3_0" index="0" disallow="pedestrian" speed="9.51" length="5.01" shape="-1.60,61.10 -0.89,56.14"/>
>     </edge>
>     <edge id=":J0_16" function="internal">
>         <lane id=":J0_16_0" index="0" disallow="pedestrian" speed="9.51" length="15.47" shape="-0.89,56.14 -0.81,55.54 1.57,51.58 5.54,49.19 11.10,48.40"/>
26c29,32
<         <lane id=":J0_7_0" index="0" disallow="pedestrian" speed="9.51" length="20.48" shape="11.10,51.60 5.54,50.81 1.58,48.43 -0.81,44.46 -1.60,38.90"/>
---
>         <lane id=":J0_7_0" index="0" disallow="pedestrian" speed="9.51" length="5.01" shape="11.10,51.60 6.14,50.89"/>
>     </edge>
>     <edge id=":J0_17" function="internal">
>         <lane id=":J0_17_0" index="0" disallow="pedestrian" speed="9.51" length="15.47" shape="6.14,50.89 5.54,50.81 1.58,48.43 -0.81,44.46 -1.60,38.90"/>
36c42,45
<         <lane id=":J0_11_0" index="0" disallow="pedestrian" speed="9.51" length="20.48" shape="1.60,38.90 0.81,44.46 -1.57,48.42 -5.54,50.81 -11.10,51.60"/>
---
>         <lane id=":J0_11_0" index="0" disallow="pedestrian" speed="9.51" length="5.01" shape="1.60,38.90 0.89,43.86"/>
>     </edge>
>     <edge id=":J0_18" function="internal">
>         <lane id=":J0_18_0" index="0" disallow="pedestrian" speed="9.51" length="15.47" shape="0.89,43.86 0.81,44.46 -1.57,48.42 -5.54,50.81 -11.10,51.60"/>
46c55,58
<         <lane id=":J0_15_0" index="0" disallow="pedestrian" speed="9.51" length="20.48" shape="-11.10,48.40 -5.54,49.19 -1.58,51.57 0.81,55.54 1.60,61.10"/>
---
>         <lane id=":J0_15_0" index="0" disallow="pedestrian" speed="9.51" length="5.01" shape="-11.10,48.40 -6.14,49.11"/>
>     </edge>
>     <edge id=":J0_19" function="internal">
>         <lane id=":J0_19_0" index="0" disallow="pedestrian" speed="9.51" length="15.47" shape="-6.14,49.11 -5.54,49.19 -1.58,51.57 0.81,55.54 1.60,61.10"/>
53c65,68
<         <lane id=":J1_2_0" index="0" disallow="pedestrian" speed="3.65" length="4.67" shape="-23.91,51.60 -25.11,50.80 -25.51,50.00 -25.11,49.20 -23.91,48.40"/>
<truncated after showing first 30 lines>

TEST FAILED on ts-sim-build-ba : netelements trafficlights joined phases NEMA state ( Last six runs Oct2022 )

---------- Differences in errors ----------
84,90c84,85
< Debug: Setting new attribute
< Debug: Key ENTER pressed
< Debug: Invalid state
< Debug: Valid state
< Debug: Invalid state
< Debug: Invalid state
< Debug: Key ESC (abort) pressed
---
> Debug: Open additional dialog
> Debug: Cancel additional dialog
92a88,101
> Debug: Removing TLS from junction 'J4'
> Debug: Adding TLS into junction 'J4'
> Debug: Restoring previous attribute
> Debug: Removing TLS from junction 'J4'
> Debug: Removing TLS from junction 'J3'
> Debug: Adding TLS into junction 'J3'
> Debug: Restoring previous attribute
> Debug: Removing TLS from junction 'J3'
> Debug: Removing TLS from junction 'J2'
> Debug: Adding TLS into junction 'J2'
> Debug: Restoring previous attribute
> Debug: Removing TLS from junction 'J2'
> Debug: Removing TLS from junction 'J1'
> Debug: Adding TLS into junction 'J1'
93a103
> Debug: Removing TLS from junction 'J1'
95a106,118
> Debug: Adding TLS into junction 'J1'
<truncated after showing first 30 lines>
---------- Differences in net ----------
222,232c222,230
<     <tlLogic id="J0" type="NEMA" programID="0" offset="0">
<         <phase duration="90" state="rrrrrrrrrrrrrrrrrrrrrrrrrrrrrrrrrrrrrrrG" minDur="5" maxDur="50" vehext="2" yellow="3" red="2" name="1"/>
<         <phase duration="90" state="rrrrrrrrrrrrrrrrrrrrrrrrrrrrrrrGGGrrrrrr" minDur="5" maxDur="50" vehext="2" yellow="3" red="2" name="2"/>
<         <phase duration="90" state="rrrrrrrrrrrrrrrrrrrrrrrrrrrrrrrrrrrrrGGr" minDur="5" maxDur="105" vehext="2" yellow="3" red="2" name="6"/>
<         <phase duration="90" state="rrrrrrrrrrrrrrrrrrrGGrrrrrrrrrrrrrrrrrrr" minDur="5" maxDur="105" vehext="2" yellow="3" red="2" name="4"/>
<         <phase duration="90" state="rrrrrrrrrrrrrrrrrrrrrGrrrrrrrrrrrrrrrrrr" minDur="5" maxDur="50" vehext="2" yellow="3" red="2" name="7"/>
<         <phase duration="90" state="rrrrrrrrrrrrrrrrrrrrrrGGGrrrrrrrrrrrrrrr" minDur="5" maxDur="50" vehext="2" yellow="3" red="2" name="8"/>
<         <param key="barrier2Phases" value="2,6"/>
<         <param key="barrierPhases" value="4,8"/>
<         <param key="ring1" value="0,2,0,4"/>
<         <param key="ring2" value="0,6,0,8"/>
---
>     <tlLogic id="J0" type="static" programID="0" offset="0">
>         <phase duration="33" state="GGGgggggGGGgggggGGGrrrrrrGGGGGgGGgGGgGGg"/>
>         <phase duration="3"  state="yyygggggyyygggggyyyrrrrrryyyyyyyygyyyyyg"/>
>         <phase duration="6"  state="GGGgggggGGGgggggGGGrrrrrrGGGGGGrrgGGGrrg"/>
>         <phase duration="3"  state="yyyyyyyyyyyyyyyyyyyrrrrrryyyyyyrryyyyrry"/>
>         <phase duration="33" state="GGGgggggGGGgggggGGgGGgGGgGGgGGGrrrGGGrrr"/>
>         <phase duration="3"  state="yyygggggyyygggggyyyyygyygyyyyyyrrryyyrrr"/>
>         <phase duration="6"  state="GGGgggggGGGgggggGGGrrgrrgGGGGGGrrrGGGrrr"/>
>         <phase duration="3"  state="yyyyyyyyyyyyyyyyyyyrryrryyyyyyyrrryyyrrr"/>

TEST FAILED on ts-sim-build-ba : netelements trafficlights joined phases NEMA vehext ( Last six runs Oct2022 )

---------- Differences in errors ----------
84,88c84,85
< Debug: Setting new attribute
< Debug: Key ENTER pressed
< Debug: Invalid vehExt
< Debug: Invalid vehExt
< Debug: Valid vehExt
---
> Debug: Open additional dialog
> Debug: Cancel additional dialog
90,99d86
< Debug: Deleting TLS from junction 'J0'
< Debug: Adding TLS into junction 'J0'
< Debug: Deleting TLS from junction 'J1'
< Debug: Adding TLS into junction 'J1'
< Debug: Deleting TLS from junction 'J2'
< Debug: Adding TLS into junction 'J2'
< Debug: Deleting TLS from junction 'J3'
< Debug: Adding TLS into junction 'J3'
< Debug: Deleting TLS from junction 'J4'
< Debug: Adding TLS into junction 'J4'
104a92,93
> Debug: Restoring previous attribute
> Debug: Removing TLS from junction 'J4'
106a96,97
> Debug: Restoring previous attribute
> Debug: Removing TLS from junction 'J3'
108a100,101
> Debug: Restoring previous attribute
> Debug: Removing TLS from junction 'J2'
111,112c104,105
<truncated after showing first 30 lines>
---------- Differences in net ----------
16c16,19
<         <lane id=":J0_3_0" index="0" disallow="pedestrian" speed="9.51" length="20.48" shape="-1.60,61.10 -0.81,55.54 1.57,51.58 5.54,49.19 11.10,48.40"/>
---
>         <lane id=":J0_3_0" index="0" disallow="pedestrian" speed="9.51" length="5.01" shape="-1.60,61.10 -0.89,56.14"/>
>     </edge>
>     <edge id=":J0_16" function="internal">
>         <lane id=":J0_16_0" index="0" disallow="pedestrian" speed="9.51" length="15.47" shape="-0.89,56.14 -0.81,55.54 1.57,51.58 5.54,49.19 11.10,48.40"/>
26c29,32
<         <lane id=":J0_7_0" index="0" disallow="pedestrian" speed="9.51" length="20.48" shape="11.10,51.60 5.54,50.81 1.58,48.43 -0.81,44.46 -1.60,38.90"/>
---
>         <lane id=":J0_7_0" index="0" disallow="pedestrian" speed="9.51" length="5.01" shape="11.10,51.60 6.14,50.89"/>
>     </edge>
>     <edge id=":J0_17" function="internal">
>         <lane id=":J0_17_0" index="0" disallow="pedestrian" speed="9.51" length="15.47" shape="6.14,50.89 5.54,50.81 1.58,48.43 -0.81,44.46 -1.60,38.90"/>
36c42,45
<         <lane id=":J0_11_0" index="0" disallow="pedestrian" speed="9.51" length="20.48" shape="1.60,38.90 0.81,44.46 -1.57,48.42 -5.54,50.81 -11.10,51.60"/>
---
>         <lane id=":J0_11_0" index="0" disallow="pedestrian" speed="9.51" length="5.01" shape="1.60,38.90 0.89,43.86"/>
>     </edge>
>     <edge id=":J0_18" function="internal">
>         <lane id=":J0_18_0" index="0" disallow="pedestrian" speed="9.51" length="15.47" shape="0.89,43.86 0.81,44.46 -1.57,48.42 -5.54,50.81 -11.10,51.60"/>
46c55,58
<         <lane id=":J0_15_0" index="0" disallow="pedestrian" speed="9.51" length="20.48" shape="-11.10,48.40 -5.54,49.19 -1.58,51.57 0.81,55.54 1.60,61.10"/>
---
>         <lane id=":J0_15_0" index="0" disallow="pedestrian" speed="9.51" length="5.01" shape="-11.10,48.40 -6.14,49.11"/>
>     </edge>
>     <edge id=":J0_19" function="internal">
>         <lane id=":J0_19_0" index="0" disallow="pedestrian" speed="9.51" length="15.47" shape="-6.14,49.11 -5.54,49.19 -1.58,51.57 0.81,55.54 1.60,61.10"/>
53c65,68
<         <lane id=":J1_2_0" index="0" disallow="pedestrian" speed="3.65" length="4.67" shape="-23.91,51.60 -25.11,50.80 -25.51,50.00 -25.11,49.20 -23.91,48.40"/>
<truncated after showing first 30 lines>

TEST FAILED on ts-sim-build-ba : netelements trafficlights joined phases NEMA yellow ( Last six runs Oct2022 )

---------- Differences in errors ----------
84,100c84,86
< Debug: Setting new attribute
< Debug: Key ENTER pressed
< Debug: Invalid yellow
< Debug: Invalid yellow
< Debug: Valid yellow
< Debug: Key ENTER pressed
< Debug: Deleting TLS from junction 'J0'
< Debug: Adding TLS into junction 'J0'
< Debug: Deleting TLS from junction 'J1'
< Debug: Adding TLS into junction 'J1'
< Debug: Deleting TLS from junction 'J2'
< Debug: Adding TLS into junction 'J2'
< Debug: Deleting TLS from junction 'J3'
< Debug: Adding TLS into junction 'J3'
< Debug: Deleting TLS from junction 'J4'
< Debug: Adding TLS into junction 'J4'
< Debug: Key ESC (abort) pressed
---
> Debug: Renaming Traffic Light: NEMA
> Debug: Open additional dialog
> Debug: Cancel additional dialog
103,112c89
< Debug: Removing TLS from junction 'J4'
< Debug: Adding TLS into junction 'J4'
< Debug: Removing TLS from junction 'J3'
< Debug: Adding TLS into junction 'J3'
< Debug: Removing TLS from junction 'J2'
< Debug: Adding TLS into junction 'J2'
< Debug: Removing TLS from junction 'J1'
<truncated after showing first 30 lines>
---------- Differences in net ----------
16c16,19
<         <lane id=":J0_3_0" index="0" disallow="pedestrian" speed="9.51" length="20.48" shape="-1.60,61.10 -0.81,55.54 1.57,51.58 5.54,49.19 11.10,48.40"/>
---
>         <lane id=":J0_3_0" index="0" disallow="pedestrian" speed="9.51" length="5.01" shape="-1.60,61.10 -0.89,56.14"/>
>     </edge>
>     <edge id=":J0_16" function="internal">
>         <lane id=":J0_16_0" index="0" disallow="pedestrian" speed="9.51" length="15.47" shape="-0.89,56.14 -0.81,55.54 1.57,51.58 5.54,49.19 11.10,48.40"/>
26c29,32
<         <lane id=":J0_7_0" index="0" disallow="pedestrian" speed="9.51" length="20.48" shape="11.10,51.60 5.54,50.81 1.58,48.43 -0.81,44.46 -1.60,38.90"/>
---
>         <lane id=":J0_7_0" index="0" disallow="pedestrian" speed="9.51" length="5.01" shape="11.10,51.60 6.14,50.89"/>
>     </edge>
>     <edge id=":J0_17" function="internal">
>         <lane id=":J0_17_0" index="0" disallow="pedestrian" speed="9.51" length="15.47" shape="6.14,50.89 5.54,50.81 1.58,48.43 -0.81,44.46 -1.60,38.90"/>
36c42,45
<         <lane id=":J0_11_0" index="0" disallow="pedestrian" speed="9.51" length="20.48" shape="1.60,38.90 0.81,44.46 -1.57,48.42 -5.54,50.81 -11.10,51.60"/>
---
>         <lane id=":J0_11_0" index="0" disallow="pedestrian" speed="9.51" length="5.01" shape="1.60,38.90 0.89,43.86"/>
>     </edge>
>     <edge id=":J0_18" function="internal">
>         <lane id=":J0_18_0" index="0" disallow="pedestrian" speed="9.51" length="15.47" shape="0.89,43.86 0.81,44.46 -1.57,48.42 -5.54,50.81 -11.10,51.60"/>
46c55,58
<         <lane id=":J0_15_0" index="0" disallow="pedestrian" speed="9.51" length="20.48" shape="-11.10,48.40 -5.54,49.19 -1.58,51.57 0.81,55.54 1.60,61.10"/>
---
>         <lane id=":J0_15_0" index="0" disallow="pedestrian" speed="9.51" length="5.01" shape="-11.10,48.40 -6.14,49.11"/>
>     </edge>
>     <edge id=":J0_19" function="internal">
>         <lane id=":J0_19_0" index="0" disallow="pedestrian" speed="9.51" length="15.47" shape="-6.14,49.11 -5.54,49.19 -1.58,51.57 0.81,55.54 1.60,61.10"/>
53c65,68
<         <lane id=":J1_2_0" index="0" disallow="pedestrian" speed="3.65" length="4.67" shape="-23.91,51.60 -25.11,50.80 -25.51,50.00 -25.11,49.20 -23.91,48.40"/>
<truncated after showing first 30 lines>

2 TESTS FAILED on ts-sim-build-ba :

---------- Differences in log ----------
20a21
> Warning: Unused state in tlLogic 'J0', program '0' at tl-index 24
netelements trafficlights joined phases actuated buttons addstates ( Last six runs Oct2022 )
netelements trafficlights joined phases delay_based buttons addstates ( Last six runs Oct2022 )

TEST FAILED on ts-sim-build-ba : netelements trafficlights joined phases delay_based buttons add default ( Last six runs Oct2022 )

---------- Differences in errors ----------
68,71d67
< Debug: Setting new attribute
< Debug: Key ENTER pressed
< Debug: Add default phase
< Debug: Add default phase in row 5
73,82d68
< Debug: Deleting TLS from junction 'J0'
< Debug: Adding TLS into junction 'J0'
< Debug: Deleting TLS from junction 'J1'
< Debug: Adding TLS into junction 'J1'
< Debug: Deleting TLS from junction 'J2'
< Debug: Adding TLS into junction 'J2'
< Debug: Deleting TLS from junction 'J3'
< Debug: Adding TLS into junction 'J3'
< Debug: Deleting TLS from junction 'J4'
< Debug: Adding TLS into junction 'J4'
87a74,75
> Debug: Restoring previous attribute
> Debug: Removing TLS from junction 'J4'
89a78,79
> Debug: Restoring previous attribute
> Debug: Removing TLS from junction 'J3'
91a82,83
> Debug: Restoring previous attribute
> Debug: Removing TLS from junction 'J2'
94,95c86,87
< Debug: Removing TLS from junction 'J0'
< Debug: Adding TLS into junction 'J0'
---
> Debug: Restoring previous attribute
<truncated after showing first 30 lines>
---------- Differences in net ----------
118,119c118,119
<     <tlLogic id="J0" type="delay_based" programID="0" offset="0">
<         <phase duration="31" state="GGGgggggGGGgggggGGGGGGGG" minDur="5" maxDur="50"/>
---
>     <tlLogic id="J0" type="static" programID="0" offset="0">
>         <phase duration="31" state="GGGgggggGGGgggggGGGGGGGG"/>
121c121
<         <phase duration="6"  state="GGGgggggGGGgggggGGGGGGGG" minDur="5" maxDur="50"/>
---
>         <phase duration="6"  state="GGGgggggGGGgggggGGGGGGGG"/>
123c123
<         <phase duration="31" state="GGGgggggGGGgggggGGGGGGGG" minDur="5" maxDur="50"/>
---
>         <phase duration="31" state="GGGgggggGGGgggggGGGGGGGG"/>
125,126c125
<         <phase duration="6"  state="rrrgggggrrrgggggrrrrrrrr"/>
<         <phase duration="6"  state="GGGgggggGGGgggggGGGGGGGG" minDur="5" maxDur="50"/>
---
>         <phase duration="6"  state="GGGgggggGGGgggggGGGGGGGG"/>
128c127
<         <phase duration="31" state="GGGgggggGGGgggggGGGGGGGG" minDur="5" maxDur="50"/>
---
>         <phase duration="31" state="GGGgggggGGGgggggGGGGGGGG"/>
130c129
<         <phase duration="6"  state="GGGgggggGGGgggggGGGGGGGG" minDur="5" maxDur="50"/>
---
>         <phase duration="6"  state="GGGgggggGGGgggggGGGGGGGG"/>
132c131
<         <phase duration="31" state="GGGgggggGGGgggggGGGGGGGG" minDur="5" maxDur="50"/>
---
<truncated after showing first 30 lines>

TEST FAILED on ts-sim-build-ba : netelements trafficlights joined phases delay_based buttons add red ( Last six runs Oct2022 )

---------- Differences in errors ----------
71c71
< Debug: Add new phase in row 5 of type: r
---
> Debug: Add new phase in row 7 of type: r
---------- Differences in net ----------
125d124
<         <phase duration="6"  state="rrrrrrrrrrrrrrrrrrrrrrrr"/>
127a127
>         <phase duration="2"  state="rrrrrrrrrrrrrrrrrrrrrrrr"/>

TEST FAILED on ts-sim-build-ba : netelements trafficlights joined phases delay_based buttons add yellow ( Last six runs Oct2022 )

---------- Differences in errors ----------
67a68
> Debug: Key ENTER pressed
71c72
< Debug: Add new phase in row 5 of type: y
---
> Debug: Add new phase in row 7 of type: y
---------- Differences in net ----------
125d124
<         <phase duration="6"  state="yyyyyyyyyyyyyyyyyyyyyyyy"/>
127c126
<         <phase duration="3"  state="yyyyyyyyyyyyyyyyyyyyyyyy"/>
---
>         <phase duration="5"  state="yyyyyyyyyyyyyyyyyyyyyyyy"/>

TEST FAILED on ts-sim-build-ba : netelements trafficlights joined phases delay_based buttons delete ( Last six runs Oct2022 )

---------- Differences in errors ----------
71c71
< Debug: removed phase 6
---
> Debug: removed phase 7
---------- Differences in net ----------
125,126c125
<         <phase duration="3"  state="yyyyyyyyyyyyyyyyyyyyyyyy"/>
<         <phase duration="31" state="GGGgggggGGGgggggGGGGGGGG" minDur="5" maxDur="50"/>
---
>         <phase duration="37" state="GGGgggggGGGgggggGGGGGGGG" minDur="10" maxDur="100"/>

TEST FAILED on ts-sim-build-ba : netelements trafficlights joined phases delay_based buttons moveup ( Last six runs Oct2022 )

---------- Differences in errors ----------
71c71
< Debug: Move up phase 7
---
> Debug: Move up phase 10
---------- Differences in net ----------
124a125
>         <phase duration="6"  state="GGGgggggGGGgggggGGGGGGGG" minDur="5" maxDur="50"/>
128d128
<         <phase duration="6"  state="GGGgggggGGGgggggGGGGGGGG" minDur="5" maxDur="50"/>

TEST FAILED on ts-sim-build-ba : netelements trafficlights joined phases delay_based next ( Last six runs Oct2022 )

---------- Differences in errors ----------
68,84c68,69
< Debug: Setting new attribute
< Debug: Key ENTER pressed
< Debug: Invalid next
< Debug: Valid next
< Debug: Valid next
< Debug: Key ENTER pressed
< Debug: Deleting TLS from junction 'J0'
< Debug: Adding TLS into junction 'J0'
< Debug: Deleting TLS from junction 'J1'
< Debug: Adding TLS into junction 'J1'
< Debug: Deleting TLS from junction 'J2'
< Debug: Adding TLS into junction 'J2'
< Debug: Deleting TLS from junction 'J3'
< Debug: Adding TLS into junction 'J3'
< Debug: Deleting TLS from junction 'J4'
< Debug: Adding TLS into junction 'J4'
< Debug: Key ESC (abort) pressed
---
> Debug: Open additional dialog
> Debug: Cancel additional dialog
88a74,75
> Debug: Restoring previous attribute
> Debug: Removing TLS from junction 'J4'
90a78,79
> Debug: Restoring previous attribute
> Debug: Removing TLS from junction 'J3'
92a82,83
> Debug: Restoring previous attribute
> Debug: Removing TLS from junction 'J2'
<truncated after showing first 30 lines>
---------- Differences in net ----------
118,119c118,119
<     <tlLogic id="J0" type="delay_based" programID="0" offset="0">
<         <phase duration="31" state="GGGgggggGGGgggggGGGGGGGG" minDur="5" maxDur="50"/>
---
>     <tlLogic id="J0" type="static" programID="0" offset="0">
>         <phase duration="31" state="GGGgggggGGGgggggGGGGGGGG"/>
121c121
<         <phase duration="6"  state="GGGgggggGGGgggggGGGGGGGG" minDur="5" maxDur="50"/>
---
>         <phase duration="6"  state="GGGgggggGGGgggggGGGGGGGG"/>
123c123
<         <phase duration="31" state="GGGgggggGGGgggggGGGGGGGG" minDur="5" maxDur="50" next="1"/>
---
>         <phase duration="31" state="GGGgggggGGGgggggGGGGGGGG"/>
125c125
<         <phase duration="6"  state="GGGgggggGGGgggggGGGGGGGG" minDur="5" maxDur="50"/>
---
>         <phase duration="6"  state="GGGgggggGGGgggggGGGGGGGG"/>
127c127
<         <phase duration="31" state="GGGgggggGGGgggggGGGGGGGG" minDur="5" maxDur="50"/>
---
>         <phase duration="31" state="GGGgggggGGGgggggGGGGGGGG"/>
129c129
<         <phase duration="6"  state="GGGgggggGGGgggggGGGGGGGG" minDur="5" maxDur="50"/>
---
>         <phase duration="6"  state="GGGgggggGGGgggggGGGGGGGG"/>
131c131
<         <phase duration="31" state="GGGgggggGGGgggggGGGGGGGG" minDur="5" maxDur="50"/>
---
>         <phase duration="31" state="GGGgggggGGGgggggGGGGGGGG"/>
<truncated after showing first 30 lines>

TEST FAILED on ts-sim-build-ba : netelements trafficlights joined phases delay_based state ( Last six runs Oct2022 )

---------- Differences in errors ----------
74,83d73
< Debug: Deleting TLS from junction 'J0'
< Debug: Adding TLS into junction 'J0'
< Debug: Deleting TLS from junction 'J1'
< Debug: Adding TLS into junction 'J1'
< Debug: Deleting TLS from junction 'J2'
< Debug: Adding TLS into junction 'J2'
< Debug: Deleting TLS from junction 'J3'
< Debug: Adding TLS into junction 'J3'
< Debug: Deleting TLS from junction 'J4'
< Debug: Adding TLS into junction 'J4'
87,96c77
< Debug: Removing TLS from junction 'J4'
< Debug: Adding TLS into junction 'J4'
< Debug: Removing TLS from junction 'J3'
< Debug: Adding TLS into junction 'J3'
< Debug: Removing TLS from junction 'J2'
< Debug: Adding TLS into junction 'J2'
< Debug: Removing TLS from junction 'J1'
< Debug: Adding TLS into junction 'J1'
< Debug: Removing TLS from junction 'J0'
< Debug: Adding TLS into junction 'J0'
---
> Debug: Restoring previous attribute
99,108c80
< Debug: Deleting TLS from junction 'J0'
< Debug: Adding TLS into junction 'J0'
< Debug: Deleting TLS from junction 'J1'
< Debug: Adding TLS into junction 'J1'
< Debug: Deleting TLS from junction 'J2'
<truncated after showing first 30 lines>
---------- Differences in log ----------
20a21,30
> Warning: Unreachable edge '-E2' within tlLogic 'J0'
> Warning: Unreachable edge '-E1' within tlLogic 'J0'
> Warning: Unreachable edge '-E3' within tlLogic 'J0'
> Warning: Unreachable edge '-E0' within tlLogic 'J0'
> Warning: Unreachable edge 'E0' within tlLogic 'J0'
> Warning: Unreachable edge 'E1' within tlLogic 'J0'
> Warning: Unreachable edge 'E2' within tlLogic 'J0'
> Warning: Unreachable edge 'E3' within tlLogic 'J0'
> Warning: The traffic light 'J0' cannot be adapted to a cycle time of 90.00.
> Warning: The traffic light 'J0' has a high cycle time of 258.00.
---------- Differences in net ----------
122c122
<         <phase duration="3"  state="ryyggrggyyyggrggyyyyryyy"/>
---
>         <phase duration="3"  state="yyyyyyyyyyyyyyyyyyyyyyyy"/>

TEST FAILED on ts-sim-build-ba : netelements trafficlights joined phases static buttons addstates ( Last six runs Oct2022 )

---------- Differences in log ----------
10a11
> Warning: Unused state in tlLogic 'J0', program '0' at tl-index 24

TEST FAILED on ts-sim-build-ba : netelements trafficlights joined programs delete ( Last six runs Oct2022 )

---------- Differences in errors ----------
17,20c17,24
< Debug: Adding trip 'trip_1' in GNEChange_DemandElement
< Debug: Adding trip 'trip_2' in GNEChange_DemandElement
< Debug: Adding trip 'trip_3' in GNEChange_DemandElement
< Debug: Adding trip 'trip_4' in GNEChange_DemandElement
---
> Debug: Adding vehicleWithRoute 'trip_1' in GNEChange_DemandElement
> Debug: Adding routeEmbedded 'trip_1' in GNEChange_DemandElement
> Debug: Adding vehicleWithRoute 'trip_2' in GNEChange_DemandElement
> Debug: Adding routeEmbedded 'trip_2' in GNEChange_DemandElement
> Debug: Adding vehicleWithRoute 'trip_3' in GNEChange_DemandElement
> Debug: Adding routeEmbedded 'trip_3' in GNEChange_DemandElement
> Debug: Adding vehicleWithRoute 'trip_4' in GNEChange_DemandElement
> Debug: Adding routeEmbedded 'trip_4' in GNEChange_DemandElement
45,164c49,52
< Debug: Deleting TLS from junction 'J0'
< Debug: Deleting TLS from junction 'J1'
< Debug: Adding TLS into junction 'J1'
< Debug: Deleting TLS from junction 'J2'
< Debug: Adding TLS into junction 'J2'
< Debug: Deleting TLS from junction 'J3'
< Debug: Adding TLS into junction 'J3'
< Debug: Deleting TLS from junction 'J4'
< Debug: Adding TLS into junction 'J4'
< Debug: Setting new attribute
< Debug: Key ESC (abort) pressed
< Debug: Keys Ctrl+Z (Undo) pressed
< Debug: Calling GNEUndoList::undo()
< Debug: Restoring previous attribute
< Debug: Removing TLS from junction 'J4'
<truncated after showing first 30 lines>
---------- Differences in output ----------
5,8d4
< TestFunctions: Clicked over position 304 - 168
< TestFunctions: Clicked over position 304 - 168
< TestFunctions: Clicked over position 304 - 168
< TestFunctions: Netedit closed successfully
---------- New result in exitcode ----------
1
---------- Missing result in additionals ----------
<?xml version="1.0" encoding="UTF-8"?>


<additional xmlns:xsi="http://www.w3.org/2001/XMLSchema-instance" xsi:noNamespaceSchemaLocation="http://sumo.dlr.de/xsd/additional_file.xsd">
    <!-- Detectors -->
    <inductionLoop id="E1_00" lane="-E2_1" pos="10.00" period="300.00" file="e1_5.xml"/>
    <inductionLoop id="E1_01" lane="-E2_2" pos="10.00" period="300.00" file="e1_4.xml"/>
    <inductionLoop id="E1_02" lane="E2_2" pos="8.90" period="300.00" file="e1_5.xml"/>
    <inductionLoop id="E1_03" lane="E2_1" pos="8.90" period="300.00" file="e1_4.xml"/>
    <inductionLoop id="E1_04" lane="-E1_1" pos="10.00" period="300.00" file="e1_2.xml"/>
    <inductionLoop id="E1_05" lane="-E1_2" pos="10.00" period="300.00" file="e1_3.xml"/>
    <inductionLoop id="E1_06" lane="E1_2" pos="8.90" period="300.00" file="e1_2.xml"/>
    <inductionLoop id="E1_07" lane="E1_1" pos="8.90" period="300.00" file="e1_7.xml"/>
    <inductionLoop id="E1_08" lane="-E3_1" pos="10.00" period="300.00" file="e1_1.xml"/>
    <inductionLoop id="E1_09" lane="-E3_2" pos="10.00" period="300.00" file="e1_6.xml"/>
    <inductionLoop id="E1_10" lane="E3_2" pos="8.90" period="300.00" file="e1_7.xml"/>
    <inductionLoop id="E1_11" lane="E3_1" pos="8.90" period="300.00" file="e1_0.xml"/>
    <inductionLoop id="E1_12" lane="-E0_1" pos="10.00" period="300.00" file="e1_3.xml"/>
    <inductionLoop id="E1_13" lane="-E0_2" pos="10.00" period="300.00" file="e1_1.xml"/>
    <inductionLoop id="E1_14" lane="E0_2" pos="8.90" period="300.00" file="e1_0.xml"/>
    <inductionLoop id="E1_15" lane="E0_1" pos="8.90" period="300.00" file="e1_6.xml"/>
</additional>
---------- Missing result in guisettingsoutput ----------
<viewsettings>
    <viewport zoom="100.00" x="0.00" y="50.00" angle="0.00"/>
</viewsettings>
---------- Missing result in net ----------
<?xml version="1.0" encoding="UTF-8"?>


<net version="1.9" junctionCornerDetail="5" limitTurnSpeed="5.50" xmlns:xsi="http://www.w3.org/2001/XMLSchema-instance" xsi:noNamespaceSchemaLocation="http://sumo.dlr.de/xsd/net_file.xsd">

    <location netOffset="0.00,0.00" convBoundary="-30.00,20.00,30.00,80.00" origBoundary="-10000000000.00,-10000000000.00,10000000000.00,10000000000.00" projParameter="!"/>

    <edge id=":J0_0" function="internal">
        <lane id=":J0_0_0" index="0" disallow="pedestrian" speed="6.86" length="10.16" shape="-4.80,61.10 -5.19,58.34 -6.37,56.38 -8.34,55.19 -11.10,54.80"/>
        <lane id=":J0_0_1" index="1" disallow="pedestrian" speed="8.29" length="15.32" shape="-1.60,61.10 -2.19,56.94 -3.97,53.98 -6.94,52.19 -11.10,51.60"/>
    </edge>
    <edge id=":J0_2" function="internal">
        <lane id=":J0_2_0" index="0" disallow="pedestrian" speed="13.89" length="22.20" shape="-1.60,61.10 -1.60,38.90"/>
    </edge>
    <edge id=":J0_3" function="internal">
        <lane id=":J0_3_0" index="0" disallow="pedestrian" speed="9.51" length="5.01" shape="-1.60,61.10 -0.89,56.14"/>
    </edge>
    <edge id=":J0_16" function="internal">
        <lane id=":J0_16_0" index="0" disallow="pedestrian" speed="9.51" length="15.47" shape="-0.89,56.14 -0.81,55.54 1.57,51.58 5.54,49.19 11.10,48.40"/>
    </edge>
    <edge id=":J0_4" function="internal">
        <lane id=":J0_4_0" index="0" disallow="pedestrian" speed="6.86" length="10.16" shape="11.10,54.80 8.34,55.19 6.37,56.37 5.19,58.34 4.80,61.10"/>
        <lane id=":J0_4_1" index="1" disallow="pedestrian" speed="8.29" length="15.32" shape="11.10,51.60 6.94,52.19 3.98,53.98 2.19,56.94 1.60,61.10"/>
    </edge>
    <edge id=":J0_6" function="internal">
        <lane id=":J0_6_0" index="0" disallow="pedestrian" speed="13.89" length="22.20" shape="11.10,51.60 -11.10,51.60"/>
    </edge>
    <edge id=":J0_7" function="internal">
        <lane id=":J0_7_0" index="0" disallow="pedestrian" speed="9.51" length="20.48" shape="11.10,51.60 5.54,50.81 1.58,48.43 -0.81,44.46 -1.60,38.90"/>
    </edge>
<truncated after showing first 30 lines>
---------- Missing result in routes ----------
<?xml version="1.0" encoding="UTF-8"?>


<routes xmlns:xsi="http://www.w3.org/2001/XMLSchema-instance" xsi:noNamespaceSchemaLocation="http://sumo.dlr.de/xsd/routes_file.xsd">
    <!-- Vehicles, persons and containers (sorted by depart) -->
    <trip id="trip_1" depart="0.00" from="-E2" to="E3"/>
    <trip id="trip_2" depart="0.00" from="-E1" to="E0"/>
    <trip id="trip_3" depart="0.00" from="-E3" to="E2"/>
    <trip id="trip_4" depart="0.00" from="-E0" to="E1"/>
</routes>

TEST FAILED on ts-sim-build-ba : netelements trafficlights joined programs resetall ( Last six runs Oct2022 )

---------- Differences in errors ----------
17,20c17,24
< Debug: Adding trip 'trip_1' in GNEChange_DemandElement
< Debug: Adding trip 'trip_2' in GNEChange_DemandElement
< Debug: Adding trip 'trip_3' in GNEChange_DemandElement
< Debug: Adding trip 'trip_4' in GNEChange_DemandElement
---
> Debug: Adding vehicleWithRoute 'trip_1' in GNEChange_DemandElement
> Debug: Adding routeEmbedded 'trip_1' in GNEChange_DemandElement
> Debug: Adding vehicleWithRoute 'trip_2' in GNEChange_DemandElement
> Debug: Adding routeEmbedded 'trip_2' in GNEChange_DemandElement
> Debug: Adding vehicleWithRoute 'trip_3' in GNEChange_DemandElement
> Debug: Adding routeEmbedded 'trip_3' in GNEChange_DemandElement
> Debug: Adding vehicleWithRoute 'trip_4' in GNEChange_DemandElement
> Debug: Adding routeEmbedded 'trip_4' in GNEChange_DemandElement
45,284c49,52
< Debug: Deleting TLS from junction 'J0'
< Debug: Deleting TLS from junction 'J1'
< Debug: Adding TLS into junction 'J1'
< Debug: Deleting TLS from junction 'J2'
< Debug: Adding TLS into junction 'J2'
< Debug: Deleting TLS from junction 'J3'
< Debug: Adding TLS into junction 'J3'
< Debug: Deleting TLS from junction 'J4'
< Debug: Adding TLS into junction 'J4'
< Debug: Deleting TLS from junction 'J1'
< Debug: Adding TLS into junction 'J1'
< Debug: Deleting TLS from junction 'J0'
< Debug: Adding TLS into junction 'J0'
< Debug: Deleting TLS from junction 'J2'
< Debug: Adding TLS into junction 'J2'
<truncated after showing first 30 lines>
---------- Differences in output ----------
5,8d4
< TestFunctions: Clicked over position 304 - 168
< TestFunctions: Clicked over position 304 - 168
< TestFunctions: Clicked over position 304 - 168
< TestFunctions: Netedit closed successfully
---------- New result in exitcode ----------
1
---------- Missing result in additionals ----------
<?xml version="1.0" encoding="UTF-8"?>


<additional xmlns:xsi="http://www.w3.org/2001/XMLSchema-instance" xsi:noNamespaceSchemaLocation="http://sumo.dlr.de/xsd/additional_file.xsd">
    <!-- Detectors -->
    <inductionLoop id="E1_00" lane="-E2_1" pos="10.00" period="300.00" file="e1_5.xml"/>
    <inductionLoop id="E1_01" lane="-E2_2" pos="10.00" period="300.00" file="e1_4.xml"/>
    <inductionLoop id="E1_02" lane="E2_2" pos="8.90" period="300.00" file="e1_5.xml"/>
    <inductionLoop id="E1_03" lane="E2_1" pos="8.90" period="300.00" file="e1_4.xml"/>
    <inductionLoop id="E1_04" lane="-E1_1" pos="10.00" period="300.00" file="e1_2.xml"/>
    <inductionLoop id="E1_05" lane="-E1_2" pos="10.00" period="300.00" file="e1_3.xml"/>
    <inductionLoop id="E1_06" lane="E1_2" pos="8.90" period="300.00" file="e1_2.xml"/>
    <inductionLoop id="E1_07" lane="E1_1" pos="8.90" period="300.00" file="e1_7.xml"/>
    <inductionLoop id="E1_08" lane="-E3_1" pos="10.00" period="300.00" file="e1_1.xml"/>
    <inductionLoop id="E1_09" lane="-E3_2" pos="10.00" period="300.00" file="e1_6.xml"/>
    <inductionLoop id="E1_10" lane="E3_2" pos="8.90" period="300.00" file="e1_7.xml"/>
    <inductionLoop id="E1_11" lane="E3_1" pos="8.90" period="300.00" file="e1_0.xml"/>
    <inductionLoop id="E1_12" lane="-E0_1" pos="10.00" period="300.00" file="e1_3.xml"/>
    <inductionLoop id="E1_13" lane="-E0_2" pos="10.00" period="300.00" file="e1_1.xml"/>
    <inductionLoop id="E1_14" lane="E0_2" pos="8.90" period="300.00" file="e1_0.xml"/>
    <inductionLoop id="E1_15" lane="E0_1" pos="8.90" period="300.00" file="e1_6.xml"/>
</additional>
---------- Missing result in guisettingsoutput ----------
<viewsettings>
    <viewport zoom="100.00" x="0.00" y="50.00" angle="0.00"/>
</viewsettings>
---------- Missing result in net ----------
<?xml version="1.0" encoding="UTF-8"?>


<net version="1.9" junctionCornerDetail="5" limitTurnSpeed="5.50" xmlns:xsi="http://www.w3.org/2001/XMLSchema-instance" xsi:noNamespaceSchemaLocation="http://sumo.dlr.de/xsd/net_file.xsd">

    <location netOffset="0.00,0.00" convBoundary="-30.00,20.00,30.00,80.00" origBoundary="-10000000000.00,-10000000000.00,10000000000.00,10000000000.00" projParameter="!"/>

    <edge id=":J0_0" function="internal">
        <lane id=":J0_0_0" index="0" disallow="pedestrian" speed="6.86" length="10.16" shape="-4.80,61.10 -5.19,58.34 -6.37,56.38 -8.34,55.19 -11.10,54.80"/>
        <lane id=":J0_0_1" index="1" disallow="pedestrian" speed="8.29" length="15.32" shape="-1.60,61.10 -2.19,56.94 -3.97,53.98 -6.94,52.19 -11.10,51.60"/>
    </edge>
    <edge id=":J0_2" function="internal">
        <lane id=":J0_2_0" index="0" disallow="pedestrian" speed="13.89" length="22.20" shape="-1.60,61.10 -1.60,38.90"/>
    </edge>
    <edge id=":J0_3" function="internal">
        <lane id=":J0_3_0" index="0" disallow="pedestrian" speed="9.51" length="5.01" shape="-1.60,61.10 -0.89,56.14"/>
    </edge>
    <edge id=":J0_16" function="internal">
        <lane id=":J0_16_0" index="0" disallow="pedestrian" speed="9.51" length="15.47" shape="-0.89,56.14 -0.81,55.54 1.57,51.58 5.54,49.19 11.10,48.40"/>
    </edge>
    <edge id=":J0_4" function="internal">
        <lane id=":J0_4_0" index="0" disallow="pedestrian" speed="6.86" length="10.16" shape="11.10,54.80 8.34,55.19 6.37,56.37 5.19,58.34 4.80,61.10"/>
        <lane id=":J0_4_1" index="1" disallow="pedestrian" speed="8.29" length="15.32" shape="11.10,51.60 6.94,52.19 3.98,53.98 2.19,56.94 1.60,61.10"/>
    </edge>
    <edge id=":J0_6" function="internal">
        <lane id=":J0_6_0" index="0" disallow="pedestrian" speed="13.89" length="22.20" shape="11.10,51.60 -11.10,51.60"/>
    </edge>
    <edge id=":J0_7" function="internal">
        <lane id=":J0_7_0" index="0" disallow="pedestrian" speed="9.51" length="5.01" shape="11.10,51.60 6.14,50.89"/>
    </edge>
<truncated after showing first 30 lines>
---------- Missing result in routes ----------
<?xml version="1.0" encoding="UTF-8"?>


<routes xmlns:xsi="http://www.w3.org/2001/XMLSchema-instance" xsi:noNamespaceSchemaLocation="http://sumo.dlr.de/xsd/routes_file.xsd">
    <!-- Vehicles, persons and containers (sorted by depart) -->
    <trip id="trip_1" depart="0.00" from="-E2" to="E3"/>
    <trip id="trip_2" depart="0.00" from="-E1" to="E0"/>
    <trip id="trip_3" depart="0.00" from="-E3" to="E2"/>
    <trip id="trip_4" depart="0.00" from="-E0" to="E1"/>
</routes>

TEST FAILED on ts-sim-build-ba : netelements trafficlights joined programs resetphase ( Last six runs Oct2022 )

---------- Differences in errors ----------
17,20c17,24
< Debug: Adding trip 'trip_1' in GNEChange_DemandElement
< Debug: Adding trip 'trip_2' in GNEChange_DemandElement
< Debug: Adding trip 'trip_3' in GNEChange_DemandElement
< Debug: Adding trip 'trip_4' in GNEChange_DemandElement
---
> Debug: Adding vehicleWithRoute 'trip_1' in GNEChange_DemandElement
> Debug: Adding routeEmbedded 'trip_1' in GNEChange_DemandElement
> Debug: Adding vehicleWithRoute 'trip_2' in GNEChange_DemandElement
> Debug: Adding routeEmbedded 'trip_2' in GNEChange_DemandElement
> Debug: Adding vehicleWithRoute 'trip_3' in GNEChange_DemandElement
> Debug: Adding routeEmbedded 'trip_3' in GNEChange_DemandElement
> Debug: Adding vehicleWithRoute 'trip_4' in GNEChange_DemandElement
> Debug: Adding routeEmbedded 'trip_4' in GNEChange_DemandElement
45,140c49,52
< Debug: Deleting TLS from junction 'J0'
< Debug: Adding TLS into junction 'J0'
< Debug: Key ESC (abort) pressed
< Debug: Keys Ctrl+Z (Undo) pressed
< Debug: Calling GNEUndoList::undo()
< Debug: Removing TLS from junction 'J0'
< Debug: Adding TLS into junction 'J0'
< Debug: Keys Ctrl+Y (Redo) pressed
< Debug: Calling GNEUndoList::redo()
< Debug: Deleting TLS from junction 'J0'
< Debug: Adding TLS into junction 'J0'
< Debug: network elements saved
< Debug: Additionals saved
< Debug: demand elements saved
< Debug: Deleting unreferenced trip
<truncated after showing first 30 lines>
---------- Differences in output ----------
5,8d4
< TestFunctions: Clicked over position 304 - 168
< TestFunctions: Clicked over position 304 - 168
< TestFunctions: Clicked over position 304 - 168
< TestFunctions: Netedit closed successfully
---------- New result in exitcode ----------
1
---------- Missing result in additionals ----------
<?xml version="1.0" encoding="UTF-8"?>


<additional xmlns:xsi="http://www.w3.org/2001/XMLSchema-instance" xsi:noNamespaceSchemaLocation="http://sumo.dlr.de/xsd/additional_file.xsd">
    <!-- Detectors -->
    <inductionLoop id="E1_00" lane="-E2_1" pos="10.00" period="300.00" file="e1_5.xml"/>
    <inductionLoop id="E1_01" lane="-E2_2" pos="10.00" period="300.00" file="e1_4.xml"/>
    <inductionLoop id="E1_02" lane="E2_2" pos="8.90" period="300.00" file="e1_5.xml"/>
    <inductionLoop id="E1_03" lane="E2_1" pos="8.90" period="300.00" file="e1_4.xml"/>
    <inductionLoop id="E1_04" lane="-E1_1" pos="10.00" period="300.00" file="e1_2.xml"/>
    <inductionLoop id="E1_05" lane="-E1_2" pos="10.00" period="300.00" file="e1_3.xml"/>
    <inductionLoop id="E1_06" lane="E1_2" pos="8.90" period="300.00" file="e1_2.xml"/>
    <inductionLoop id="E1_07" lane="E1_1" pos="8.90" period="300.00" file="e1_7.xml"/>
    <inductionLoop id="E1_08" lane="-E3_1" pos="10.00" period="300.00" file="e1_1.xml"/>
    <inductionLoop id="E1_09" lane="-E3_2" pos="10.00" period="300.00" file="e1_6.xml"/>
    <inductionLoop id="E1_10" lane="E3_2" pos="8.90" period="300.00" file="e1_7.xml"/>
    <inductionLoop id="E1_11" lane="E3_1" pos="8.90" period="300.00" file="e1_0.xml"/>
    <inductionLoop id="E1_12" lane="-E0_1" pos="10.00" period="300.00" file="e1_3.xml"/>
    <inductionLoop id="E1_13" lane="-E0_2" pos="10.00" period="300.00" file="e1_1.xml"/>
    <inductionLoop id="E1_14" lane="E0_2" pos="8.90" period="300.00" file="e1_0.xml"/>
    <inductionLoop id="E1_15" lane="E0_1" pos="8.90" period="300.00" file="e1_6.xml"/>
</additional>
---------- Missing result in guisettingsoutput ----------
<viewsettings>
    <viewport zoom="100.00" x="0.00" y="50.00" angle="0.00"/>
</viewsettings>
---------- Missing result in net ----------
<?xml version="1.0" encoding="UTF-8"?>


<net version="1.9" junctionCornerDetail="5" limitTurnSpeed="5.50" xmlns:xsi="http://www.w3.org/2001/XMLSchema-instance" xsi:noNamespaceSchemaLocation="http://sumo.dlr.de/xsd/net_file.xsd">

    <location netOffset="0.00,0.00" convBoundary="-30.00,20.00,30.00,80.00" origBoundary="-10000000000.00,-10000000000.00,10000000000.00,10000000000.00" projParameter="!"/>

    <edge id=":J0_0" function="internal">
        <lane id=":J0_0_0" index="0" disallow="pedestrian" speed="6.86" length="10.16" shape="-4.80,61.10 -5.19,58.34 -6.37,56.38 -8.34,55.19 -11.10,54.80"/>
        <lane id=":J0_0_1" index="1" disallow="pedestrian" speed="8.29" length="15.32" shape="-1.60,61.10 -2.19,56.94 -3.97,53.98 -6.94,52.19 -11.10,51.60"/>
    </edge>
    <edge id=":J0_2" function="internal">
        <lane id=":J0_2_0" index="0" disallow="pedestrian" speed="13.89" length="22.20" shape="-1.60,61.10 -1.60,38.90"/>
    </edge>
    <edge id=":J0_3" function="internal">
        <lane id=":J0_3_0" index="0" disallow="pedestrian" speed="9.51" length="5.01" shape="-1.60,61.10 -0.89,56.14"/>
    </edge>
    <edge id=":J0_16" function="internal">
        <lane id=":J0_16_0" index="0" disallow="pedestrian" speed="9.51" length="15.47" shape="-0.89,56.14 -0.81,55.54 1.57,51.58 5.54,49.19 11.10,48.40"/>
    </edge>
    <edge id=":J0_4" function="internal">
        <lane id=":J0_4_0" index="0" disallow="pedestrian" speed="6.86" length="10.16" shape="11.10,54.80 8.34,55.19 6.37,56.37 5.19,58.34 4.80,61.10"/>
        <lane id=":J0_4_1" index="1" disallow="pedestrian" speed="8.29" length="15.32" shape="11.10,51.60 6.94,52.19 3.98,53.98 2.19,56.94 1.60,61.10"/>
    </edge>
    <edge id=":J0_6" function="internal">
        <lane id=":J0_6_0" index="0" disallow="pedestrian" speed="13.89" length="22.20" shape="11.10,51.60 -11.10,51.60"/>
    </edge>
    <edge id=":J0_7" function="internal">
        <lane id=":J0_7_0" index="0" disallow="pedestrian" speed="9.51" length="5.01" shape="11.10,51.60 6.14,50.89"/>
    </edge>
<truncated after showing first 30 lines>
---------- Missing result in routes ----------
<?xml version="1.0" encoding="UTF-8"?>


<routes xmlns:xsi="http://www.w3.org/2001/XMLSchema-instance" xsi:noNamespaceSchemaLocation="http://sumo.dlr.de/xsd/routes_file.xsd">
    <!-- Vehicles, persons and containers (sorted by depart) -->
    <trip id="trip_1" depart="0.00" from="-E2" to="E3"/>
    <trip id="trip_2" depart="0.00" from="-E1" to="E0"/>
    <trip id="trip_3" depart="0.00" from="-E3" to="E2"/>
    <trip id="trip_4" depart="0.00" from="-E0" to="E1"/>
</routes>

4 TESTS FAILED on ts-sim-build-ba :

---------- Differences in log ----------
0a1
> Warning: Unused state in tlLogic 'J0', program '0' at tl-index 16
netelements trafficlights single phases NEMA buttons addstates ( Last six runs Oct2022 )
netelements trafficlights single phases actuated buttons addstates ( Last six runs Oct2022 )
netelements trafficlights single phases delay_based buttons addstates ( Last six runs Oct2022 )
netelements trafficlights single phases static buttons addstates ( Last six runs Oct2022 )

TEST FAILED on ts-sim-build-ba : netelements trafficlights single phases NEMA buttons ungroupsignals ( Last six runs Oct2022 )

---------- Differences in errors ----------
155d154
< X connection to :11438.0 broken (explicit kill or server shutdown).

TEST FAILED on ts-sim-build-ba : netelements trafficlights single programs resetall ( Last six runs Oct2022 )

---------- Differences in errors ----------
49,160c49,52
< Debug: Deleting TLS from junction 'J0'
< Debug: Deleting TLS from junction 'J0'
< Debug: Deleting TLS from junction 'J0'
< Debug: Setting new attribute
< Debug: Adding TLS into junction 'J0'
< Debug: Setting new attribute
< Debug: Key ESC (abort) pressed
< Debug: Keys Ctrl+Z (Undo) pressed
< Debug: Calling GNEUndoList::undo()
< Debug: Restoring previous attribute
< Debug: Removing TLS from junction 'J0'
< Debug: Restoring previous attribute
< Debug: Adding TLS into junction 'J0'
< Debug: Adding TLS into junction 'J0'
< Debug: Adding TLS into junction 'J0'
< Debug: Keys Ctrl+Y (Redo) pressed
< Debug: Calling GNEUndoList::redo()
< Debug: Deleting TLS from junction 'J0'
< Debug: Deleting TLS from junction 'J0'
< Debug: Deleting TLS from junction 'J0'
< Debug: Setting new attribute
< Debug: Adding TLS into junction 'J0'
< Debug: Setting new attribute
< Debug: network elements saved
< Debug: Additionals saved
< Debug: demand elements saved
< Debug: Deleting unreferenced routeEmbedded
< Debug: Deleting unreferenced vehicleWithRoute
< Debug: Deleting unreferenced routeEmbedded
<truncated after showing first 30 lines>
---------- Differences in output ----------
5,8d4
< TestFunctions: Clicked over position 304 - 168
< TestFunctions: Clicked over position 304 - 168
< TestFunctions: Clicked over position 304 - 168
< TestFunctions: Netedit closed successfully
---------- New result in exitcode ----------
1
---------- Missing result in additionals ----------
<?xml version="1.0" encoding="UTF-8"?>


<additional xmlns:xsi="http://www.w3.org/2001/XMLSchema-instance" xsi:noNamespaceSchemaLocation="http://sumo.dlr.de/xsd/additional_file.xsd">
    <!-- Detectors -->
    <inductionLoop id="E1_00" lane="-E2_1" pos="10.00" period="300.00" file="e1_5.xml"/>
    <inductionLoop id="E1_01" lane="-E2_2" pos="10.00" period="300.00" file="e1_4.xml"/>
    <inductionLoop id="E1_02" lane="E2_2" pos="-10.00" period="300.00" file="e1_5.xml"/>
    <inductionLoop id="E1_03" lane="E2_1" pos="-10.00" period="300.00" file="e1_4.xml"/>
    <inductionLoop id="E1_04" lane="-E1_1" pos="10.00" period="300.00" file="e1_2.xml"/>
    <inductionLoop id="E1_05" lane="-E1_2" pos="10.00" period="300.00" file="e1_3.xml"/>
    <inductionLoop id="E1_06" lane="E1_2" pos="-10.00" period="300.00" file="e1_2.xml"/>
    <inductionLoop id="E1_07" lane="E1_1" pos="-10.00" period="300.00" file="e1_7.xml"/>
    <inductionLoop id="E1_08" lane="-E3_1" pos="10.00" period="300.00" file="e1_1.xml"/>
    <inductionLoop id="E1_09" lane="-E3_2" pos="10.00" period="300.00" file="e1_6.xml"/>
    <inductionLoop id="E1_10" lane="E3_2" pos="-10.00" period="300.00" file="e1_7.xml"/>
    <inductionLoop id="E1_11" lane="E3_1" pos="-10.00" period="300.00" file="e1_0.xml"/>
    <inductionLoop id="E1_12" lane="-E0_1" pos="10.00" period="300.00" file="e1_3.xml"/>
    <inductionLoop id="E1_13" lane="-E0_2" pos="10.00" period="300.00" file="e1_1.xml"/>
    <inductionLoop id="E1_14" lane="E0_2" pos="-10.00" period="300.00" file="e1_0.xml"/>
    <inductionLoop id="E1_15" lane="E0_1" pos="-10.00" period="300.00" file="e1_6.xml"/>
</additional>
---------- Missing result in guisettingsoutput ----------
<viewsettings>
    <viewport zoom="100.00" x="0.00" y="50.00" angle="0.00"/>
</viewsettings>
---------- Missing result in net ----------
<?xml version="1.0" encoding="UTF-8"?>


<net version="1.9" junctionCornerDetail="5" limitTurnSpeed="5.50" xmlns:xsi="http://www.w3.org/2001/XMLSchema-instance" xsi:noNamespaceSchemaLocation="http://sumo.dlr.de/xsd/net_file.xsd">

    <location netOffset="0.00,0.00" convBoundary="-30.00,20.00,30.00,80.00" origBoundary="-10000000000.00,-10000000000.00,10000000000.00,10000000000.00" projParameter="!"/>

    <edge id=":J0_0" function="internal">
        <lane id=":J0_0_0" index="0" disallow="pedestrian" speed="6.86" length="10.16" shape="-4.80,61.10 -5.19,58.34 -6.37,56.38 -8.34,55.19 -11.10,54.80"/>
        <lane id=":J0_0_1" index="1" disallow="pedestrian" speed="8.29" length="15.32" shape="-1.60,61.10 -2.19,56.94 -3.97,53.98 -6.94,52.19 -11.10,51.60"/>
    </edge>
    <edge id=":J0_2" function="internal">
        <lane id=":J0_2_0" index="0" disallow="pedestrian" speed="13.89" length="22.20" shape="-1.60,61.10 -1.60,38.90"/>
    </edge>
    <edge id=":J0_3" function="internal">
        <lane id=":J0_3_0" index="0" disallow="pedestrian" speed="9.51" length="5.01" shape="-1.60,61.10 -0.89,56.14"/>
    </edge>
    <edge id=":J0_16" function="internal">
        <lane id=":J0_16_0" index="0" disallow="pedestrian" speed="9.51" length="15.47" shape="-0.89,56.14 -0.81,55.54 1.57,51.58 5.54,49.19 11.10,48.40"/>
    </edge>
    <edge id=":J0_4" function="internal">
        <lane id=":J0_4_0" index="0" disallow="pedestrian" speed="6.86" length="10.16" shape="11.10,54.80 8.34,55.19 6.37,56.37 5.19,58.34 4.80,61.10"/>
        <lane id=":J0_4_1" index="1" disallow="pedestrian" speed="8.29" length="15.32" shape="11.10,51.60 6.94,52.19 3.98,53.98 2.19,56.94 1.60,61.10"/>
    </edge>
    <edge id=":J0_6" function="internal">
        <lane id=":J0_6_0" index="0" disallow="pedestrian" speed="13.89" length="22.20" shape="11.10,51.60 -11.10,51.60"/>
    </edge>
    <edge id=":J0_7" function="internal">
        <lane id=":J0_7_0" index="0" disallow="pedestrian" speed="9.51" length="5.01" shape="11.10,51.60 6.14,50.89"/>
    </edge>
<truncated after showing first 30 lines>
---------- Missing result in routes ----------
<?xml version="1.0" encoding="UTF-8"?>


<routes xmlns:xsi="http://www.w3.org/2001/XMLSchema-instance" xsi:noNamespaceSchemaLocation="http://sumo.dlr.de/xsd/routes_file.xsd">
    <!-- Vehicles, persons and containers (sorted by depart) -->
    <vehicle id="trip_1" depart="0.00">
        <route edges="-E2 E3 -E3 E2" repeat="10"/>
    </vehicle>
    <vehicle id="trip_2" depart="0.00">
        <route edges="-E1 E0 -E0 E1" repeat="10"/>
    </vehicle>
    <vehicle id="trip_3" depart="0.00">
        <route edges="-E3 E2 -E2 E3" repeat="10"/>
    </vehicle>
    <vehicle id="trip_4" depart="0.00">
        <route edges="-E0 E1 -E1 E0" repeat="10"/>
    </vehicle>
</routes>

TEST FAILED on ts-sim-build-ba : netelements trafficlights single programs resetphase ( Last six runs Oct2022 )

---------- Differences in errors ----------
49,148c49,52
< Debug: Deleting TLS from junction 'J0'
< Debug: Adding TLS into junction 'J0'
< Debug: Key ESC (abort) pressed
< Debug: Keys Ctrl+Z (Undo) pressed
< Debug: Calling GNEUndoList::undo()
< Debug: Removing TLS from junction 'J0'
< Debug: Adding TLS into junction 'J0'
< Debug: Keys Ctrl+Y (Redo) pressed
< Debug: Calling GNEUndoList::redo()
< Debug: Deleting TLS from junction 'J0'
< Debug: Adding TLS into junction 'J0'
< Debug: network elements saved
< Debug: Additionals saved
< Debug: demand elements saved
< Debug: Deleting unreferenced routeEmbedded
< Debug: Deleting unreferenced vehicleWithRoute
< Debug: Deleting unreferenced routeEmbedded
< Debug: Deleting unreferenced vehicleWithRoute
< Debug: Deleting unreferenced routeEmbedded
< Debug: Deleting unreferenced vehicleWithRoute
< Debug: Deleting unreferenced routeEmbedded
< Debug: Deleting unreferenced vehicleWithRoute
< Debug: Deleting unreferenced inductionLoop
< Debug: Deleting unreferenced inductionLoop
< Debug: Deleting unreferenced inductionLoop
< Debug: Deleting unreferenced inductionLoop
< Debug: Deleting unreferenced inductionLoop
< Debug: Deleting unreferenced inductionLoop
< Debug: Deleting unreferenced inductionLoop
<truncated after showing first 30 lines>
---------- Differences in output ----------
5,8d4
< TestFunctions: Clicked over position 304 - 168
< TestFunctions: Clicked over position 304 - 168
< TestFunctions: Clicked over position 304 - 168
< TestFunctions: Netedit closed successfully
---------- New result in exitcode ----------
1
---------- Missing result in additionals ----------
<?xml version="1.0" encoding="UTF-8"?>


<additional xmlns:xsi="http://www.w3.org/2001/XMLSchema-instance" xsi:noNamespaceSchemaLocation="http://sumo.dlr.de/xsd/additional_file.xsd">
    <!-- Detectors -->
    <inductionLoop id="E1_00" lane="-E2_1" pos="10.00" period="300.00" file="e1_5.xml"/>
    <inductionLoop id="E1_01" lane="-E2_2" pos="10.00" period="300.00" file="e1_4.xml"/>
    <inductionLoop id="E1_02" lane="E2_2" pos="-10.00" period="300.00" file="e1_5.xml"/>
    <inductionLoop id="E1_03" lane="E2_1" pos="-10.00" period="300.00" file="e1_4.xml"/>
    <inductionLoop id="E1_04" lane="-E1_1" pos="10.00" period="300.00" file="e1_2.xml"/>
    <inductionLoop id="E1_05" lane="-E1_2" pos="10.00" period="300.00" file="e1_3.xml"/>
    <inductionLoop id="E1_06" lane="E1_2" pos="-10.00" period="300.00" file="e1_2.xml"/>
    <inductionLoop id="E1_07" lane="E1_1" pos="-10.00" period="300.00" file="e1_7.xml"/>
    <inductionLoop id="E1_08" lane="-E3_1" pos="10.00" period="300.00" file="e1_1.xml"/>
    <inductionLoop id="E1_09" lane="-E3_2" pos="10.00" period="300.00" file="e1_6.xml"/>
    <inductionLoop id="E1_10" lane="E3_2" pos="-10.00" period="300.00" file="e1_7.xml"/>
    <inductionLoop id="E1_11" lane="E3_1" pos="-10.00" period="300.00" file="e1_0.xml"/>
    <inductionLoop id="E1_12" lane="-E0_1" pos="10.00" period="300.00" file="e1_3.xml"/>
    <inductionLoop id="E1_13" lane="-E0_2" pos="10.00" period="300.00" file="e1_1.xml"/>
    <inductionLoop id="E1_14" lane="E0_2" pos="-10.00" period="300.00" file="e1_0.xml"/>
    <inductionLoop id="E1_15" lane="E0_1" pos="-10.00" period="300.00" file="e1_6.xml"/>
</additional>
---------- Missing result in guisettingsoutput ----------
<viewsettings>
    <viewport zoom="100.00" x="0.00" y="50.00" angle="0.00"/>
</viewsettings>
---------- Missing result in net ----------
<?xml version="1.0" encoding="UTF-8"?>


<net version="1.9" junctionCornerDetail="5" limitTurnSpeed="5.50" xmlns:xsi="http://www.w3.org/2001/XMLSchema-instance" xsi:noNamespaceSchemaLocation="http://sumo.dlr.de/xsd/net_file.xsd">

    <location netOffset="0.00,0.00" convBoundary="-30.00,20.00,30.00,80.00" origBoundary="-10000000000.00,-10000000000.00,10000000000.00,10000000000.00" projParameter="!"/>

    <edge id=":J0_0" function="internal">
        <lane id=":J0_0_0" index="0" disallow="pedestrian" speed="6.86" length="10.16" shape="-4.80,61.10 -5.19,58.34 -6.37,56.38 -8.34,55.19 -11.10,54.80"/>
        <lane id=":J0_0_1" index="1" disallow="pedestrian" speed="8.29" length="15.32" shape="-1.60,61.10 -2.19,56.94 -3.97,53.98 -6.94,52.19 -11.10,51.60"/>
    </edge>
    <edge id=":J0_2" function="internal">
        <lane id=":J0_2_0" index="0" disallow="pedestrian" speed="13.89" length="22.20" shape="-1.60,61.10 -1.60,38.90"/>
    </edge>
    <edge id=":J0_3" function="internal">
        <lane id=":J0_3_0" index="0" disallow="pedestrian" speed="9.51" length="5.01" shape="-1.60,61.10 -0.89,56.14"/>
    </edge>
    <edge id=":J0_16" function="internal">
        <lane id=":J0_16_0" index="0" disallow="pedestrian" speed="9.51" length="15.47" shape="-0.89,56.14 -0.81,55.54 1.57,51.58 5.54,49.19 11.10,48.40"/>
    </edge>
    <edge id=":J0_4" function="internal">
        <lane id=":J0_4_0" index="0" disallow="pedestrian" speed="6.86" length="10.16" shape="11.10,54.80 8.34,55.19 6.37,56.37 5.19,58.34 4.80,61.10"/>
        <lane id=":J0_4_1" index="1" disallow="pedestrian" speed="8.29" length="15.32" shape="11.10,51.60 6.94,52.19 3.98,53.98 2.19,56.94 1.60,61.10"/>
    </edge>
    <edge id=":J0_6" function="internal">
        <lane id=":J0_6_0" index="0" disallow="pedestrian" speed="13.89" length="22.20" shape="11.10,51.60 -11.10,51.60"/>
    </edge>
    <edge id=":J0_7" function="internal">
        <lane id=":J0_7_0" index="0" disallow="pedestrian" speed="9.51" length="5.01" shape="11.10,51.60 6.14,50.89"/>
    </edge>
<truncated after showing first 30 lines>
---------- Missing result in routes ----------
<?xml version="1.0" encoding="UTF-8"?>


<routes xmlns:xsi="http://www.w3.org/2001/XMLSchema-instance" xsi:noNamespaceSchemaLocation="http://sumo.dlr.de/xsd/routes_file.xsd">
    <!-- Vehicles, persons and containers (sorted by depart) -->
    <vehicle id="trip_1" depart="0.00">
        <route edges="-E2 E3 -E3 E2" repeat="10"/>
    </vehicle>
    <vehicle id="trip_2" depart="0.00">
        <route edges="-E1 E0 -E0 E1" repeat="10"/>
    </vehicle>
    <vehicle id="trip_3" depart="0.00">
        <route edges="-E3 E2 -E2 E3" repeat="10"/>
    </vehicle>
    <vehicle id="trip_4" depart="0.00">
        <route edges="-E0 E1 -E1 E0" repeat="10"/>
    </vehicle>
</routes>

Detailed information for the tests that had known bugs:

8 TESTS had known bugs (Test needed #3045) on ts-sim-build-ba :

#3045
(This bug was triggered by text found in file 'errors' matching 'python: can't open file 'test.py'')
---------- New result in errors ----------
python: can't open file 'test.py': [Errno 2] No such file or directory
netelements trafficlights joined attributes E1 ( Last six runs Oct2022 )
netelements trafficlights joined file load ( Last six runs Oct2022 )
netelements trafficlights joined file save ( Last six runs Oct2022 )
netelements trafficlights joined programs select ( Last six runs Oct2022 )
netelements trafficlights single attributes E1 ( Last six runs Oct2022 )
netelements trafficlights single file load ( Last six runs Oct2022 )
netelements trafficlights single file save ( Last six runs Oct2022 )
netelements trafficlights single programs select ( Last six runs Oct2022 )

daily.selection: 22 tests: 21 succeeded 1 known bugs

Detailed information for the tests that had known bugs:

TEST had known bugs (Test needed #3045) on ts-sim-build-ba : selection basic contextual_menu ( Last six runs Oct2022 )

#3045
(This bug was triggered by text found in file 'errors' matching 'python: can't open file 'test.py'')
---------- New result in errors ----------
python: can't open file 'test.py': [Errno 2] No such file or directory

daily.shape.basic: 3 tests: 3 succeeded


daily.shape.poi: 47 tests: 46 succeeded 1 FAILED

Detailed information for the tests that FAILED:

TEST FAILED on ts-sim-build-ba : shapeelements poi delete ( Last six runs Oct2022 )

---------- Differences in additionals ----------
5a6
>     <poi id="POI_A" color="white" layer="0.00" x="12.40" y="17.50" imgFile="berlin_icon.ico" width="5.00" height="5.00"/>
---------- Differences in errors ----------
6d5
< Debug: Removing poi 'POI_A' in GNEChange_Additional
9c8
< Debug: Adding poi 'POI_A' in GNEChange_Additional
---
> Debug: Adding poi 'poi_0' in GNEChange_Additional
12c11
< Debug: Adding poi 'poi_0' in GNEChange_Additional
---
> Debug: Removing poi 'poi_0' in GNEChange_Additional
15c14
< Debug: Removing poi 'poi_0' in GNEChange_Additional
---
> Debug: Adding poi 'poi_0' in GNEChange_Additional
18c17
< Debug: Removing poi 'POI_A' in GNEChange_Additional
---
> Debug: Removing poi 'poi_0' in GNEChange_Additional

daily.shape.poigeo: 49 tests: 49 succeeded


daily.shape.poilane: 54 tests: 53 succeeded 1 FAILED

Detailed information for the tests that FAILED:

TEST FAILED on ts-sim-build-ba : shapeelements poilane delete ( Last six runs Oct2022 )

---------- Differences in additionals ----------
5a6
>     <poi id="POI_0" color="white" layer="20.00" lane="gneE1_0" pos="30.00" width="10.00" height="10.00"/>
---------- Differences in errors ----------
6d5
< Debug: Removing poiLane 'POI_0' in GNEChange_Additional
9c8
< Debug: Adding poiLane 'POI_0' in GNEChange_Additional
---
> Debug: Adding poiLane 'poi_0' in GNEChange_Additional
12c11
< Debug: Adding poiLane 'poi_0' in GNEChange_Additional
---
> Debug: Removing poiLane 'poi_0' in GNEChange_Additional
15c14
< Debug: Removing poiLane 'poi_0' in GNEChange_Additional
---
> Debug: Adding poiLane 'poi_0' in GNEChange_Additional
18c17
< Debug: Removing poiLane 'POI_0' in GNEChange_Additional
---
> Debug: Removing poiLane 'poi_0' in GNEChange_Additional

daily.shape.poly: 59 tests: 59 succeeded


daily.taz.basic: 1 tests: 1 succeeded


daily.taz.taz: 35 tests: 35 succeeded


daily.volatilerecomputing: 4 tests: 4 succeeded