29Oct24rv1_21_0+0500-40e566e1888 - detailed test results for NETEDITCHECKOUTPUT

To reconnect the TextTest GUI to these results, run:

texttest -a neteditcheckoutput -d /home/delphi/gcc/sumo/tests -reconnect /home/delphi/gcc/texttesttmp/gcc4_64.04Nov002635.3291375 -g

To start TextTest for these tests, run:

texttest -a neteditcheckoutput -d /home/delphi/gcc/sumo/tests


default: 7836 tests: 7637 succeeded 105 FAILED 89 known bugs 5 killed

Detailed information for the tests that FAILED:

TEST FAILED on ts-sim-build-ba : basic quit no_save_additionals ( Last six runs Nov2024 Oct2024 )

---------- Differences in errors ----------
0a1,2
> Error: File 'additionals.netedit' is not accessible (No such file or directory).
> Quitting (on error).
---------- New result in exitcode ----------
1

3 TESTS FAILED on ts-sim-build-ba :

---------- Differences in errors ----------
0a1,2
> Error: The route file 'routes.netedit' is not accessible.
> Quitting (on error).
---------- New result in exitcode ----------
1
basic quit no_save_demand ( Last six runs Nov2024 Oct2024 )
bugs ticket5552 ( Last six runs Nov2024 Oct2024 )
selection bugs ticket2948 ( Last six runs Nov2024 Oct2024 )

TEST FAILED on ts-sim-build-ba : elements additionals e2multilanedetector load period ( Last six runs Nov2024 Oct2024 )

---------- Differences in errors ----------
0a1
> Warning: The given time value 9223372036854773.76 is not a multiple of the step length 1.00 (in e2Detector 'multiLaneAreaDetector_0').

TEST FAILED on ts-sim-build-ba : elements additionals e2multilanedetector move ( Last six runs Nov2024 Oct2024 )

---------- Differences in errors ----------
0a1,2
> Error: The lane with the id 'center0_1' is not known (while building e2Detector 'e2_0').
> Quitting (on error).
---------- New result in exitcode ----------
1

TEST FAILED on ts-sim-build-ba : elements datas tazreldata load attributes_invalid ( Last six runs Nov2024 Oct2024 )

---------- Differences in errors ----------
1,2d0
< Error: File 'datas.netedit' is not accessible (No such file or directory).
< Quitting (on error).
---------- Missing result in exitcode ----------
1

18 TESTS FAILED on ts-sim-build-ba :

---------- Differences in errors ----------
0a1,3
> Error: The edge 'center1' within the route 'r_0' is not known.
>  The route can not be build.
> Quitting (on error).
---------- New result in exitcode ----------
1
elements shapes jupedsim obstacle move vertex_existent ( Last six runs Nov2024 Oct2024 )
elements shapes jupedsim obstacle move vertex_new ( Last six runs Nov2024 Oct2024 )
elements shapes jupedsim walkablearea delete ( Last six runs Nov2024 Oct2024 )
elements shapes jupedsim walkablearea move vertex_existent ( Last six runs Nov2024 Oct2024 )
elements shapes jupedsim walkablearea move vertex_new ( Last six runs Nov2024 Oct2024 )
elements shapes poly inspect closeshape ( Last six runs Nov2024 Oct2024 )
elements shapes poly inspect geo_shape ( Last six runs Nov2024 Oct2024 )
elements shapes poly inspect geo_use ( Last six runs Nov2024 Oct2024 )
elements shapes poly inspect_selected closeshape ( Last six runs Nov2024 Oct2024 )
elements shapes poly inspect_selected geo_use ( Last six runs Nov2024 Oct2024 )
elements shapes poly move vertex_existent ( Last six runs Nov2024 Oct2024 )
elements shapes poly move vertex_new ( Last six runs Nov2024 Oct2024 )
elements tazs delete ( Last six runs Nov2024 Oct2024 )
elements tazs inspect_selected center ( Last six runs Nov2024 Oct2024 )
elements tazs inspect_selected color ( Last six runs Nov2024 Oct2024 )
elements tazs inspect_selected fill ( Last six runs Nov2024 Oct2024 )
elements tazs inspect_selected name ( Last six runs Nov2024 Oct2024 )
elements tazs inspect_selected parameters ( Last six runs Nov2024 Oct2024 )

2 TESTS FAILED on ts-sim-build-ba :

---------- Differences in errors ----------
0a1,5
> Error: At district 'taz_0': succeeding edge 'center0' does not exist.
> Error: At district 'taz_0': succeeding edge 'center0' does not exist.
> Error: At district 'taz_0': succeeding edge 'center1' does not exist.
> Error: At district 'taz_0': succeeding edge 'center1' does not exist.
> Quitting (on error).
---------- New result in exitcode ----------
1
elements tazs move vertex_existent ( Last six runs Nov2024 Oct2024 )
elements tazs move vertex_new ( Last six runs Nov2024 Oct2024 )

3 TESTS FAILED on ts-sim-build-ba :

---------- New result in errors ----------
Error: The route file 'routes.netedit' is not accessible.
Quitting (on error).
network edges geometry_points create ( Last six runs Nov2024 Oct2024 )
network edges geometry_points delete ( Last six runs Nov2024 Oct2024 )
network edges geometry_points move ( Last six runs Nov2024 Oct2024 )

TEST FAILED on ts-sim-build-ba : network junctions contextual_menu connections clear ( Last six runs Nov2024 Oct2024 )

---------- Differences in errors ----------
0a1,5
> Error: The tls 'JunctionCenter' is not known.
> Error: The tls 'JunctionCenter' is not known.
> Error: The tls 'JunctionCenter' is not known.
> Error: The tls 'JunctionCenter' is not known.
> Quitting (on error).
---------- New result in exitcode ----------
1

2 TESTS FAILED on ts-sim-build-ba :

---------- Differences in errors ----------
0a1,3
> Warning: No connection between edge 'E20' and edge 'E15' found.
> Error: No connection found between edge 'E20' and edge 'E15' for person 'p_0'.
> Quitting (on error).
---------- New result in exitcode ----------
1
network junctions contextual_menu split split_junction ( Last six runs Nov2024 Oct2024 )
network junctions contextual_menu split split_junction_and_reconnect ( Last six runs Nov2024 Oct2024 )

2 TESTS FAILED on ts-sim-build-ba :

---------- Differences in errors ----------
0a1,8
> Warning: Teleporting vehicle 't_0'; waited too long (yield), lane='-E5_1', time=305.00.
> Warning: Vehicle 't_0' ends teleporting on edge 'E7', time=305.00.
> Warning: Teleporting vehicle 't_1'; waited too long (yield), lane='-E7_1', time=306.00.
> Warning: Teleporting vehicle 't_2'; waited too long (yield), lane='-E6_1', time=306.00.
> Warning: Teleporting vehicle 't_3'; waited too long (yield), lane='-E4_1', time=306.00.
> Warning: Vehicle 't_1' ends teleporting on edge 'E5', time=306.00.
> Warning: Vehicle 't_2' ends teleporting on edge 'E4', time=306.00.
> Warning: Vehicle 't_3' ends teleporting on edge 'E6', time=306.00.
network junctions inspect no_tls selected type rail_signal ( Last six runs Nov2024 Oct2024 )
network junctions inspect no_tls unselected type rail_signal ( Last six runs Nov2024 Oct2024 )

4 TESTS FAILED on ts-sim-build-ba :

---------- Differences in errors ----------
0a1,2
> Error: Zipper junctions with more than two conflicting lanes are not supported (at junction 'JunctionCenter')
> Quitting (on error).
---------- New result in exitcode ----------
1
network junctions inspect no_tls selected type zipper ( Last six runs Nov2024 Oct2024 )
network junctions inspect no_tls unselected type zipper ( Last six runs Nov2024 Oct2024 )
network junctions inspect tls selected type zipper ( Last six runs Nov2024 Oct2024 )
network junctions inspect tls unselected type zipper ( Last six runs Nov2024 Oct2024 )

TEST FAILED on ts-sim-build-ba : network junctions inspect tls selected type rail_signal ( Last six runs Nov2024 Oct2024 )

---------- Differences in errors ----------
0a1,8
> Warning: Teleporting vehicle 't_0'; waited too long (yield), lane='-E5_1', time=305.00.
> Warning: Teleporting vehicle 't_3'; waited too long (yield), lane='-E4_1', time=305.00.
> Warning: Vehicle 't_0' ends teleporting on edge 'E7', time=305.00.
> Warning: Vehicle 't_3' ends teleporting on edge 'E6', time=305.00.
> Warning: Teleporting vehicle 't_2'; waited too long (yield), lane='-E6_1', time=306.00.
> Warning: Vehicle 't_2' ends teleporting on edge 'E4', time=306.00.
> Warning: Teleporting vehicle 't_1'; waited too long (yield), lane='-E7_1', time=307.00.
> Warning: Vehicle 't_1' ends teleporting on edge 'E5', time=307.00.

TEST FAILED on ts-sim-build-ba : network junctions inspect tls unselected type rail_signal ( Last six runs Nov2024 Oct2024 )

---------- Differences in errors ----------
0a1,8
> Warning: Teleporting vehicle 't_2'; waited too long (yield), lane='-E6_1', time=304.00.
> Warning: Vehicle 't_2' ends teleporting on edge 'E4', time=304.00.
> Warning: Teleporting vehicle 't_1'; waited too long (yield), lane='-E7_1', time=305.00.
> Warning: Teleporting vehicle 't_3'; waited too long (yield), lane='-E4_1', time=305.00.
> Warning: Vehicle 't_1' ends teleporting on edge 'E5', time=305.00.
> Warning: Vehicle 't_3' ends teleporting on edge 'E6', time=305.00.
> Warning: Teleporting vehicle 't_0'; waited too long (yield), lane='-E5_1', time=306.00.
> Warning: Vehicle 't_0' ends teleporting on edge 'E7', time=306.00.

2 TESTS FAILED on ts-sim-build-ba :

---------- Differences in errors ----------
1c1
< Error: At traffic signal 'J0' program '0' no phase named '4' was found
---
> Error: At traffic signal 'J0' program '0' no phase named '2' was found
network trafficlights joined phases NEMA buttons delete ( Last six runs Nov2024 Oct2024 )
network trafficlights joined phases NEMA name ( Last six runs Nov2024 Oct2024 )

8 TESTS FAILED on ts-sim-build-ba :

---------- Differences in errors ----------
1c1,2
< Warning: Missing yellow phase in tlLogic 'J0', program '0' for tl-index 1 when switching to phase 1.
---
> Warning: Missing yellow phase in tlLogic 'J0', program '0' for tl-index 1 when switching from phase 0 to phase 1.
> Warning: Missing yellow phase in tlLogic 'J0', program '0' for tl-index 0 when switching from phase 1 to phase 0.
network trafficlights joined phases delay_based buttons add default ( Last six runs Nov2024 Oct2024 )
network trafficlights joined phases delay_based buttons add green ( Last six runs Nov2024 Oct2024 )
network trafficlights joined phases delay_based buttons add greenpriority ( Last six runs Nov2024 Oct2024 )
network trafficlights joined phases delay_based buttons add yellow ( Last six runs Nov2024 Oct2024 )
network trafficlights joined phases static buttons add default ( Last six runs Nov2024 Oct2024 )
network trafficlights joined phases static buttons add green ( Last six runs Nov2024 Oct2024 )
network trafficlights joined phases static buttons add greenpriority ( Last six runs Nov2024 Oct2024 )
network trafficlights joined phases static buttons add yellow ( Last six runs Nov2024 Oct2024 )

2 TESTS FAILED on ts-sim-build-ba :

---------- Differences in errors ----------
1,2c1,3
< Warning: Missing yellow phase in tlLogic 'J0', program '0' for tl-index 1 when switching to phase 1.
< Warning: Missing yellow phase in tlLogic 'J0', program '0' for tl-index 0 when switching to phase 0.
---
> Warning: Missing yellow phase in tlLogic 'J0', program '0' for tl-index 1 when switching from phase 0 to phase 1.
> Warning: Missing yellow phase in tlLogic 'J0', program '0' for tl-index 0 when switching from phase 1 to phase 0.
> Warning: Missing yellow phase in tlLogic 'J0', program '0' for tl-index 0 when switching from phase 2 to phase 0.
network trafficlights joined phases delay_based buttons add duplicate ( Last six runs Nov2024 Oct2024 )
network trafficlights joined phases static buttons add duplicate ( Last six runs Nov2024 Oct2024 )

2 TESTS FAILED on ts-sim-build-ba :

---------- Differences in errors ----------
1,2c1,2
< Warning: Missing yellow phase in tlLogic 'J0', program '0' for tl-index 1 when switching to phase 1.
< Warning: Missing yellow phase in tlLogic 'J0', program '0' for tl-index 0 when switching to phase 2.
---
> Warning: Missing yellow phase in tlLogic 'J0', program '0' for tl-index 1 when switching from phase 0 to phase 1.
> Warning: Missing yellow phase in tlLogic 'J0', program '0' for tl-index 0 when switching from phase 1 to phase 0.
network trafficlights joined phases delay_based buttons add red ( Last six runs Nov2024 Oct2024 )
network trafficlights joined phases static buttons add red ( Last six runs Nov2024 Oct2024 )

2 TESTS FAILED on ts-sim-build-ba :

---------- Differences in errors ----------
1,4c1,4
< Warning: Unused states in tlLogic 'J0', program '0' in phase 0 after tl-index 23
< Warning: Missing yellow phase in tlLogic 'J0', program '0' for tl-index 1 when switching to phase 1.
< Warning: Missing yellow phase in tlLogic 'J0', program '0' for tl-index 0 when switching to phase 0.
< Warning: Missing green phase in tlLogic 'J0', program '0' for tl-index 24.
---
> Warning: Unused states in tlLogic 'J0', program '0' in phase 0 after tl-index 19
> Warning: Missing yellow phase in tlLogic 'J0', program '0' for tl-index 1 when switching from phase 0 to phase 1.
> Warning: Missing yellow phase in tlLogic 'J0', program '0' for tl-index 0 when switching from phase 1 to phase 0.
> Warning: Missing green phase in tlLogic 'J0', program '0' for tl-index 20.
network trafficlights joined phases delay_based buttons addstates ( Last six runs Nov2024 Oct2024 )
network trafficlights joined phases static buttons addstates ( Last six runs Nov2024 Oct2024 )

10 TESTS FAILED on ts-sim-build-ba :

---------- Differences in errors ----------
1,2c1,2
< Warning: Missing yellow phase in tlLogic 'J0', program '0' for tl-index 1 when switching to phase 1.
< Warning: Missing yellow phase in tlLogic 'J0', program '0' for tl-index 0 when switching to phase 0.
---
> Warning: Missing yellow phase in tlLogic 'J0', program '0' for tl-index 1 when switching from phase 0 to phase 1.
> Warning: Missing yellow phase in tlLogic 'J0', program '0' for tl-index 0 when switching from phase 1 to phase 0.
network trafficlights joined phases delay_based buttons cleanstates ( Last six runs Nov2024 Oct2024 )
network trafficlights joined phases delay_based buttons groupsignals ( Last six runs Nov2024 Oct2024 )
network trafficlights joined phases delay_based buttons ungroupsignals ( Last six runs Nov2024 Oct2024 )
network trafficlights joined phases delay_based dur ( Last six runs Nov2024 Oct2024 )
network trafficlights joined phases delay_based name ( Last six runs Nov2024 Oct2024 )
network trafficlights joined phases static buttons cleanstates ( Last six runs Nov2024 Oct2024 )
network trafficlights joined phases static buttons groupsignals ( Last six runs Nov2024 Oct2024 )
network trafficlights joined phases static buttons ungroupsignals ( Last six runs Nov2024 Oct2024 )
network trafficlights joined phases static dur ( Last six runs Nov2024 Oct2024 )
network trafficlights joined phases static name ( Last six runs Nov2024 Oct2024 )

2 TESTS FAILED on ts-sim-build-ba :

---------- Differences in errors ----------
0a1,3
> Warning: Teleporting vehicle 'trip_1'; waited too long (yield), lane='-E2_2', time=305.00.
> Warning: Vehicle 'trip_1' ends teleporting on edge 'E3', time=305.00.
> Warning: Teleporting vehicle 'trip_4'; waited too long (yield), lane='-E0_2', time=306.00.
2d4
< Warning: Teleporting vehicle 'trip_1'; waited too long (yield), lane='-E2_2', time=306.00.
4d5
< Warning: Vehicle 'trip_1' ends teleporting on edge 'E3', time=306.00.
7,176c8,260
< Warning: Teleporting vehicle 'trip_4'; waited too long (yield), lane='-E0_2', time=307.00.
< Warning: Vehicle 'trip_4' ends teleporting on edge 'E1', time=307.00.
< Warning: Teleporting vehicle 'trip_1'; waited too long (yield), lane='-E3_2', time=617.00.
< Warning: Vehicle 'trip_1' ends teleporting on edge 'E2', time=617.00.
< Warning: Teleporting vehicle 'trip_3'; waited too long (yield), lane='-E2_2', time=618.00.
< Warning: Vehicle 'trip_3' ends teleporting on edge 'E3', time=618.00.
< Warning: Teleporting vehicle 'trip_4'; waited too long (yield), lane='-E1_2', time=619.00.
< Warning: Vehicle 'trip_4' ends teleporting on edge 'E0', time=619.00.
< Warning: Teleporting vehicle 'trip_2'; waited too long (yield), lane='-E0_2', time=620.00.
< Warning: Vehicle 'trip_2' ends teleporting on edge 'E1', time=620.00.
< Warning: Teleporting vehicle 'trip_1'; waited too long (yield), lane='-E2_2', time=927.00.
< Warning: Vehicle 'trip_1' ends teleporting on edge 'E3', time=927.00.
< Warning: Teleporting vehicle 'trip_4'; waited too long (yield), lane='-E0_2', time=930.00.
< Warning: Teleporting vehicle 'trip_3'; waited too long (yield), lane='-E3_2', time=930.00.
< Warning: Vehicle 'trip_3' ends teleporting on edge 'E2', time=930.00.
< Warning: Vehicle 'trip_4' ends teleporting on edge 'E1', time=930.00.
< Warning: Teleporting vehicle 'trip_2'; waited too long (yield), lane='-E1_2', time=933.00.
< Warning: Vehicle 'trip_2' ends teleporting on edge 'E0', time=933.00.
< Warning: Teleporting vehicle 'trip_1'; waited too long (yield), lane='-E3_2', time=1237.00.
< Warning: Vehicle 'trip_1' ends teleporting on edge 'E2', time=1237.00.
< Warning: Teleporting vehicle 'trip_4'; waited too long (yield), lane='-E1_2', time=1242.00.
<truncated after showing first 30 lines>
network trafficlights joined phases delay_based buttons delete ( Last six runs Nov2024 Oct2024 )
network trafficlights joined phases static buttons delete ( Last six runs Nov2024 Oct2024 )

2 TESTS FAILED on ts-sim-build-ba :

---------- Differences in errors ----------
1,2d0
< Warning: Missing yellow phase in tlLogic 'J0', program '0' for tl-index 0 when switching to phase 1.
< Warning: Missing yellow phase in tlLogic 'J0', program '0' for tl-index 1 when switching to phase 0.
network trafficlights joined phases delay_based buttons movedown ( Last six runs Nov2024 Oct2024 )
network trafficlights joined phases delay_based buttons moveup ( Last six runs Nov2024 Oct2024 )

TEST FAILED on ts-sim-build-ba : network trafficlights joined phases delay_based max ( Last six runs Nov2024 Oct2024 )

---------- Differences in errors ----------
2,3c2,3
< Warning: Missing yellow phase in tlLogic 'J0', program '0' for tl-index 1 when switching to phase 1.
< Warning: Missing yellow phase in tlLogic 'J0', program '0' for tl-index 0 when switching to phase 0.
---
> Warning: Missing yellow phase in tlLogic 'J0', program '0' for tl-index 1 when switching from phase 0 to phase 1.
> Warning: Missing yellow phase in tlLogic 'J0', program '0' for tl-index 0 when switching from phase 1 to phase 0.

TEST FAILED on ts-sim-build-ba : network trafficlights joined phases delay_based min ( Last six runs Nov2024 Oct2024 )

---------- Differences in errors ----------
1,176c1,2
< Warning: Missing yellow phase in tlLogic 'J0', program '0' for tl-index 1 when switching to phase 1.
< Warning: Missing yellow phase in tlLogic 'J0', program '0' for tl-index 0 when switching to phase 0.
< Warning: Teleporting vehicle 'trip_2'; waited too long (yield), lane='-E1_2', time=306.00.
< Warning: Teleporting vehicle 'trip_1'; waited too long (yield), lane='-E2_2', time=306.00.
< Warning: Teleporting vehicle 'trip_3'; waited too long (yield), lane='-E3_2', time=306.00.
< Warning: Vehicle 'trip_1' ends teleporting on edge 'E3', time=306.00.
< Warning: Vehicle 'trip_2' ends teleporting on edge 'E0', time=306.00.
< Warning: Vehicle 'trip_3' ends teleporting on edge 'E2', time=306.00.
< Warning: Teleporting vehicle 'trip_4'; waited too long (yield), lane='-E0_2', time=307.00.
< Warning: Vehicle 'trip_4' ends teleporting on edge 'E1', time=307.00.
< Warning: Teleporting vehicle 'trip_3'; waited too long (yield), lane='-E2_2', time=618.00.
< Warning: Vehicle 'trip_3' ends teleporting on edge 'E3', time=618.00.
< Warning: Teleporting vehicle 'trip_4'; waited too long (yield), lane='-E1_2', time=619.00.
< Warning: Vehicle 'trip_4' ends teleporting on edge 'E0', time=619.00.
< Warning: Teleporting vehicle 'trip_2'; waited too long (yield), lane='-E0_2', time=620.00.
< Warning: Vehicle 'trip_2' ends teleporting on edge 'E1', time=620.00.
< Warning: Teleporting vehicle 'trip_1'; waited too long (yield), lane='-E2_2', time=923.00.
< Warning: Vehicle 'trip_1' ends teleporting on edge 'E3', time=923.00.
< Warning: Teleporting vehicle 'trip_4'; waited too long (yield), lane='-E0_2', time=930.00.
< Warning: Vehicle 'trip_4' ends teleporting on edge 'E1', time=930.00.
< Warning: Teleporting vehicle 'trip_3'; waited too long (yield), lane='-E3_2', time=931.00.
< Warning: Vehicle 'trip_3' ends teleporting on edge 'E2', time=931.00.
< Warning: Teleporting vehicle 'trip_2'; waited too long (yield), lane='-E1_2', time=933.00.
< Warning: Vehicle 'trip_2' ends teleporting on edge 'E0', time=933.00.
< Warning: Teleporting vehicle 'trip_1'; waited too long (yield), lane='-E3_2', time=1237.00.
< Warning: Vehicle 'trip_1' ends teleporting on edge 'E2', time=1237.00.
< Warning: Teleporting vehicle 'trip_3'; waited too long (yield), lane='-E2_2', time=1241.00.
< Warning: Vehicle 'trip_3' ends teleporting on edge 'E3', time=1241.00.
< Warning: Teleporting vehicle 'trip_4'; waited too long (yield), lane='-E1_2', time=1242.00.
<truncated after showing first 30 lines>

2 TESTS FAILED on ts-sim-build-ba :

---------- Differences in errors ----------
2c2
< Warning: Missing yellow phase in tlLogic 'J0', program '0' for tl-index 0 when switching to phase 0.
---
> Warning: Missing yellow phase in tlLogic 'J0', program '0' for tl-index 0 when switching from phase 1 to phase 0.
network trafficlights joined phases delay_based next ( Last six runs Nov2024 Oct2024 )
network trafficlights joined phases static next ( Last six runs Nov2024 Oct2024 )

2 TESTS FAILED on ts-sim-build-ba :

---------- Differences in errors ----------
1,170c1,2
< Warning: Missing yellow phase in tlLogic 'J0', program '0' for tl-index 0 when switching to phase 0.
< Warning: Missing green phase in tlLogic 'J0', program '0' for tl-index 1.
< Warning: Teleporting vehicle 'trip_1'; waited too long (yield), lane='E3_2', time=340.00.
< Warning: Teleporting vehicle 'trip_3'; waited too long (yield), lane='E2_2', time=340.00.
< Warning: Vehicle 'trip_1' ends teleporting on edge '-E3', time=340.00.
< Warning: Vehicle 'trip_3' ends teleporting on edge '-E2', time=340.00.
< Warning: Teleporting vehicle 'trip_2'; waited too long (yield), lane='E0_2', time=341.00.
< Warning: Vehicle 'trip_2' ends teleporting on edge '-E0', time=341.00.
< Warning: Teleporting vehicle 'trip_4'; waited too long (yield), lane='E1_2', time=343.00.
< Warning: Vehicle 'trip_4' ends teleporting on edge '-E1', time=343.00.
< Warning: Teleporting vehicle 'trip_3'; waited too long (yield), lane='E3_2', time=680.00.
< Warning: Teleporting vehicle 'trip_1'; waited too long (yield), lane='E2_2', time=680.00.
< Warning: Vehicle 'trip_1' ends teleporting on edge '-E2', time=680.00.
< Warning: Vehicle 'trip_3' ends teleporting on edge '-E3', time=680.00.
< Warning: Teleporting vehicle 'trip_2'; waited too long (yield), lane='E1_2', time=682.00.
< Warning: Teleporting vehicle 'trip_4'; waited too long (yield), lane='E0_2', time=682.00.
< Warning: Vehicle 'trip_2' ends teleporting on edge '-E1', time=682.00.
< Warning: Vehicle 'trip_4' ends teleporting on edge '-E0', time=682.00.
< Warning: Teleporting vehicle 'trip_3'; waited too long (yield), lane='E2_2', time=1019.00.
< Warning: Vehicle 'trip_3' ends teleporting on edge '-E2', time=1019.00.
< Warning: Teleporting vehicle 'trip_1'; waited too long (yield), lane='E3_2', time=1020.00.
< Warning: Vehicle 'trip_1' ends teleporting on edge '-E3', time=1020.00.
< Warning: Teleporting vehicle 'trip_4'; waited too long (yield), lane='E1_2', time=1023.00.
< Warning: Teleporting vehicle 'trip_2'; waited too long (yield), lane='E0_2', time=1023.00.
< Warning: Vehicle 'trip_2' ends teleporting on edge '-E0', time=1023.00.
< Warning: Vehicle 'trip_4' ends teleporting on edge '-E1', time=1023.00.
< Warning: Teleporting vehicle 'trip_1'; waited too long (yield), lane='E2_2', time=1359.00.
< Warning: Vehicle 'trip_1' ends teleporting on edge '-E2', time=1359.00.
< Warning: Teleporting vehicle 'trip_3'; waited too long (yield), lane='E3_2', time=1360.00.
<truncated after showing first 30 lines>
network trafficlights joined phases delay_based state ( Last six runs Nov2024 Oct2024 )
network trafficlights joined phases static state ( Last six runs Nov2024 Oct2024 )

2 TESTS FAILED on ts-sim-build-ba :

---------- Differences in errors ----------
1,2c1,84
< Warning: Missing yellow phase in tlLogic 'J0', program '0' for tl-index 0 when switching to phase 1.
< Warning: Missing yellow phase in tlLogic 'J0', program '0' for tl-index 1 when switching to phase 0.
---
> Warning: Teleporting vehicle 'trip_1'; waited too long (yield), lane='E3_2', time=311.00.
> Warning: Vehicle 'trip_1' ends teleporting on edge '-E3', time=311.00.
> Warning: Teleporting vehicle 'trip_4'; waited too long (yield), lane='E1_2', time=313.00.
> Warning: Vehicle 'trip_4' ends teleporting on edge '-E1', time=313.00.
> Warning: Teleporting vehicle 'trip_3'; waited too long (yield), lane='E3_2', time=615.00.
> Warning: Vehicle 'trip_3' ends teleporting on edge '-E3', time=615.00.
> Warning: Teleporting vehicle 'trip_2'; waited too long (yield), lane='E1_2', time=618.00.
> Warning: Vehicle 'trip_2' ends teleporting on edge '-E1', time=618.00.
> Warning: Teleporting vehicle 'trip_1'; waited too long (yield), lane='E3_2', time=920.00.
> Warning: Vehicle 'trip_1' ends teleporting on edge '-E3', time=920.00.
> Warning: Teleporting vehicle 'trip_4'; waited too long (yield), lane='E1_2', time=923.00.
> Warning: Vehicle 'trip_4' ends teleporting on edge '-E1', time=923.00.
> Warning: Teleporting vehicle 'trip_3'; waited too long (yield), lane='E3_2', time=1225.00.
> Warning: Vehicle 'trip_3' ends teleporting on edge '-E3', time=1225.00.
> Warning: Teleporting vehicle 'trip_2'; waited too long (yield), lane='E1_2', time=1228.00.
> Warning: Vehicle 'trip_2' ends teleporting on edge '-E1', time=1228.00.
> Warning: Teleporting vehicle 'trip_1'; waited too long (yield), lane='E3_2', time=1529.00.
> Warning: Vehicle 'trip_1' ends teleporting on edge '-E3', time=1529.00.
> Warning: Teleporting vehicle 'trip_4'; waited too long (yield), lane='E1_2', time=1533.00.
> Warning: Vehicle 'trip_4' ends teleporting on edge '-E1', time=1533.00.
> Warning: Teleporting vehicle 'trip_3'; waited too long (yield), lane='E3_2', time=1836.00.
> Warning: Vehicle 'trip_3' ends teleporting on edge '-E3', time=1836.00.
> Warning: Teleporting vehicle 'trip_2'; waited too long (yield), lane='E1_2', time=1838.00.
> Warning: Vehicle 'trip_2' ends teleporting on edge '-E1', time=1838.00.
> Warning: Teleporting vehicle 'trip_1'; waited too long (yield), lane='E3_2', time=2141.00.
> Warning: Vehicle 'trip_1' ends teleporting on edge '-E3', time=2141.00.
<truncated after showing first 30 lines>
network trafficlights joined phases static buttons movedown ( Last six runs Nov2024 Oct2024 )
network trafficlights joined phases static buttons moveup ( Last six runs Nov2024 Oct2024 )

TEST FAILED on ts-sim-build-ba : network trafficlights single phases NEMA buttons add default ( Last six runs Nov2024 Oct2024 )

---------- Differences in errors ----------
0a1
> Warning: At NEMA tlLogic 'J0', actuated phase 1 has no controlling detector

TEST FAILED on ts-sim-build-ba : network trafficlights single phases NEMA buttons add duplicate ( Last six runs Nov2024 Oct2024 )

---------- Differences in errors ----------
0a1
> Warning: At NEMA tlLogic 'J0', the phases before barrier 1 from both rings do not add up. (ring1=105.00, ring2=55.00)

TEST FAILED on ts-sim-build-ba : network trafficlights single phases NEMA buttons add green ( Last six runs Nov2024 Oct2024 )

---------- Differences in errors ----------
0a1,4
> Warning: Program '0' at tlLogic 'J0' is incompatible with logic at junction 'J0' (mutual conflict between link indices 2,7 tl indices 2,7 phase 1).
>   To avoid deadlock/collisions, either: rebuild the signal plan with a newer version of netconvert/netedit
>   or rebuild the network with option '--tls.ignore-internal-junction-jam' or include the program when building.
> Warning: At NEMA tlLogic 'J0', actuated phase 1 has no controlling detector

TEST FAILED on ts-sim-build-ba : network trafficlights single phases NEMA buttons addstates ( Last six runs Nov2024 Oct2024 )

---------- Differences in errors ----------
0a1,2
> Warning: Unused states in tlLogic 'J0', program '0' in phase 0 after tl-index 15
> Warning: Missing green phase in tlLogic 'J0', program '0' for tl-index 16.

TEST FAILED on ts-sim-build-ba : network trafficlights single phases NEMA max ( Last six runs Nov2024 Oct2024 )

---------- Differences in errors ----------
0a1
> Warning: At NEMA tlLogic 'J0', the phases before barrier 2 from both rings do not add up. (ring1=18.15, ring2=55.00)

TEST FAILED on ts-sim-build-ba : network trafficlights single phases NEMA red ( Last six runs Nov2024 Oct2024 )

---------- Differences in errors ----------
0a1
> Warning: At NEMA tlLogic 'J0', the phases before barrier 2 from both rings do not add up. (ring1=66.15, ring2=55.00)

TEST FAILED on ts-sim-build-ba : network trafficlights single phases NEMA state ( Last six runs Nov2024 Oct2024 )

---------- Differences in errors ----------
0a1,2
> Warning: At NEMA tlLogic 'J0', the phases before barrier 2 from both rings do not add up. (ring1=55.00, ring2=90.00)
> Warning: Missing green phase in tlLogic 'J0', program '0' for tl-index 5.

TEST FAILED on ts-sim-build-ba : network trafficlights single phases NEMA yellow ( Last six runs Nov2024 Oct2024 )

---------- Differences in errors ----------
0a1
> Warning: At NEMA tlLogic 'J0', the phases before barrier 1 from both rings do not add up. (ring1=55.00, ring2=65.15)

2 TESTS FAILED on ts-sim-build-ba :

---------- Differences in errors ----------
0a1
> Warning: Missing yellow phase in tlLogic 'J0', program '0' for tl-index 4 when switching to phase 0.
network trafficlights single phases actuated buttons delete ( Last six runs Nov2024 Oct2024 )
network trafficlights single phases delay_based buttons add default ( Last six runs Nov2024 Oct2024 )

TEST FAILED on ts-sim-build-ba : network trafficlights single phases actuated state ( Last six runs Nov2024 Oct2024 )

---------- Differences in errors ----------
0a1,2
> Error: File 'net.netedit' is not accessible (No such file or directory).
> Quitting (on error).
---------- New result in exitcode ----------
1

2 TESTS FAILED on ts-sim-build-ba :

---------- Differences in errors ----------
0a1,2
> Warning: Missing yellow phase in tlLogic 'J0', program '0' for tl-index 0 when switching to phase 1.
> Warning: Missing yellow phase in tlLogic 'J0', program '0' for tl-index 4 when switching to phase 2.
network trafficlights single phases delay_based buttons delete ( Last six runs Nov2024 Oct2024 )
network trafficlights single phases static buttons delete ( Last six runs Nov2024 Oct2024 )

TEST FAILED on ts-sim-build-ba : network trafficlights single phases delay_based buttons moveup ( Last six runs Nov2024 Oct2024 )

---------- Differences in errors ----------
1d0
< Warning: Missing yellow phase in tlLogic 'J0', program '0' for tl-index 4 when switching to phase 0.

TEST FAILED on ts-sim-build-ba : network trafficlights single phases static buttons add default ( Last six runs Nov2024 Oct2024 )

---------- Differences in errors ----------
0a1,89
> Warning: Missing green phase in tlLogic 'J0', program '0' for tl-index 0.
> Warning: Teleporting vehicle 'trip_3'; waited too long (yield), lane='-E3_2', time=305.00.
> Warning: Vehicle 'trip_3' ends teleporting on edge 'E2', time=305.00.
> Warning: Teleporting vehicle 'trip_1'; waited too long (yield), lane='-E2_2', time=306.00.
> Warning: Vehicle 'trip_1' ends teleporting on edge 'E3', time=306.00.
> Warning: Teleporting vehicle 'trip_3'; waited too long (yield), lane='-E2_2', time=613.00.
> Warning: Vehicle 'trip_3' ends teleporting on edge 'E3', time=613.00.
> Warning: Teleporting vehicle 'trip_1'; waited too long (yield), lane='-E3_2', time=615.00.
> Warning: Vehicle 'trip_1' ends teleporting on edge 'E2', time=615.00.
> Warning: Teleporting vehicle 'trip_1'; waited too long (yield), lane='-E2_2', time=923.00.
> Warning: Teleporting vehicle 'trip_3'; waited too long (yield), lane='-E3_2', time=923.00.
> Warning: Vehicle 'trip_1' ends teleporting on edge 'E3', time=923.00.
> Warning: Vehicle 'trip_3' ends teleporting on edge 'E2', time=923.00.
> Warning: Teleporting vehicle 'trip_1'; waited too long (yield), lane='-E3_2', time=1231.00.
> Warning: Vehicle 'trip_1' ends teleporting on edge 'E2', time=1231.00.
> Warning: Teleporting vehicle 'trip_3'; waited too long (yield), lane='-E2_2', time=1233.00.
> Warning: Vehicle 'trip_3' ends teleporting on edge 'E3', time=1233.00.
> Warning: Teleporting vehicle 'trip_1'; waited too long (yield), lane='-E2_2', time=1540.00.
> Warning: Vehicle 'trip_1' ends teleporting on edge 'E3', time=1540.00.
> Warning: Teleporting vehicle 'trip_3'; waited too long (yield), lane='-E3_2', time=1542.00.
> Warning: Vehicle 'trip_3' ends teleporting on edge 'E2', time=1542.00.
> Warning: Teleporting vehicle 'trip_1'; waited too long (yield), lane='-E3_2', time=1848.00.
> Warning: Vehicle 'trip_1' ends teleporting on edge 'E2', time=1848.00.
> Warning: Teleporting vehicle 'trip_3'; waited too long (yield), lane='-E2_2', time=1850.00.
> Warning: Vehicle 'trip_3' ends teleporting on edge 'E3', time=1850.00.
> Warning: Teleporting vehicle 'trip_1'; waited too long (yield), lane='-E2_2', time=2157.00.
> Warning: Vehicle 'trip_1' ends teleporting on edge 'E3', time=2157.00.
> Warning: Teleporting vehicle 'trip_3'; waited too long (yield), lane='-E3_2', time=2160.00.
> Warning: Vehicle 'trip_3' ends teleporting on edge 'E2', time=2160.00.
<truncated after showing first 30 lines>

TEST FAILED on ts-sim-build-ba : network trafficlights single phases static state ( Last six runs Nov2024 Oct2024 )

---------- Differences in errors ----------
0a1,2
> Warning: Missing yellow phase in tlLogic 'J0', program '0' for tl-index 1 when switching to phase 3.
> Warning: Missing green phase in tlLogic 'J0', program '0' for tl-index 5.

TEST FAILED on ts-sim-build-ba : network trafficlights single programs delete ( Last six runs Nov2024 Oct2024 )

---------- Differences in errors ----------
0a1
> Warning: Missing yellow phase in tlLogic 'J0', program '0' for tl-index 0 when switching to phase 0.

2 TESTS FAILED on ts-sim-build-ba :

---------- Differences in errors ----------
0a1,2
> Warning: Missing yellow phase in tlLogic 'J0', program '0' for tl-index 0 when switching to phase 0.
> Warning: Missing yellow phase in tlLogic 'J0', program '1' for tl-index 0 when switching to phase 2.
network trafficlights single programs resetall ( Last six runs Nov2024 Oct2024 )
network trafficlights single programs resetphase ( Last six runs Nov2024 Oct2024 )

3 TESTS FAILED on ts-sim-build-ba :

---------- Differences in errors ----------
0a1,2
> Error: Source junction 'J3' has no outgoing edges for trip 't_1'!
> Quitting (on error).
---------- New result in exitcode ----------
1
selection basic undo_redo ( Last six runs Nov2024 Oct2024 )
selection draws rectangle_medium ( Last six runs Nov2024 Oct2024 )
selection draws rectangle_small ( Last six runs Nov2024 Oct2024 )

2 TESTS FAILED on ts-sim-build-ba :

---------- New result in exitcode ----------
1
selection lockselection connections ( Last six runs Nov2024 Oct2024 )
selection lockselection crossings ( Last six runs Nov2024 Oct2024 )

TEST FAILED on ts-sim-build-ba : selection operations invert ( Last six runs Nov2024 Oct2024 )

---------- Differences in errors ----------
0a1,2
> Error: Source taz 'taz_3' has no outgoing edges for trip 't_2'!
> Quitting (on error).
---------- New result in exitcode ----------
1

TEST FAILED on ts-sim-build-ba : selection viewoptions show_connections ( Last six runs Nov2024 Oct2024 )

---------- Differences in errors ----------
0a1,5
> Error: The tls 'J0' is not known.
> Error: The tls 'J0' is not known.
> Error: The tls 'J0' is not known.
> Error: The tls 'J0' is not known.
> Quitting (on error).
---------- New result in exitcode ----------
1

Detailed information for the tests that had known bugs:

89 TESTS had known bugs (Test needed #3045) on ts-sim-build-ba :

#3045
(This bug was triggered by text found in file 'errors' matching 'File 'net.netedit' is not accessible')
---------- New result in errors ----------
Error: File 'net.netedit' is not accessible (No such file or directory).
Quitting (on error).
elements additionals access fix ( Last six runs Nov2024 Oct2024 )
elements additionals calibrator delete ( Last six runs Nov2024 Oct2024 )
elements additionals calibratorflow create ( Last six runs Nov2024 Oct2024 )
elements additionals calibratorflow delete ( Last six runs Nov2024 Oct2024 )
elements additionals calibratorflow inspect ( Last six runs Nov2024 Oct2024 )
elements additionals calibratorflow inspect_selection ( Last six runs Nov2024 Oct2024 )
elements additionals calibratorflow volatilerecomputing ( Last six runs Nov2024 Oct2024 )
elements additionals calibratorlane delete ( Last six runs Nov2024 Oct2024 )
elements additionals detentry fix ( Last six runs Nov2024 Oct2024 )
elements additionals detexit fix ( Last six runs Nov2024 Oct2024 )
elements additionals e1detector fix ( Last six runs Nov2024 Oct2024 )
elements additionals e1instantdetector fix ( Last six runs Nov2024 Oct2024 )
elements additionals e2detector fix ( Last six runs Nov2024 Oct2024 )
elements additionals e2multilanedetector fix ( Last six runs Nov2024 Oct2024 )
elements additionals e3detector fix ( Last six runs Nov2024 Oct2024 )
elements additionals rerouter contextual_menu ( Last six runs Nov2024 Oct2024 )
elements additionals rerouter create ( Last six runs Nov2024 Oct2024 )
elements additionals rerouter delete ( Last six runs Nov2024 Oct2024 )
elements additionals rerouter inspect ( Last six runs Nov2024 Oct2024 )
elements additionals rerouter inspect_selection ( Last six runs Nov2024 Oct2024 )
elements additionals rerouter move ( Last six runs Nov2024 Oct2024 )
elements additionals rerouter volatile_recomputing ( Last six runs Nov2024 Oct2024 )
elements additionals rerouterelements closinglanereroute create ( Last six runs Nov2024 Oct2024 )
elements additionals rerouterelements closinglanereroute delete ( Last six runs Nov2024 Oct2024 )
elements additionals rerouterelements closinglanereroute inspect ( Last six runs Nov2024 Oct2024 )
elements additionals rerouterelements closinglanereroute inspect_selection ( Last six runs Nov2024 Oct2024 )
elements additionals rerouterelements closinglanereroute volatilerecomputing ( Last six runs Nov2024 Oct2024 )
elements additionals rerouterelements closingreroute create ( Last six runs Nov2024 Oct2024 )
elements additionals rerouterelements closingreroute delete ( Last six runs Nov2024 Oct2024 )
elements additionals rerouterelements closingreroute inspect ( Last six runs Nov2024 Oct2024 )
elements additionals rerouterelements closingreroute inspect_selection ( Last six runs Nov2024 Oct2024 )
elements additionals rerouterelements closingreroute volatilerecomputing ( Last six runs Nov2024 Oct2024 )
elements additionals rerouterelements destprobreroute create ( Last six runs Nov2024 Oct2024 )
elements additionals rerouterelements destprobreroute delete ( Last six runs Nov2024 Oct2024 )
elements additionals rerouterelements destprobreroute inspect ( Last six runs Nov2024 Oct2024 )
elements additionals rerouterelements destprobreroute inspect_selection ( Last six runs Nov2024 Oct2024 )
elements additionals rerouterelements destprobreroute volatilerecomputing ( Last six runs Nov2024 Oct2024 )
elements additionals rerouterelements interval create ( Last six runs Nov2024 Oct2024 )
elements additionals rerouterelements interval delete ( Last six runs Nov2024 Oct2024 )
elements additionals rerouterelements interval inspect ( Last six runs Nov2024 Oct2024 )
elements additionals rerouterelements interval inspect_selection ( Last six runs Nov2024 Oct2024 )
elements additionals rerouterelements interval volatilerecomputing ( Last six runs Nov2024 Oct2024 )
elements additionals rerouterelements parkingareareroute create ( Last six runs Nov2024 Oct2024 )
elements additionals rerouterelements parkingareareroute delete ( Last six runs Nov2024 Oct2024 )
elements additionals rerouterelements parkingareareroute inspect ( Last six runs Nov2024 Oct2024 )
elements additionals rerouterelements parkingareareroute inspect_selection ( Last six runs Nov2024 Oct2024 )
elements additionals rerouterelements parkingareareroute volatilerecomputing ( Last six runs Nov2024 Oct2024 )
elements additionals rerouterelements routeprobreroute create ( Last six runs Nov2024 Oct2024 )
elements additionals rerouterelements routeprobreroute delete ( Last six runs Nov2024 Oct2024 )
elements additionals rerouterelements routeprobreroute inspect ( Last six runs Nov2024 Oct2024 )
elements additionals rerouterelements routeprobreroute inspect_selection ( Last six runs Nov2024 Oct2024 )
elements additionals rerouterelements routeprobreroute volatilerecomputing ( Last six runs Nov2024 Oct2024 )
elements additionals variablespeedsign contextual_menu ( Last six runs Nov2024 Oct2024 )
elements additionals variablespeedsign create ( Last six runs Nov2024 Oct2024 )
elements additionals variablespeedsign delete ( Last six runs Nov2024 Oct2024 )
elements additionals variablespeedsign inspect ( Last six runs Nov2024 Oct2024 )
elements additionals variablespeedsign inspect_selection ( Last six runs Nov2024 Oct2024 )
elements additionals variablespeedsign move ( Last six runs Nov2024 Oct2024 )
elements additionals variablespeedsign volatile_recomputing ( Last six runs Nov2024 Oct2024 )
elements demands container fix ( Last six runs Nov2024 Oct2024 )
elements demands containerflow fix ( Last six runs Nov2024 Oct2024 )
elements demands containerplan tranship edges ( Last six runs Nov2024 Oct2024 )
elements demands flow fix ( Last six runs Nov2024 Oct2024 )
elements demands flow_embedded fix ( Last six runs Nov2024 Oct2024 )
elements demands flow_junctions fix ( Last six runs Nov2024 Oct2024 )
elements demands person fix ( Last six runs Nov2024 Oct2024 )
elements demands personflow fix ( Last six runs Nov2024 Oct2024 )
elements demands personplan walk edges ( Last six runs Nov2024 Oct2024 )
elements demands personplan walk route ( Last six runs Nov2024 Oct2024 )
elements demands routeflow fix ( Last six runs Nov2024 Oct2024 )
elements demands trip fix ( Last six runs Nov2024 Oct2024 )
elements demands trip_junctions fix ( Last six runs Nov2024 Oct2024 )
elements demands vehicle fix ( Last six runs Nov2024 Oct2024 )
elements demands vehicle_embedded fix ( Last six runs Nov2024 Oct2024 )
elements shapes poilane create frame latlon ( Last six runs Nov2024 Oct2024 )
elements shapes poilane create frame lonlat ( Last six runs Nov2024 Oct2024 )
network edges contextual_menu lane_operations set_custom_lane_shape ( Last six runs Nov2024 Oct2024 )
network junctions contextual_menu set_custom_junction_shape ( Last six runs Nov2024 Oct2024 )
network lanes delete ( Last six runs Nov2024 Oct2024 )
network lanes move ( Last six runs Nov2024 Oct2024 )
network trafficlights joined attributes E1 ( Last six runs Nov2024 Oct2024 )
network trafficlights joined file load ( Last six runs Nov2024 Oct2024 )
network trafficlights joined file save ( Last six runs Nov2024 Oct2024 )
network trafficlights joined programs select ( Last six runs Nov2024 Oct2024 )
network trafficlights single attributes E1 ( Last six runs Nov2024 Oct2024 )
network trafficlights single file load ( Last six runs Nov2024 Oct2024 )
network trafficlights single file save ( Last six runs Nov2024 Oct2024 )
network trafficlights single programs select ( Last six runs Nov2024 Oct2024 )
selection operations clear_shortcut ( Last six runs Nov2024 Oct2024 )

Detailed information for the tests that were terminated before completion:

TEST were terminated before completion (TIMEOUT) on ts-sim-build-ba : elements demands personflow inspect flow_attributes poisson ( Last six runs Nov2024 Oct2024 )

Test exceeded wallclock time limit of 600.0 seconds
---------- Differences in errors ----------
5394,6030d5393
< Warning: Person 'pf_0.8028' is jammed on edge 'Edge0', time=3406.00.
< Warning: Person 'pf_0.8029' is jammed on edge 'Edge0', time=3406.00.
< Warning: Person 'pf_0.6447' is jammed on edge 'Edge0', time=3407.00.
< Warning: Person 'pf_0.8030' is jammed on edge 'Edge0', time=3407.00.
< Warning: Person 'pf_0.8031' is jammed on edge 'Edge0', time=3407.00.
< Warning: Person 'pf_0.8032' is jammed on edge 'Edge0', time=3407.00.
< Warning: Person 'pf_0.8033' is jammed on edge 'Edge0', time=3407.00.
< Warning: Person 'pf_0.8034' is jammed on edge 'Edge0', time=3408.00.
< Warning: Person 'pf_0.8035' is jammed on edge 'Edge0', time=3409.00.
< Warning: Person 'pf_0.8036' is jammed on edge 'Edge0', time=3409.00.
< Warning: Person 'pf_0.8037' is jammed on edge 'Edge0', time=3411.00.
< Warning: Person 'pf_0.8038' is jammed on edge 'Edge0', time=3411.00.
< Warning: Person 'pf_0.8040' is jammed on edge 'Edge0', time=3412.00.
< Warning: Person 'pf_0.6552' is jammed on edge 'Edge0', time=3414.00.
< Warning: Person 'pf_0.7063' is jammed on edge 'Edge0', time=3414.00.
< Warning: Person 'pf_0.6464' is jammed on edge 'Edge0', time=3416.00.
< Warning: Person 'pf_0.5831' is jammed on edge 'Edge0', time=3416.00.
< Warning: Person 'pf_0.8041' is jammed on edge 'Edge0', time=3416.00.
< Warning: Person 'pf_0.8042' is jammed on edge 'Edge0', time=3416.00.
< Warning: Person 'pf_0.5798' is jammed on edge 'Edge0', time=3417.00.
< Warning: Person 'pf_0.6673' is jammed on edge 'Edge0', time=3417.00.
< Warning: Person 'pf_0.6870' is jammed on edge 'Edge0', time=3417.00.
< Warning: Person 'pf_0.8043' is jammed on edge 'Edge0', time=3417.00.
< Warning: Person 'pf_0.8044' is jammed on edge 'Edge0', time=3417.00.
< Warning: Person 'pf_0.8045' is jammed on edge 'Edge0', time=3417.00.
< Warning: Person 'pf_0.6690' is jammed on edge 'Edge0', time=3418.00.
< Warning: Person 'pf_0.8046' is jammed on edge 'Edge0', time=3418.00.
< Warning: Person 'pf_0.8047' is jammed on edge 'Edge0', time=3418.00.
< Warning: Person 'pf_0.8048' is jammed on edge 'Edge0', time=3418.00.
<truncated after showing first 30 lines>
---------- Differences in output ----------
0a1
> Interrupt signal received, trying to exit gracefully.

TEST were terminated before completion (TIMEOUT) on ts-sim-build-ba : elements demands personflow inspect_selection color ( Last six runs Nov2024 Oct2024 )

Test exceeded wallclock time limit of 600.0 seconds
---------- Differences in errors ----------
7577,10267d7576
< Warning: Person 'pf_1.8374' is jammed on edge 'Edge1', time=2936.00.
< Warning: Person 'pf_1.8375' is jammed on edge 'Edge1', time=2936.00.
< Warning: Person 'pf_1.8376' is jammed on edge 'Edge1', time=2936.00.
< Warning: Person 'pf_0.795' is jammed on edge 'Edge0', time=2937.00.
< Warning: Person 'pf_0.793' is jammed on edge 'Edge0', time=2937.00.
< Warning: Person 'pf_1.8377' is jammed on edge 'Edge1', time=2937.00.
< Warning: Person 'pf_1.8378' is jammed on edge 'Edge1', time=2937.00.
< Warning: Person 'pf_1.8379' is jammed on edge 'Edge1', time=2937.00.
< Warning: Person 'pf_1.8380' is jammed on edge 'Edge1', time=2937.00.
< Warning: Person 'pf_1.8381' is jammed on edge 'Edge1', time=2938.00.
< Warning: Person 'pf_1.8382' is jammed on edge 'Edge1', time=2938.00.
< Warning: Person 'pf_1.8383' is jammed on edge 'Edge1', time=2938.00.
< Warning: Person 'pf_0.796' is jammed on edge 'Edge0', time=2939.00.
< Warning: Person 'pf_0.783' is jammed on edge 'Edge0', time=2939.00.
< Warning: Person 'pf_0.785' is jammed on edge 'Edge0', time=2939.00.
< Warning: Person 'pf_0.789' is jammed on edge 'Edge0', time=2939.00.
< Warning: Person 'pf_1.8384' is jammed on edge 'Edge1', time=2939.00.
< Warning: Person 'pf_1.8385' is jammed on edge 'Edge1', time=2939.00.
< Warning: Person 'pf_1.8386' is jammed on edge 'Edge1', time=2939.00.
< Warning: Person 'pf_1.8387' is jammed on edge 'Edge1', time=2940.00.
< Warning: Person 'pf_1.8388' is jammed on edge 'Edge1', time=2940.00.
< Warning: Person 'pf_1.8389' is jammed on edge 'Edge1', time=2940.00.
< Warning: Person 'pf_1.8390' is jammed on edge 'Edge1', time=2941.00.
< Warning: Person 'pf_1.8391' is jammed on edge 'Edge1', time=2941.00.
< Warning: Person 'pf_1.8392' is jammed on edge 'Edge1', time=2941.00.
< Warning: Person 'pf_1.8393' is jammed on edge 'Edge1', time=2942.00.
< Warning: Person 'pf_1.8394' is jammed on edge 'Edge1', time=2942.00.
< Warning: Person 'pf_1.8395' is jammed on edge 'Edge1', time=2942.00.
< Warning: Person 'pf_1.8396' is jammed on edge 'Edge1', time=2942.00.
<truncated after showing first 30 lines>
---------- Differences in output ----------
0a1
> Interrupt signal received, trying to exit gracefully.

TEST were terminated before completion (TIMEOUT) on ts-sim-build-ba : elements demands personflow inspect_selection flow_attributes begin float ( Last six runs Nov2024 Oct2024 )

Test exceeded wallclock time limit of 600.0 seconds
---------- Differences in errors ----------
7463,10189d7462
< Warning: Person 'pf_0.867' is jammed on edge 'Edge0', time=2914.00.
< Warning: Person 'pf_1.8310' is jammed on edge 'Edge1', time=2914.00.
< Warning: Person 'pf_1.8311' is jammed on edge 'Edge1', time=2914.00.
< Warning: Person 'pf_1.8312' is jammed on edge 'Edge1', time=2914.00.
< Warning: Person 'pf_1.8313' is jammed on edge 'Edge1', time=2915.00.
< Warning: Person 'pf_1.8314' is jammed on edge 'Edge1', time=2915.00.
< Warning: Person 'pf_1.8315' is jammed on edge 'Edge1', time=2915.00.
< Warning: Person 'pf_1.8316' is jammed on edge 'Edge1', time=2916.00.
< Warning: Person 'pf_1.8317' is jammed on edge 'Edge1', time=2916.00.
< Warning: Person 'pf_1.8318' is jammed on edge 'Edge1', time=2916.00.
< Warning: Person 'pf_0.868' is jammed on edge 'Edge0', time=2917.00.
< Warning: Person 'pf_1.8319' is jammed on edge 'Edge1', time=2917.00.
< Warning: Person 'pf_1.8320' is jammed on edge 'Edge1', time=2917.00.
< Warning: Person 'pf_1.8321' is jammed on edge 'Edge1', time=2917.00.
< Warning: Person 'pf_1.8322' is jammed on edge 'Edge1', time=2917.00.
< Warning: Person 'pf_1.8323' is jammed on edge 'Edge1', time=2918.00.
< Warning: Person 'pf_1.8324' is jammed on edge 'Edge1', time=2918.00.
< Warning: Person 'pf_1.8325' is jammed on edge 'Edge1', time=2918.00.
< Warning: Person 'pf_1.8326' is jammed on edge 'Edge1', time=2919.00.
< Warning: Person 'pf_1.8327' is jammed on edge 'Edge1', time=2919.00.
< Warning: Person 'pf_1.8328' is jammed on edge 'Edge1', time=2919.00.
< Warning: Person 'pf_0.869' is jammed on edge 'Edge0', time=2920.00.
< Warning: Person 'pf_1.8329' is jammed on edge 'Edge1', time=2920.00.
< Warning: Person 'pf_1.8330' is jammed on edge 'Edge1', time=2920.00.
< Warning: Person 'pf_1.8331' is jammed on edge 'Edge1', time=2920.00.
< Warning: Person 'pf_1.8332' is jammed on edge 'Edge1', time=2921.00.
< Warning: Person 'pf_1.8333' is jammed on edge 'Edge1', time=2921.00.
< Warning: Person 'pf_1.8334' is jammed on edge 'Edge1', time=2921.00.
< Warning: Person 'pf_1.8335' is jammed on edge 'Edge1', time=2922.00.
<truncated after showing first 30 lines>
---------- Differences in output ----------
0a1
> Interrupt signal received, trying to exit gracefully.

TEST were terminated before completion (TIMEOUT) on ts-sim-build-ba : elements demands personflow inspect_selection flow_attributes poisson ( Last six runs Nov2024 Oct2024 )

Test exceeded wallclock time limit of 600.0 seconds
---------- Differences in errors ----------
7081,15410d7080
< Warning: Person 'pf_0.3506' is jammed on edge 'Edge0', time=2326.00.
< Warning: Person 'pf_0.2831' is jammed on edge 'Edge0', time=2326.00.
< Warning: Person 'pf_0.2096' is jammed on edge 'Edge0', time=2326.00.
< Warning: Person 'pf_0.2154' is jammed on edge 'Edge0', time=2326.00.
< Warning: Person 'pf_0.2915' is jammed on edge 'Edge0', time=2326.00.
< Warning: Person 'pf_0.4390' is jammed on edge 'Edge0', time=2326.00.
< Warning: Person 'pf_0.5178' is jammed on edge 'Edge0', time=2326.00.
< Warning: Person 'pf_0.5179' is jammed on edge 'Edge0', time=2326.00.
< Warning: Person 'pf_1.5126' is jammed on edge 'Edge1', time=2326.00.
< Warning: Person 'pf_1.5127' is jammed on edge 'Edge1', time=2326.00.
< Warning: Person 'pf_1.5128' is jammed on edge 'Edge1', time=2326.00.
< Warning: Person 'pf_1.5129' is jammed on edge 'Edge1', time=2326.00.
< Warning: Person 'pf_0.3576' is jammed on edge 'Edge0', time=2327.00.
< Warning: Person 'pf_0.3591' is jammed on edge 'Edge0', time=2327.00.
< Warning: Person 'pf_0.3483' is jammed on edge 'Edge0', time=2327.00.
< Warning: Person 'pf_0.1916' is jammed on edge 'Edge0', time=2327.00.
< Warning: Person 'pf_0.3635' is jammed on edge 'Edge0', time=2327.00.
< Warning: Person 'pf_0.3796' is jammed on edge 'Edge0', time=2327.00.
< Warning: Person 'pf_0.2752' is jammed on edge 'Edge0', time=2327.00.
< Warning: Person 'pf_0.5180' is jammed on edge 'Edge0', time=2327.00.
< Warning: Person 'pf_0.5181' is jammed on edge 'Edge0', time=2327.00.
< Warning: Person 'pf_0.5182' is jammed on edge 'Edge0', time=2327.00.
< Warning: Person 'pf_1.5130' is jammed on edge 'Edge1', time=2327.00.
< Warning: Person 'pf_1.5131' is jammed on edge 'Edge1', time=2327.00.
< Warning: Person 'pf_0.1915' is jammed on edge 'Edge0', time=2328.00.
< Warning: Person 'pf_0.3579' is jammed on edge 'Edge0', time=2328.00.
< Warning: Person 'pf_0.2042' is jammed on edge 'Edge0', time=2328.00.
< Warning: Person 'pf_0.4303' is jammed on edge 'Edge0', time=2328.00.
< Warning: Person 'pf_0.4344' is jammed on edge 'Edge0', time=2328.00.
<truncated after showing first 30 lines>
---------- Differences in output ----------
0a1
> Interrupt signal received, trying to exit gracefully.

TEST were terminated before completion (TIMEOUT) on ts-sim-build-ba : elements demands personflow inspect_selection parameters ( Last six runs Nov2024 Oct2024 )

Test exceeded wallclock time limit of 600.0 seconds
---------- Differences in errors ----------
7649,10267d7648
< Warning: Person 'pf_0.881' is jammed on edge 'Edge0', time=2955.00.
< Warning: Person 'pf_1.8435' is jammed on edge 'Edge1', time=2955.00.
< Warning: Person 'pf_1.8436' is jammed on edge 'Edge1', time=2955.00.
< Warning: Person 'pf_1.8437' is jammed on edge 'Edge1', time=2955.00.
< Warning: Person 'pf_1.8438' is jammed on edge 'Edge1', time=2956.00.
< Warning: Person 'pf_1.8439' is jammed on edge 'Edge1', time=2956.00.
< Warning: Person 'pf_1.8440' is jammed on edge 'Edge1', time=2956.00.
< Warning: Person 'pf_1.8441' is jammed on edge 'Edge1', time=2957.00.
< Warning: Person 'pf_1.8442' is jammed on edge 'Edge1', time=2957.00.
< Warning: Person 'pf_1.8443' is jammed on edge 'Edge1', time=2957.00.
< Warning: Person 'pf_1.8444' is jammed on edge 'Edge1', time=2957.00.
< Warning: Person 'pf_0.882' is jammed on edge 'Edge0', time=2958.00.
< Warning: Person 'pf_1.8445' is jammed on edge 'Edge1', time=2958.00.
< Warning: Person 'pf_1.8446' is jammed on edge 'Edge1', time=2958.00.
< Warning: Person 'pf_1.8447' is jammed on edge 'Edge1', time=2958.00.
< Warning: Person 'pf_1.8448' is jammed on edge 'Edge1', time=2959.00.
< Warning: Person 'pf_1.8449' is jammed on edge 'Edge1', time=2959.00.
< Warning: Person 'pf_1.8450' is jammed on edge 'Edge1', time=2959.00.
< Warning: Person 'pf_1.8451' is jammed on edge 'Edge1', time=2960.00.
< Warning: Person 'pf_1.8452' is jammed on edge 'Edge1', time=2960.00.
< Warning: Person 'pf_1.8453' is jammed on edge 'Edge1', time=2960.00.
< Warning: Person 'pf_0.883' is jammed on edge 'Edge0', time=2961.00.
< Warning: Person 'pf_1.8454' is jammed on edge 'Edge1', time=2961.00.
< Warning: Person 'pf_1.8455' is jammed on edge 'Edge1', time=2961.00.
< Warning: Person 'pf_1.8456' is jammed on edge 'Edge1', time=2961.00.
< Warning: Person 'pf_1.8457' is jammed on edge 'Edge1', time=2962.00.
< Warning: Person 'pf_1.8458' is jammed on edge 'Edge1', time=2962.00.
< Warning: Person 'pf_1.8459' is jammed on edge 'Edge1', time=2962.00.
< Warning: Person 'pf_1.8460' is jammed on edge 'Edge1', time=2962.00.
<truncated after showing first 30 lines>
---------- Differences in output ----------
0a1
> Interrupt signal received, trying to exit gracefully.