15Jun24rv1_20_0+0587-be24f5f3ca2 - detailed test results for TOOLS

To reconnect the TextTest GUI to these results, run:

texttest -a tools -d /home/delphi/gcc/sumo/tests -reconnect /home/delphi/gcc/texttesttmp/gcc4_64.30Jun004652.1614873 -g

To start TextTest for these tests, run:

texttest -a tools -d /home/delphi/gcc/sumo/tests


default: 1181 tests: 1168 succeeded 10 FAILED 3 known bugs

Detailed information for the tests that FAILED:

TEST FAILED on ts-sim-build-ba : build_config checkStyle complex ( Last six runs Jun2024 )

---------- Differences in output ----------
0a1,4
> traci/chargingstation/basic/runner.py:42:121: E501 line too long (126 > 120 characters)
> traci/vehicle/taxi/undeparted/runner.py:56:1: E303 too many blank lines (3)
> traci/chargingstation/basic/runner.py broken @date reference ['#', 'author', 'Mirko', 'Barthauer']
> traci/chargingstation/basic/runner.py missing empty line 17 # @date    2020-03-16

TEST FAILED on ts-sim-build-ba : build_config checkStyle header ( Last six runs Jun2024 )

---------- Differences in output ----------
14a15,16
> tests/complex/traci/chargingstation/basic/runner.py broken @date reference ['#', 'author', 'Mirko', 'Barthauer']
> tests/complex/traci/chargingstation/basic/runner.py missing empty line 17 # @date    2020-03-16

TEST FAILED on ts-sim-build-ba : build_config checkStyle netedit ( Last six runs Jun2024 )

---------- Differences in output ----------
0a1,657
> elements/additional/busstop/create/friendlypos/test.py:41:121: E501 line too long (142 > 120 characters)
> elements/additional/busstop/create/color/test.py:41:121: E501 line too long (142 > 120 characters)
> elements/additional/busstop/create/color/test.py:47:121: E501 line too long (142 > 120 characters)
> elements/additional/busstop/create/color/test.py:53:121: E501 line too long (142 > 120 characters)
> elements/additional/busstop/create/references/test.py:38:121: E501 line too long (142 > 120 characters)
> elements/additional/busstop/create/references/test.py:44:121: E501 line too long (142 > 120 characters)
> elements/additional/busstop/create/references/test.py:50:121: E501 line too long (142 > 120 characters)
> elements/additional/busstop/create/default/test.py:38:121: E501 line too long (142 > 120 characters)
> elements/additional/busstop/create/id/test.py:38:121: E501 line too long (142 > 120 characters)
> elements/additional/busstop/create/id/test.py:44:121: E501 line too long (142 > 120 characters)
> elements/additional/busstop/create/id/test.py:50:121: E501 line too long (142 > 120 characters)
> elements/additional/busstop/create/id/test.py:56:121: E501 line too long (142 > 120 characters)
> elements/additional/busstop/inspect/color/test.py:41:121: E501 line too long (142 > 120 characters)
> elements/additional/busstop/inspect/color/test.py:47:121: E501 line too long (146 > 120 characters)
> elements/additional/busstop/delete/test.py:38:121: E501 line too long (142 > 120 characters)
> elements/additional/busstop/create/lines/test.py:41:121: E501 line too long (142 > 120 characters)
> elements/additional/busstop/create/parkinglength/test.py:41:121: E501 line too long (142 > 120 characters)
> elements/additional/busstop/create/parkinglength/test.py:47:121: E501 line too long (142 > 120 characters)
> elements/additional/busstop/create/parkinglength/test.py:53:121: E501 line too long (142 > 120 characters)
> elements/additional/busstop/create/personcapacity/test.py:41:121: E501 line too long (142 > 120 characters)
> elements/additional/busstop/create/personcapacity/test.py:47:121: E501 line too long (142 > 120 characters)
> elements/additional/busstop/create/personcapacity/test.py:53:121: E501 line too long (142 > 120 characters)
> elements/additional/busstop/create/references_length/test.py:41:121: E501 line too long (142 > 120 characters)
> elements/additional/busstop/create/references_length/test.py:47:121: E501 line too long (142 > 120 characters)
> elements/additional/busstop/create/references_length/test.py:53:121: E501 line too long (142 > 120 characters)
> elements/additional/busstop/create/references_length/test.py:59:121: E501 line too long (142 > 120 characters)
> elements/additional/busstop/create/references_length/test.py:65:121: E501 line too long (142 > 120 characters)
> elements/additional/busstop/create/name/test.py:41:121: E501 line too long (142 > 120 characters)
> elements/additional/busstop/inspect/lines/test.py:41:121: E501 line too long (142 > 120 characters)
<truncated after showing first 30 lines>

TEST FAILED on ts-sim-build-ba : build_config checkStyle netedit_additionals ( Last six runs Jun2024 )

---------- Differences in errors ----------
0a1,16
> svn: E155007: '/home/delphi/gcc/sumo/tests/netedit/additionalelements' is not a working copy
> Traceback (most recent call last):
> checkStyle.py, in <module>
>     os.chdir(repoRoot)
> FileNotFoundError: [Errno 2] No such file or directory: '/home/delphi/gcc/sumo/tests/netedit/additionalelements'
> 
> During handling of the above exception, another exception occurred:
> 
> Traceback (most recent call last):
> checkStyle.py, in <module>
>     output = subprocess.check_output(["svn", "pl", "-v", "-R", "--xml", repoRoot])
> subprocess.py, in check_output
>     return run(*popenargs, stdout=PIPE, timeout=timeout, check=True,
> subprocess.py, in run
>     raise CalledProcessError(retcode, process.args,
> subprocess.CalledProcessError: Command '['svn', 'pl', '-v', '-R', '--xml', '/home/delphi/gcc/sumo/tests/netedit/additionalelements']' returned non-zero exit status 1.
---------- Differences in output ----------
0a1
> This seems to be no valid git repository /home/delphi/gcc/sumo/tests/netedit/additionalelements [Errno 2] No such file or directory: '/home/delphi/gcc/sumo/tests/netedit/additionalelements'

TEST FAILED on ts-sim-build-ba : build_config checkStyle netedit_demand ( Last six runs Jun2024 )

---------- Differences in errors ----------
0a1,16
> svn: E155007: '/home/delphi/gcc/sumo/tests/netedit/demandelements' is not a working copy
> Traceback (most recent call last):
> checkStyle.py, in <module>
>     os.chdir(repoRoot)
> FileNotFoundError: [Errno 2] No such file or directory: '/home/delphi/gcc/sumo/tests/netedit/demandelements'
> 
> During handling of the above exception, another exception occurred:
> 
> Traceback (most recent call last):
> checkStyle.py, in <module>
>     output = subprocess.check_output(["svn", "pl", "-v", "-R", "--xml", repoRoot])
> subprocess.py, in check_output
>     return run(*popenargs, stdout=PIPE, timeout=timeout, check=True,
> subprocess.py, in run
>     raise CalledProcessError(retcode, process.args,
> subprocess.CalledProcessError: Command '['svn', 'pl', '-v', '-R', '--xml', '/home/delphi/gcc/sumo/tests/netedit/demandelements']' returned non-zero exit status 1.
---------- Differences in output ----------
0a1
> This seems to be no valid git repository /home/delphi/gcc/sumo/tests/netedit/demandelements [Errno 2] No such file or directory: '/home/delphi/gcc/sumo/tests/netedit/demandelements'

TEST FAILED on ts-sim-build-ba : build_config checkStyle tools ( Last six runs Jun2024 )

---------- Differences in output ----------
0a1
> createVehTypeDistribution.py:163:37: E703 statement ends with a semicolon

TEST FAILED on ts-sim-build-ba : build_config checkStyle tooltests ( Last six runs Jun2024 )

---------- Differences in output ----------
0a1,2
> complex/traci/chargingstation/basic/runner.py broken @date reference ['#', 'author', 'Mirko', 'Barthauer']
> complex/traci/chargingstation/basic/runner.py missing empty line 17 # @date    2020-03-16

TEST FAILED on ts-sim-build-ba : xml schemaCheck tests cfgs ( Last six runs Jun2024 )

---------- Differences in errors ----------
8,9c8,127
< complex/traci/bugs/ticket3505_with_load_offset/sumo.sumocfg:6:0:ERROR:SCHEMASV:SCHEMAV_CVC_DATATYPE_VALID_1_2_3: Element 'load-state.offset', attribute 'value': '-100.0' is not a valid value of the union type 'timeTypeWithErrorValue'.
< sumo/meta/deprecated_option/sumo.sumocfg:11:0:ERROR:SCHEMASV:SCHEMAV_ELEMENT_CONTENT: Element 'abs-rand': This element is not expected.
---
> /home/delphi/gcc/sumo/tests/complex/tutorial/manhattan/data/manhattan.jtrrcfg:6:0:ERROR:SCHEMASV:SCHEMAV_CVC_ELT_1: Element 'configuration': No matching global declaration available for the validation root.
> complex/state/net.netgcfg:6:0:ERROR:SCHEMASV:SCHEMAV_CVC_ELT_1: Element 'configuration': No matching global declaration available for the validation root.
> complex/sumo/output/net.netgcfg:6:0:ERROR:SCHEMASV:SCHEMAV_CVC_ELT_1: Element 'configuration': No matching global declaration available for the validation root.
> complex/traci/bugs/ticket3505_with_load_offset/sumo.sumocfg:11:0:ERROR:SCHEMASV:SCHEMAV_CVC_DATATYPE_VALID_1_2_3: Element 'load-state.offset', attribute 'value': '-100.0' is not a valid value of the union type 'timeTypeWithErrorValue'.
> complex/traci/connection/multipleConnections/unspecifiedOrderWarning/sumo.sumocfg:16:0:ERROR:SCHEMASV:SCHEMAV_CVC_DATATYPE_VALID_1_2_3: Element 'end', attribute 'value': '%(end)s' is not a valid value of the union type 'timeTypeWithErrorValue'.
> complex/traci/connection/multipleConnections/unspecifiedOrderWarning/sumo.sumocfg:17:0:ERROR:SCHEMASV:SCHEMAV_CVC_DATATYPE_VALID_1_2_3: Element 'step-length', attribute 'value': '%(steplength)s' is not a valid value of the union type 'timeTypeWithErrorValue'.
> complex/traci/connection/parallelConnection/sumo.sumocfg:16:0:ERROR:SCHEMASV:SCHEMAV_CVC_DATATYPE_VALID_1_2_3: Element 'end', attribute 'value': '%(end)s' is not a valid value of the union type 'timeTypeWithErrorValue'.
> complex/traci/connection/repeatedConnection/sumo.sumocfg:16:0:ERROR:SCHEMASV:SCHEMAV_CVC_DATATYPE_VALID_1_2_3: Element 'end', attribute 'value': '%(end)s' is not a valid value of the union type 'timeTypeWithErrorValue'.
> complex/tutorial/manhattan/data/manhattan.jtrrcfg:6:0:ERROR:SCHEMASV:SCHEMAV_CVC_ELT_1: Element 'configuration': No matching global declaration available for the validation root.
> complex/tutorial/manhattan/data/manhattan.netgcfg:6:0:ERROR:SCHEMASV:SCHEMAV_CVC_ELT_1: Element 'configuration': No matching global declaration available for the validation root.
> duarouter/function/remove_loops/net.netgcfg:6:0:ERROR:SCHEMASV:SCHEMAV_CVC_ELT_1: Element 'configuration': No matching global declaration available for the validation root.
> marouter/load/trips/additive/net.netgcfg:6:0:ERROR:SCHEMASV:SCHEMAV_CVC_ELT_1: Element 'configuration': No matching global declaration available for the validation root.
> marouter/timelines/additive/net.netgcfg:6:0:ERROR:SCHEMASV:SCHEMAV_CVC_ELT_1: Element 'configuration': No matching global declaration available for the validation root.
> marouter/timelines/timeline_v/net.netgcfg:6:0:ERROR:SCHEMASV:SCHEMAV_CVC_ELT_1: Element 'configuration': No matching global declaration available for the validation root.
> netedit/basic/configs/sumo.sumocfg:6:0:ERROR:SCHEMASV:SCHEMAV_CVC_ELT_1: Element 'configuration': No matching global declaration available for the validation root.
> netedit/basic/configs/sumoconfigs/open/sumo_loadedmanually.sumocfg:16:0:ERROR:SCHEMASV:SCHEMAV_CVC_ELT_1: Element 'configuration': No matching global declaration available for the validation root.
> netedit/basic/pyautogui_error/sumo.sumocfg:6:0:ERROR:SCHEMASV:SCHEMAV_CVC_ELT_1: Element 'configuration': No matching global declaration available for the validation root.
> netedit/elements/demand/flow/inspect_selection/poisson/sumo.sumocfg:6:0:ERROR:SCHEMASV:SCHEMAV_CVC_ELT_1: Element 'configuration': No matching global declaration available for the validation root.
> netedit/elements/net.netccfg:6:0:ERROR:SCHEMASV:SCHEMAV_CVC_ELT_1: Element 'configuration': No matching global declaration available for the validation root.
> netedit/network/junctions/contextual_menu/netedit.netecfg:6:0:ERROR:SCHEMASV:SCHEMAV_CVC_ELT_1: Element 'configuration': No matching global declaration available for the validation root.
> netedit/shapes/net.netccfg:6:0:ERROR:SCHEMASV:SCHEMAV_CVC_ELT_1: Element 'configuration': No matching global declaration available for the validation root.
> sumo/action_step_length/Sublane/bugs/ticket3601/sumo.sumocfg:3:0:ERROR:SCHEMASV:SCHEMAV_CVC_ELT_1: Element 'configuration': No matching global declaration available for the validation root.
> sumo/basic/containerFlow/transport/_basic_containerFlow_transport/test.sumocfg:11:0:ERROR:SCHEMASV:SCHEMAV_CVC_ELT_1: Element 'configuration': No matching global declaration available for the validation root.
> sumo/basic/containerFlow/transport/_basic_containerFlow_transport/testmeso.sumocfg:11:0:ERROR:SCHEMASV:SCHEMAV_CVC_ELT_1: Element 'configuration': No matching global declaration available for the validation root.
> sumo/basic/containerFlow/trip_chain/_basic_containerFlow_trip_chain/test.sumocfg:11:0:ERROR:SCHEMASV:SCHEMAV_CVC_ELT_1: Element 'configuration': No matching global declaration available for the validation root.
> sumo/basic/containerFlow/trip_chain/_basic_containerFlow_trip_chain/testidm.sumocfg:11:0:ERROR:SCHEMASV:SCHEMAV_CVC_ELT_1: Element 'configuration': No matching global declaration available for the validation root.
<truncated after showing first 30 lines>

TEST FAILED on ts-sim-build-ba : xml schemaCheck tests sim_outputs ( Last six runs Jun2024 )

---------- Differences in errors ----------
463,465c463
< sumo/pedestrian_model/jupedsim/larger_net/tripinfos.sumo:47:0:ERROR:SCHEMASV:SCHEMAV_CVC_DATATYPE_VALID_1_2_3: Element 'personinfo', attribute 'timeLoss': '-0.56' is not a valid value of the union type 'timeTypeWithErrorValue'.
< sumo/pedestrian_model/jupedsim/larger_net/tripinfos.sumo:56:0:ERROR:SCHEMASV:SCHEMAV_CVC_DATATYPE_VALID_1_2_3: Element 'personinfo', attribute 'timeLoss': '-1.86' is not a valid value of the union type 'timeTypeWithErrorValue'.
< sumo/pedestrian_model/jupedsim/larger_net/tripinfos.sumo:59:0:ERROR:SCHEMASV:SCHEMAV_CVC_DATATYPE_VALID_1_2_3: Element 'personinfo', attribute 'timeLoss': '-1.94' is not a valid value of the union type 'timeTypeWithErrorValue'.
---
> sumo/pedestrian_model/jupedsim/larger_net/tripinfos.sumo:50:0:ERROR:SCHEMASV:SCHEMAV_CVC_DATATYPE_VALID_1_2_3: Element 'personinfo', attribute 'timeLoss': '-1.86' is not a valid value of the union type 'timeTypeWithErrorValue'.
500,502c498,499
< sumo/pedestrian_model/jupedsim/walking_area/tripinfos.sumo:70:0:ERROR:SCHEMASV:SCHEMAV_CVC_DATATYPE_VALID_1_2_3: Element 'personinfo', attribute 'timeLoss': '-2.32' is not a valid value of the union type 'timeTypeWithErrorValue'.
< sumo/pedestrian_model/jupedsim/walking_area/tripinfos.sumo:73:0:ERROR:SCHEMASV:SCHEMAV_CVC_DATATYPE_VALID_1_2_3: Element 'personinfo', attribute 'timeLoss': '-2.32' is not a valid value of the union type 'timeTypeWithErrorValue'.
< sumo/pedestrian_model/jupedsim/walking_area/tripinfos.sumo:76:0:ERROR:SCHEMASV:SCHEMAV_CVC_DATATYPE_VALID_1_2_3: Element 'personinfo', attribute 'timeLoss': '-0.39' is not a valid value of the union type 'timeTypeWithErrorValue'.
---
> sumo/pedestrian_model/jupedsim/walking_area/tripinfos.sumo:70:0:ERROR:SCHEMASV:SCHEMAV_CVC_DATATYPE_VALID_1_2_3: Element 'personinfo', attribute 'timeLoss': '-1.32' is not a valid value of the union type 'timeTypeWithErrorValue'.
> sumo/pedestrian_model/jupedsim/walking_area/tripinfos.sumo:73:0:ERROR:SCHEMASV:SCHEMAV_CVC_DATATYPE_VALID_1_2_3: Element 'personinfo', attribute 'timeLoss': '-1.32' is not a valid value of the union type 'timeTypeWithErrorValue'.

TEST FAILED on ts-sim-build-ba : xml schemaCheck tools ( Last six runs Jun2024 )

---------- Differences in errors ----------
0a1,9
> -- Unordered text as found by filter 'ERROR:SCHEMA' --
> /home/delphi/gcc/sumo/tools/contributed/saga/defaults/osm.sumocfg:13:0:ERROR:SCHEMASV:SCHEMAV_CVC_ELT_1: Element 'configuration': No matching global declaration available for the validation root.
> contributed/saga/defaults/duarouter.sumocfg:13:0:ERROR:SCHEMASV:SCHEMAV_CVC_ELT_1: Element 'configuration': No matching global declaration available for the validation root.
> contributed/saga/defaults/osm.netccfg:3:0:ERROR:SCHEMASV:SCHEMAV_CVC_ELT_1: Element 'configuration': No matching global declaration available for the validation root.
> contributed/saga/defaults/osm.sumocfg:13:0:ERROR:SCHEMASV:SCHEMAV_CVC_ELT_1: Element 'configuration': No matching global declaration available for the validation root.
> contributed/saga/example/most.duarouter.sumocfg:13:0:ERROR:SCHEMASV:SCHEMAV_CVC_ELT_1: Element 'configuration': No matching global declaration available for the validation root.
> contributed/saga/example/most.test.sumocfg:13:0:ERROR:SCHEMASV:SCHEMAV_CVC_ELT_1: Element 'configuration': No matching global declaration available for the validation root.
> contributed/traci4matlab/examples/inter_palmas/tls_actuated/inter_palmas_actuated.sumocfg:3:0:ERROR:SCHEMASV:SCHEMAV_CVC_ELT_1: Element 'configuration': No matching global declaration available for the validation root.
> 

Detailed information for the tests that had known bugs:

TEST had known bugs (see #7391) on ts-sim-build-ba : assign dua-iterate mapmatchJunctions ( Last six runs Jun2024 )

duaIterate only works with fixed departEdge
(This bug was triggered by text found in file 'dualog' matching 'input_trips_000.rou.alt.xml' is not accessible')
---------- Differences in dualog ----------
1d0
< Loading configuration ... done.
3,55d1
< Loading configuration ... done.
< Loading done.
< Simulation started with time: 0.00.
< Simulation ended at time: 177.00
< Reason: All vehicles have left the simulation.
< Performance: 
< Vehicles: 
<  Inserted: 10
<  Running: 0
<  Waiting: 0
< 
< Loading configuration ... done.
< Success.
< Loading configuration ... done.
< Loading done.
< Simulation started with time: 0.00.
< Simulation ended at time: 177.00
< Reason: All vehicles have left the simulation.
< Performance: 
< Vehicles: 
<  Inserted: 10
<  Running: 0
<  Waiting: 0
< 
< Loading configuration ... done.
< Success.
< Loading configuration ... done.
<truncated after showing first 30 lines>
---------- Differences in errors ----------
0a1
> Execution of <path-to>duarouter'] failed. Look into dua.log for details.
---------- Differences in output ----------
1d0
< Loading configuration ... done.
9d7
< Loading configuration ... done.
11,40c9
< >> Running router on input_trips_000.rou.alt.xml
< <<
< >> Running simulation
< <<
< ------------------
< 
< Loading configuration ... done.
< > Executing step 2
< >> Running router on input_trips_001.rou.alt.xml
< <<
< >> Running simulation
< <<
< ------------------
< 
< Loading configuration ... done.
< > Executing step 3
< >> Running router on input_trips_002.rou.alt.xml
< <<
< >> Running simulation
< <<
< ------------------
< 
< Loading configuration ... done.
< > Executing step 4
< >> Running router on input_trips_003.rou.alt.xml
<truncated after showing first 30 lines>
---------- Missing result in tripinfos ----------
<?xml version="1.0" encoding="UTF-8"?>


<tripinfos xmlns:xsi="http://www.w3.org/2001/XMLSchema-instance" xsi:noNamespaceSchemaLocation="http://sumo.dlr.de/xsd/tripinfo_file.xsd">
    <tripinfo id="0" depart="0.00" departLane="middle_0" departPos="5.10" departSpeed="0.00" departDelay="0.00" arrival="70.00" arrivalLane="middle_0" arrivalPos="1000.00" arrivalSpeed="14.73" duration="70.00" routeLength="994.90" waitingTime="0.00" waitingCount="0" stopTime="0.00" timeLoss="2.35" rerouteNo="0" devices="tripinfo_0" vType="t" speedFactor="1.06" vaporized=""/>
    <tripinfo id="1" depart="10.00" departLane="middle_0" departPos="5.10" departSpeed="0.00" departDelay="0.00" arrival="89.00" arrivalLane="middle_0" arrivalPos="1000.00" arrivalSpeed="13.04" duration="79.00" routeLength="994.90" waitingTime="0.00" waitingCount="0" stopTime="0.00" timeLoss="2.01" rerouteNo="0" devices="tripinfo_1" vType="t" speedFactor="0.94" vaporized=""/>
    <tripinfo id="2" depart="20.00" departLane="middle_0" departPos="5.10" departSpeed="0.00" departDelay="0.00" arrival="94.00" arrivalLane="middle_0" arrivalPos="1000.00" arrivalSpeed="14.04" duration="74.00" routeLength="994.90" waitingTime="0.00" waitingCount="0" stopTime="0.00" timeLoss="2.22" rerouteNo="0" devices="tripinfo_2" vType="t" speedFactor="1.01" vaporized=""/>
    <tripinfo id="3" depart="30.00" departLane="middle_0" departPos="5.10" departSpeed="0.00" departDelay="0.00" arrival="99.00" arrivalLane="middle_0" arrivalPos="1000.00" arrivalSpeed="15.05" duration="69.00" routeLength="994.90" waitingTime="0.00" waitingCount="0" stopTime="0.00" timeLoss="2.41" rerouteNo="0" devices="tripinfo_3" vType="t" speedFactor="1.08" vaporized=""/>
    <tripinfo id="4" depart="40.00" departLane="middle_0" departPos="5.10" departSpeed="0.00" departDelay="0.00" arrival="112.00" arrivalLane="middle_0" arrivalPos="1000.00" arrivalSpeed="14.32" duration="72.00" routeLength="994.90" waitingTime="0.00" waitingCount="0" stopTime="0.00" timeLoss="2.28" rerouteNo="0" devices="tripinfo_4" vType="t" speedFactor="1.03" vaporized=""/>
    <tripinfo id="5" depart="50.00" departLane="middle_0" departPos="5.10" departSpeed="0.00" departDelay="0.00" arrival="138.00" arrivalLane="middle_0" arrivalPos="1000.00" arrivalSpeed="11.55" duration="88.00" routeLength="994.90" waitingTime="0.00" waitingCount="0" stopTime="0.00" timeLoss="1.75" rerouteNo="0" devices="tripinfo_5" vType="t" speedFactor="0.83" vaporized=""/>
    <tripinfo id="6" depart="60.00" departLane="middle_0" departPos="5.10" departSpeed="0.00" departDelay="0.00" arrival="140.00" arrivalLane="middle_0" arrivalPos="1000.00" arrivalSpeed="14.54" duration="80.00" routeLength="994.90" waitingTime="0.00" waitingCount="0" stopTime="0.00" timeLoss="10.80" rerouteNo="0" devices="tripinfo_6" vType="t" speedFactor="1.05" vaporized=""/>
    <tripinfo id="7" depart="70.00" departLane="middle_0" departPos="5.10" departSpeed="0.00" departDelay="0.00" arrival="153.00" arrivalLane="middle_0" arrivalPos="1000.00" arrivalSpeed="12.32" duration="83.00" routeLength="994.90" waitingTime="0.00" waitingCount="0" stopTime="0.00" timeLoss="1.89" rerouteNo="0" devices="tripinfo_7" vType="t" speedFactor="0.89" vaporized=""/>
    <tripinfo id="8" depart="80.00" departLane="middle_0" departPos="5.10" departSpeed="0.00" departDelay="0.00" arrival="159.00" arrivalLane="middle_0" arrivalPos="1000.00" arrivalSpeed="13.04" duration="79.00" routeLength="994.90" waitingTime="0.00" waitingCount="0" stopTime="0.00" timeLoss="2.01" rerouteNo="0" devices="tripinfo_8" vType="t" speedFactor="0.94" vaporized=""/>
    <tripinfo id="9" depart="90.00" departLane="middle_0" departPos="5.10" departSpeed="0.00" departDelay="0.00" arrival="176.00" arrivalLane="middle_0" arrivalPos="1000.00" arrivalSpeed="11.91" duration="86.00" routeLength="994.90" waitingTime="0.00" waitingCount="0" stopTime="0.00" timeLoss="1.82" rerouteNo="0" devices="tripinfo_9" vType="t" speedFactor="0.86" vaporized=""/>
</tripinfos>

TEST had known bugs (see #5409) on ts-sim-build-ba : detector flowrouter motorway_ramps lane_based ( Last six runs Jun2024 )

option lane-based does not work
(This bug was triggered by text found in file 'routes' matching 'on3 3 off3')
---------- Differences in flows ----------
2c2,3
<     <flow id="1_off3.qPKW" departSpeed="max" departPos="last" departLane="best" route="1_off3.qPKW" number="450" begin="0" end="3600"/>
---
>     <flow id="1_0_9_0.qPKW" departSpeed="max" departPos="last" departLane="best" route="1_0_9_0.qPKW" number="450" begin="0" end="3600"/>
>     <flow id="on3_0_off3_0.qPKW" departSpeed="max" departPos="last" departLane="best" route="on3_0_off3_0.qPKW" number="450" begin="0" end="3600"/>
---------- Differences in routes ----------
2c2,3
<     <route id="1_off3.qPKW" edges="1 2 3 off3"/>
---
>     <route id="1_0_9_0.qPKW" edges="1 2 3 4 5 6 7 8 9"/>
>     <route id="on3_0_off3_0.qPKW" edges="on3 3 off3"/>

TEST had known bugs (see #14033) on ts-sim-build-ba : drt drtOrtools time_window3 ( Last six runs Jun2024 )

no routes to internal edges
(This bug was triggered by text found in file 'errors' matching 'Warning: No connection')
---------- Differences in errors ----------
0a1,3
> Warning: No connection between edge 'C2C1' and edge ':C0_10' found.
> Warning: No connection between edge 'D1D2' and edge ':C0_10' found.
> Warning: No connection between edge 'D1C1' and edge ':C0_10' found.