23Mar23rv1_16_0+1582-51b3663f1e8 - detailed test results for TOOLS

To reconnect the TextTest GUI to these results, run:

texttest -a tools -d /home/delphi/gcc/sumo/tests -reconnect /home/delphi/gcc/texttesttmp/gcc4_64.31Mar002052.3492820 -g

To start TextTest for these tests, run:

texttest -a tools -d /home/delphi/gcc/sumo/tests


default: 1073 tests: 1069 succeeded 2 known bugs 2 FAILED

Detailed information for the tests that FAILED:

TEST FAILED on ts-sim-build-ba : build checkStyle tools ( Last six runs Mar2023 )

---------- Differences in output ----------
0a1,66
> countEdgeUsage.py:51:121: E501 line too long (130 > 120 characters)
> fcdReplay.py:35:56: E231 missing whitespace after ','
> fcdReplay.py:35:121: E501 line too long (130 > 120 characters)
> fcdReplay.py:36:121: E501 line too long (136 > 120 characters)
> extractTest.py:56:121: E501 line too long (127 > 120 characters)
> extractTest.py:64:121: E501 line too long (133 > 120 characters)
> evacuateAreas.py:55:121: E501 line too long (139 > 120 characters)
> evacuateAreas.py:63:43: E127 continuation line over-indented for visual indent
> evacuateAreas.py:65:121: E501 line too long (122 > 120 characters)
> evacuateAreas.py:66:121: E501 line too long (128 > 120 characters)
> evacuateAreas.py:67:49: E127 continuation line over-indented for visual indent
> evacuateAreas.py:71:121: E501 line too long (126 > 120 characters)
> evacuateAreas.py:72:45: E127 continuation line over-indented for visual indent
> evacuateAreas.py:76:121: E501 line too long (136 > 120 characters)
> evacuateAreas.py:77:121: E501 line too long (129 > 120 characters)
> generateBidiDistricts.py:35:121: E501 line too long (138 > 120 characters)
> generateBidiDistricts.py:36:121: E501 line too long (134 > 120 characters)
> generateRerouters.py:48:51: E231 missing whitespace after ','
> generateRerouters.py:50:49: E231 missing whitespace after ','
> generateRailSignalConstraints.py:162:61: E231 missing whitespace after ','
> generateRailSignalConstraints.py:174:121: E501 line too long (127 > 120 characters)
> generateRailSignalConstraints.py:181:121: E501 line too long (126 > 120 characters)
> generateRailSignalConstraints.py:187:121: E501 line too long (124 > 120 characters)
> generateRailSignalConstraints.py:189:121: E501 line too long (130 > 120 characters)
> generateRailSignalConstraints.py:191:121: E501 line too long (126 > 120 characters)
> generateRailSignalConstraints.py:193:121: E501 line too long (132 > 120 characters)
> generateRailSignalConstraints.py:194:57: E127 continuation line over-indented for visual indent
> generateRailSignalConstraints.py:197:121: E501 line too long (124 > 120 characters)
> generateRailSignalConstraints.py:203:121: E501 line too long (124 > 120 characters)
<truncated after showing first 30 lines>

TEST FAILED on ts-sim-build-ba : xml schemaCheck tests sim_outputs ( Last six runs Mar2023 )

---------- Differences in errors ----------
7a8,9
> sumo/basic/containerFlow/trip_chain/stopinfos.sumo.meso:48:0:ERROR:SCHEMASV:SCHEMAV_CVC_COMPLEX_TYPE_4: Element 'stopinfo': The attribute 'delay' is required but missing.
> sumo/basic/containerFlow/trip_chain/stopinfos.sumo:44:0:ERROR:SCHEMASV:SCHEMAV_CVC_COMPLEX_TYPE_4: Element 'stopinfo': The attribute 'delay' is required but missing.
15a18,29
> sumo/basic/person/ride_and_stop/stopinfos.sumo.meso:46:0:ERROR:SCHEMASV:SCHEMAV_CVC_COMPLEX_TYPE_4: Element 'stopinfo': The attribute 'delay' is required but missing.
> sumo/basic/person/ride_and_stop/stopinfos.sumo.meso:47:0:ERROR:SCHEMASV:SCHEMAV_CVC_COMPLEX_TYPE_4: Element 'stopinfo': The attribute 'delay' is required but missing.
> sumo/basic/person/ride_and_stop/stopinfos.sumo.meso:48:0:ERROR:SCHEMASV:SCHEMAV_CVC_COMPLEX_TYPE_4: Element 'stopinfo': The attribute 'delay' is required but missing.
> sumo/basic/person/ride_and_stop/stopinfos.sumo:42:0:ERROR:SCHEMASV:SCHEMAV_CVC_COMPLEX_TYPE_4: Element 'stopinfo': The attribute 'delay' is required but missing.
> sumo/basic/person/ride_and_stop/stopinfos.sumo:43:0:ERROR:SCHEMASV:SCHEMAV_CVC_COMPLEX_TYPE_4: Element 'stopinfo': The attribute 'delay' is required but missing.
> sumo/basic/person/ride_and_stop/stopinfos.sumo:44:0:ERROR:SCHEMASV:SCHEMAV_CVC_COMPLEX_TYPE_4: Element 'stopinfo': The attribute 'delay' is required but missing.
> sumo/basic/person/ride_and_stop_tolerance/stopinfos.sumo.meso:47:0:ERROR:SCHEMASV:SCHEMAV_CVC_COMPLEX_TYPE_4: Element 'stopinfo': The attribute 'delay' is required but missing.
> sumo/basic/person/ride_and_stop_tolerance/stopinfos.sumo.meso:48:0:ERROR:SCHEMASV:SCHEMAV_CVC_COMPLEX_TYPE_4: Element 'stopinfo': The attribute 'delay' is required but missing.
> sumo/basic/person/ride_and_stop_tolerance/stopinfos.sumo.meso:49:0:ERROR:SCHEMASV:SCHEMAV_CVC_COMPLEX_TYPE_4: Element 'stopinfo': The attribute 'delay' is required but missing.
> sumo/basic/person/ride_and_stop_tolerance/stopinfos.sumo:43:0:ERROR:SCHEMASV:SCHEMAV_CVC_COMPLEX_TYPE_4: Element 'stopinfo': The attribute 'delay' is required but missing.
> sumo/basic/person/ride_and_stop_tolerance/stopinfos.sumo:44:0:ERROR:SCHEMASV:SCHEMAV_CVC_COMPLEX_TYPE_4: Element 'stopinfo': The attribute 'delay' is required but missing.
> sumo/basic/person/ride_and_stop_tolerance/stopinfos.sumo:45:0:ERROR:SCHEMASV:SCHEMAV_CVC_COMPLEX_TYPE_4: Element 'stopinfo': The attribute 'delay' is required but missing.
17a32,39
> sumo/basic/person/riding/boarding_duration_extension_small/stopinfos.sumo.meso:45:0:ERROR:SCHEMASV:SCHEMAV_CVC_COMPLEX_TYPE_4: Element 'stopinfo': The attribute 'delay' is required but missing.
> sumo/basic/person/riding/boarding_duration_extension_small/stopinfos.sumo:41:0:ERROR:SCHEMASV:SCHEMAV_CVC_COMPLEX_TYPE_4: Element 'stopinfo': The attribute 'delay' is required but missing.
> sumo/basic/person/riding/deboarding_duration_extension/stopinfos.sumo.meso:45:0:ERROR:SCHEMASV:SCHEMAV_CVC_COMPLEX_TYPE_4: Element 'stopinfo': The attribute 'delay' is required but missing.
> sumo/basic/person/riding/deboarding_duration_extension/stopinfos.sumo.meso:46:0:ERROR:SCHEMASV:SCHEMAV_CVC_COMPLEX_TYPE_4: Element 'stopinfo': The attribute 'delay' is required but missing.
> sumo/basic/person/riding/deboarding_duration_extension/stopinfos.sumo.meso:47:0:ERROR:SCHEMASV:SCHEMAV_CVC_COMPLEX_TYPE_4: Element 'stopinfo': The attribute 'delay' is required but missing.
> sumo/basic/person/riding/deboarding_duration_extension/stopinfos.sumo:41:0:ERROR:SCHEMASV:SCHEMAV_CVC_COMPLEX_TYPE_4: Element 'stopinfo': The attribute 'delay' is required but missing.
> sumo/basic/person/riding/deboarding_duration_extension/stopinfos.sumo:42:0:ERROR:SCHEMASV:SCHEMAV_CVC_COMPLEX_TYPE_4: Element 'stopinfo': The attribute 'delay' is required but missing.
> sumo/basic/person/riding/deboarding_duration_extension/stopinfos.sumo:43:0:ERROR:SCHEMASV:SCHEMAV_CVC_COMPLEX_TYPE_4: Element 'stopinfo': The attribute 'delay' is required but missing.
24a47,65
> sumo/basic/stops/stop_edge/stopinfos.sumo.meso:45:0:ERROR:SCHEMASV:SCHEMAV_CVC_COMPLEX_TYPE_4: Element 'stopinfo': The attribute 'delay' is required but missing.
> sumo/basic/stops/stop_edge/stopinfos.sumo:41:0:ERROR:SCHEMASV:SCHEMAV_CVC_COMPLEX_TYPE_4: Element 'stopinfo': The attribute 'delay' is required but missing.
> sumo/bugs/12xxx/ticket12168/stopinfos.sumo.meso:45:0:ERROR:SCHEMASV:SCHEMAV_CVC_COMPLEX_TYPE_4: Element 'stopinfo': The attribute 'delay' is required but missing.
> sumo/bugs/12xxx/ticket12168/stopinfos.sumo.meso:46:0:ERROR:SCHEMASV:SCHEMAV_CVC_COMPLEX_TYPE_4: Element 'stopinfo': The attribute 'delay' is required but missing.
<truncated after showing first 30 lines>

Detailed information for the tests that had known bugs:

TEST had known bugs (see #7391) on ts-sim-build-ba : assign dua-iterate mapmatchJunctions ( Last six runs Mar2023 )

duaIterate only works with fixed departEdge
(This bug was triggered by text found in file 'dualog' matching 'input_trips_000.rou.alt.xml' is not accessible')
---------- Differences in dualog ----------
1d0
< Loading configuration ... done.
3,55d1
< Loading configuration ... done.
< Loading done.
< Simulation started with time: 0.00.
< Simulation ended at time: 177.00
< Reason: All vehicles have left the simulation.
< Performance: 
< Vehicles: 
<  Inserted: 10
<  Running: 0
<  Waiting: 0
< 
< Loading configuration ... done.
< Success.
< Loading configuration ... done.
< Loading done.
< Simulation started with time: 0.00.
< Simulation ended at time: 177.00
< Reason: All vehicles have left the simulation.
< Performance: 
< Vehicles: 
<  Inserted: 10
<  Running: 0
<  Waiting: 0
< 
< Loading configuration ... done.
< Success.
< Loading configuration ... done.
<truncated after showing first 30 lines>
---------- Differences in errors ----------
0a1
> Execution of <path-to>duarouter'] failed. Look into dua.log for details.
---------- Differences in output ----------
1d0
< Loading configuration ... done.
9d7
< Loading configuration ... done.
11,40c9
< >> Running router on input_trips_000.rou.alt.xml
< <<
< >> Running simulation
< <<
< ------------------
< 
< Loading configuration ... done.
< > Executing step 2
< >> Running router on input_trips_001.rou.alt.xml
< <<
< >> Running simulation
< <<
< ------------------
< 
< Loading configuration ... done.
< > Executing step 3
< >> Running router on input_trips_002.rou.alt.xml
< <<
< >> Running simulation
< <<
< ------------------
< 
< Loading configuration ... done.
< > Executing step 4
< >> Running router on input_trips_003.rou.alt.xml
<truncated after showing first 30 lines>
---------- Missing result in tripinfos ----------
<?xml version="1.0" encoding="UTF-8"?>


<tripinfos xmlns:xsi="http://www.w3.org/2001/XMLSchema-instance" xsi:noNamespaceSchemaLocation="http://sumo.dlr.de/xsd/tripinfo_file.xsd">
    <tripinfo id="0" depart="0.00" departLane="middle_0" departPos="5.10" departSpeed="0.00" departDelay="0.00" arrival="70.00" arrivalLane="middle_0" arrivalPos="1000.00" arrivalSpeed="14.73" duration="70.00" routeLength="994.90" waitingTime="0.00" waitingCount="0" stopTime="0.00" timeLoss="2.35" rerouteNo="0" devices="tripinfo_0" vType="t" speedFactor="1.06" vaporized=""/>
    <tripinfo id="1" depart="10.00" departLane="middle_0" departPos="5.10" departSpeed="0.00" departDelay="0.00" arrival="89.00" arrivalLane="middle_0" arrivalPos="1000.00" arrivalSpeed="13.04" duration="79.00" routeLength="994.90" waitingTime="0.00" waitingCount="0" stopTime="0.00" timeLoss="2.01" rerouteNo="0" devices="tripinfo_1" vType="t" speedFactor="0.94" vaporized=""/>
    <tripinfo id="2" depart="20.00" departLane="middle_0" departPos="5.10" departSpeed="0.00" departDelay="0.00" arrival="94.00" arrivalLane="middle_0" arrivalPos="1000.00" arrivalSpeed="14.04" duration="74.00" routeLength="994.90" waitingTime="0.00" waitingCount="0" stopTime="0.00" timeLoss="2.22" rerouteNo="0" devices="tripinfo_2" vType="t" speedFactor="1.01" vaporized=""/>
    <tripinfo id="3" depart="30.00" departLane="middle_0" departPos="5.10" departSpeed="0.00" departDelay="0.00" arrival="99.00" arrivalLane="middle_0" arrivalPos="1000.00" arrivalSpeed="15.05" duration="69.00" routeLength="994.90" waitingTime="0.00" waitingCount="0" stopTime="0.00" timeLoss="2.41" rerouteNo="0" devices="tripinfo_3" vType="t" speedFactor="1.08" vaporized=""/>
    <tripinfo id="4" depart="40.00" departLane="middle_0" departPos="5.10" departSpeed="0.00" departDelay="0.00" arrival="112.00" arrivalLane="middle_0" arrivalPos="1000.00" arrivalSpeed="14.32" duration="72.00" routeLength="994.90" waitingTime="0.00" waitingCount="0" stopTime="0.00" timeLoss="2.28" rerouteNo="0" devices="tripinfo_4" vType="t" speedFactor="1.03" vaporized=""/>
    <tripinfo id="5" depart="50.00" departLane="middle_0" departPos="5.10" departSpeed="0.00" departDelay="0.00" arrival="138.00" arrivalLane="middle_0" arrivalPos="1000.00" arrivalSpeed="11.55" duration="88.00" routeLength="994.90" waitingTime="0.00" waitingCount="0" stopTime="0.00" timeLoss="1.75" rerouteNo="0" devices="tripinfo_5" vType="t" speedFactor="0.83" vaporized=""/>
    <tripinfo id="6" depart="60.00" departLane="middle_0" departPos="5.10" departSpeed="0.00" departDelay="0.00" arrival="140.00" arrivalLane="middle_0" arrivalPos="1000.00" arrivalSpeed="14.54" duration="80.00" routeLength="994.90" waitingTime="0.00" waitingCount="0" stopTime="0.00" timeLoss="10.80" rerouteNo="0" devices="tripinfo_6" vType="t" speedFactor="1.05" vaporized=""/>
    <tripinfo id="7" depart="70.00" departLane="middle_0" departPos="5.10" departSpeed="0.00" departDelay="0.00" arrival="153.00" arrivalLane="middle_0" arrivalPos="1000.00" arrivalSpeed="12.32" duration="83.00" routeLength="994.90" waitingTime="0.00" waitingCount="0" stopTime="0.00" timeLoss="1.89" rerouteNo="0" devices="tripinfo_7" vType="t" speedFactor="0.89" vaporized=""/>
    <tripinfo id="8" depart="80.00" departLane="middle_0" departPos="5.10" departSpeed="0.00" departDelay="0.00" arrival="159.00" arrivalLane="middle_0" arrivalPos="1000.00" arrivalSpeed="13.04" duration="79.00" routeLength="994.90" waitingTime="0.00" waitingCount="0" stopTime="0.00" timeLoss="2.01" rerouteNo="0" devices="tripinfo_8" vType="t" speedFactor="0.94" vaporized=""/>
    <tripinfo id="9" depart="90.00" departLane="middle_0" departPos="5.10" departSpeed="0.00" departDelay="0.00" arrival="176.00" arrivalLane="middle_0" arrivalPos="1000.00" arrivalSpeed="11.91" duration="86.00" routeLength="994.90" waitingTime="0.00" waitingCount="0" stopTime="0.00" timeLoss="1.82" rerouteNo="0" devices="tripinfo_9" vType="t" speedFactor="0.86" vaporized=""/>
</tripinfos>

TEST had known bugs (see #5409) on ts-sim-build-ba : detector flowrouter motorway_ramps lane_based ( Last six runs Mar2023 )

option lane-based does not work
(This bug was triggered by text found in file 'routes' matching 'on3 3 off3')
---------- Differences in flows ----------
2c2,3
<     <flow id="1_off3.qPKW" departSpeed="max" departPos="last" departLane="best" route="1_off3.qPKW" number="450" begin="0" end="3600"/>
---
>     <flow id="1_0_9_0.qPKW" departSpeed="max" departPos="last" departLane="best" route="1_0_9_0.qPKW" number="450" begin="0" end="3600"/>
>     <flow id="on3_0_off3_0.qPKW" departSpeed="max" departPos="last" departLane="best" route="on3_0_off3_0.qPKW" number="450" begin="0" end="3600"/>
---------- Differences in routes ----------
2c2,3
<     <route id="1_off3.qPKW" edges="1 2 3 off3"/>
---
>     <route id="1_0_9_0.qPKW" edges="1 2 3 4 5 6 7 8 9"/>
>     <route id="on3_0_off3_0.qPKW" edges="on3 3 off3"/>