27Oct19rv1_3_1+0711-206bd1deea - detailed test results for TOOLS

To reconnect the TextTest GUI to these results, run:

texttest -a tools -d /home/delphi/gcc/sumo/tests -reconnect /home/delphi/gcc/texttesttmp/gcc4_64.01Nov001315.24538 -g

To start TextTest for these tests, run:

texttest -a tools -d /home/delphi/gcc/sumo/tests


default: 465 tests: 456 succeeded 5 FAILED 4 known bugs

Detailed information for the tests that FAILED:

TEST FAILED on ts-sim-build-ba : build checkStyle complex ( Last six runs Nov2019 Oct2019 )

---------- Differences in output ----------
0a1,3
> sumo/ToCDevice/spec/runner.py:22:1: F401 'runnerlib.requestToC' imported but unused
> traci/pythonApi/steplistener/runner.py:29:1: E302 expected 2 blank lines, found 1
> traci/pythonApi/steplistener/runner.py:35:1: W293 blank line contains whitespace

TEST FAILED on ts-sim-build-ba : build checkStyle netedit_additionals ( Last six runs Nov2019 Oct2019 )

---------- Differences in output ----------
0a1,3
> busstop/create/id/test.py:70:1: W391 blank line at end of file
> e1InstantDetector/create/id/test.py:49:20: W291 trailing whitespace
> e1detector/create/id/test.py:49:20: W291 trailing whitespace

TEST FAILED on ts-sim-build-ba : build checkStyle tools ( Last six runs Nov2019 Oct2019 )

---------- Differences in output ----------
0a1
> route/cutRoutes.py:255:121: E501 line too long (121 > 120 characters)

TEST FAILED on ts-sim-build-ba : import OSM webWizard ( Last six runs Nov2019 Oct2019 )

---------- Differences in errors ----------
304a305,36627
> Warning: Invalid longitude 1781.21
> Warning: Invalid longitude 1780.31
> Warning: Invalid longitude 1774.31
> Warning: Invalid longitude 1768.36
> Warning: Invalid longitude 1775.39
> Warning: Invalid longitude 1783.46
> Warning: Invalid longitude 1760.50
> Warning: Invalid longitude 1762.38
> Warning: Invalid longitude 1753.73
> Warning: Invalid longitude 1748.50
> Warning: Invalid longitude 1743.77
> Warning: Invalid longitude 1746.40
> Warning: Invalid longitude 1738.45
> Warning: Invalid longitude 1732.20
> Warning: Invalid longitude 1729.85
> Warning: Invalid longitude 1719.59
> Warning: Invalid longitude 1721.16
> Warning: Invalid longitude 1720.72
> Warning: Invalid longitude 1718.70
> Warning: Invalid longitude 1718.10
> Warning: Invalid longitude 1711.81
> Warning: Invalid longitude 1712.08
> Warning: Invalid longitude 1700.45
> Warning: Invalid longitude 1691.76
> Warning: Invalid longitude 1691.00
> Warning: Invalid longitude 1687.37
> Warning: Invalid longitude 1685.33
> Warning: Invalid longitude 1681.41
> Warning: Invalid longitude 1682.07
<truncated after showing first 30 lines>
---------- Differences in output ----------
121c121,143
< Success.
---
> Building scenario in <DIR>
> generating trips...
> Cannot extend route before first stop for line '1981933' (stop edge -148458500#1 not in route)
> Cannot extend route after last stop for line '2014286' (stop edge 207364192#0 not in route)
> Cannot extend route after last stop for line '2076231' (stop edge 207364191#0 not in route)
> Cannot extend route after last stop for line '2076232' (stop edge 207364191#0 not in route)
> Skipping line '2194813' because because it only drives at night
> Skipping line '2194814' because because it only drives at night
> Cannot extend route before first stop for line '2211985' (stop edge -478396988 not in route)
> Cannot extend route before first stop for line '28270' (stop edge -148458500#1 not in route)
> Cannot extend route to fringe for line '300432' (not enough edges given)
> Cannot extend route to fringe for line '6593455' (not enough edges given)
> Imported 84 lines with 317 stops and skipped 2 lines
>    tram: 20
>    bus: 27
>    train: 13
>    light_rail: 18
>    subway: 6
> done.
> running SUMO to determine actual departure times...
> done.
> creating routes...
> done.
164,186c186
< Building scenario in <DIR>
< generating trips...
< Cannot extend route before first stop for line '1981933' (stop edge -148458500#1 not in route)
<truncated after showing first 30 lines>

TEST FAILED on ts-sim-build-ba : xml schemaCheck tests routes ( Last six runs Nov2019 Oct2019 )

---------- Differences in errors ----------
1c1
< Error on parsing 'netedit/demandElements/stop/stopLane/load/actType/input_routes.rou.xml'!
---
> Error on parsing 'sumo/meta/xml_invalid_schema/input_routes.rou.xml'!
60a61,64
> netedit/demandElements/flow/load/parameters/input_routes.rou.xml:61:0:ERROR:SCHEMASV:SCHEMAV_CVC_COMPLEX_TYPE_4: Element 'param': The attribute 'key' is required but missing.
> netedit/demandElements/flow/load/parameters/input_routes.rou.xml:61:0:ERROR:SCHEMASV:SCHEMAV_CVC_COMPLEX_TYPE_4: Element 'param': The attribute 'value' is required but missing.
> netedit/demandElements/flow/load/parameters/input_routes.rou.xml:64:0:ERROR:SCHEMASV:SCHEMAV_CVC_COMPLEX_TYPE_4: Element 'param': The attribute 'key' is required but missing.
> netedit/demandElements/flow/load/parameters/input_routes.rou.xml:76:0:ERROR:SCHEMASV:SCHEMAV_CVC_COMPLEX_TYPE_4: Element 'param': The attribute 'value' is required but missing.
85,88c89,92
< netedit/demandElements/route/load/parameters/input_routes.rou.xml:44:0:ERROR:SCHEMASV:SCHEMAV_CVC_COMPLEX_TYPE_4: Element 'param': The attribute 'key' is required but missing.
< netedit/demandElements/route/load/parameters/input_routes.rou.xml:53:0:ERROR:SCHEMASV:SCHEMAV_CVC_COMPLEX_TYPE_4: Element 'param': The attribute 'value' is required but missing.
< netedit/demandElements/route/load/parameters/input_routes.rou.xml:62:0:ERROR:SCHEMASV:SCHEMAV_CVC_COMPLEX_TYPE_4: Element 'param': The attribute 'key' is required but missing.
< netedit/demandElements/route/load/parameters/input_routes.rou.xml:62:0:ERROR:SCHEMASV:SCHEMAV_CVC_COMPLEX_TYPE_4: Element 'param': The attribute 'value' is required but missing.
---
> netedit/demandElements/route/load/parameters/input_routes.rou.xml:45:0:ERROR:SCHEMASV:SCHEMAV_CVC_COMPLEX_TYPE_4: Element 'param': The attribute 'key' is required but missing.
> netedit/demandElements/route/load/parameters/input_routes.rou.xml:45:0:ERROR:SCHEMASV:SCHEMAV_CVC_COMPLEX_TYPE_4: Element 'param': The attribute 'value' is required but missing.
> netedit/demandElements/route/load/parameters/input_routes.rou.xml:48:0:ERROR:SCHEMASV:SCHEMAV_CVC_COMPLEX_TYPE_4: Element 'param': The attribute 'key' is required but missing.
> netedit/demandElements/route/load/parameters/input_routes.rou.xml:60:0:ERROR:SCHEMASV:SCHEMAV_CVC_COMPLEX_TYPE_4: Element 'param': The attribute 'value' is required but missing.
120a125,128
> netedit/demandElements/routeflow/load/parameters/input_routes.rou.xml:62:0:ERROR:SCHEMASV:SCHEMAV_CVC_COMPLEX_TYPE_4: Element 'param': The attribute 'key' is required but missing.
> netedit/demandElements/routeflow/load/parameters/input_routes.rou.xml:62:0:ERROR:SCHEMASV:SCHEMAV_CVC_COMPLEX_TYPE_4: Element 'param': The attribute 'value' is required but missing.
> netedit/demandElements/routeflow/load/parameters/input_routes.rou.xml:65:0:ERROR:SCHEMASV:SCHEMAV_CVC_COMPLEX_TYPE_4: Element 'param': The attribute 'key' is required but missing.
> netedit/demandElements/routeflow/load/parameters/input_routes.rou.xml:77:0:ERROR:SCHEMASV:SCHEMAV_CVC_COMPLEX_TYPE_4: Element 'param': The attribute 'value' is required but missing.
150a159,161
> netedit/demandElements/stop/stopBusStop/load/extension/input_routes.rou.xml:42:0:ERROR:SCHEMASV:SCHEMAV_CVC_DATATYPE_VALID_1_2_3: Element 'stop', attribute 'extension': 'dummyDuration' is not a valid value of the union type 'timeType'.
> netedit/demandElements/stop/stopBusStop/load/extension/input_routes.rou.xml:44:0:ERROR:SCHEMASV:SCHEMAV_CVC_DATATYPE_VALID_1_2_3: Element 'stop', attribute 'extension': '' is not a valid value of the union type 'timeType'.
> netedit/demandElements/stop/stopBusStop/load/extension/input_routes.rou.xml:46:0:ERROR:SCHEMASV:SCHEMAV_CVC_DATATYPE_VALID_1_2_3: Element 'stop', attribute 'extension': '-4' is not a valid value of the union type 'timeType'.
174d184
< netedit/demandElements/stop/stopChargingStation/inspect_selection/input_routes.rou.xml:41:0:ERROR:SCHEMASV:SCHEMAV_CVC_COMPLEX_TYPE_3_2_1: Element 'stop', attribute 'flowId': The attribute 'flowId' is not allowed.
<truncated after showing first 30 lines>

Detailed information for the tests that had known bugs:

TEST had known bugs (see #5409) on ts-sim-build-ba : detector flowrouter motorway_ramps lane_based ( Last six runs Nov2019 Oct2019 )

option lane-based does not work
(This bug was triggered by text found in file 'routes' matching 'on3 3 off3')
---------- Differences in flows ----------
2c2,3
<     <flow id="1_off3.qPKW" departSpeed="max" departPos="last" departLane="best" route="1_off3.qPKW" number="450" begin="0" end="3600"/>
---
>     <flow id="1_0_9_0.qPKW" departSpeed="max" departPos="last" departLane="best" route="1_0_9_0.qPKW" number="450" begin="0" end="3600"/>
>     <flow id="on3_0_off3_0.qPKW" departSpeed="max" departPos="last" departLane="best" route="on3_0_off3_0.qPKW" number="450" begin="0" end="3600"/>
---------- Differences in routes ----------
2c2,3
<     <route id="1_off3.qPKW" edges="1 2 3 off3"/>
---
>     <route id="1_0_9_0.qPKW" edges="1 2 3 4 5 6 7 8 9"/>
>     <route id="on3_0_off3_0.qPKW" edges="on3 3 off3"/>

TEST had known bugs (see #2620) on ts-sim-build-ba : projects evacuation plain ( Last six runs Nov2019 Oct2019 )

unstable inputs
(This bug was triggered by text found in the full difference report matching 'Warning')
---------- Differences in errors ----------
1,6925c1
< Warning: Discarding unusable type 'waterway.canal' (first occurence for edge '4041237#0').
< Warning: Discarding unknown compound 'cycleway.track' in type 'cycleway.track|highway.primary' (first occurence for edge '4045243#0').
< Warning: Discarding unknown compound 'cycleway.lane' in type 'cycleway.lane|highway.residential' (first occurence for edge '4068019#0').
< Warning: Discarding unknown compound 'cycleway.lane' in type 'cycleway.lane|highway.primary' (first occurence for edge '4068043#0').
< Warning: Discarding unknown compound 'cycleway.track' in type 'cycleway.track|highway.secondary' (first occurence for edge '4068192').
< Warning: Discarding unknown compound 'cycleway.track' in type 'cycleway.track|highway.tertiary' (first occurence for edge '4377008#0').
< Warning: Discarding unknown compound 'cycleway.lane' in type 'cycleway.lane|highway.tertiary' (first occurence for edge '4377122#0').
< Warning: Discarding unknown compound 'cycleway.share_busway' in type 'cycleway.share_busway|highway.secondary' (first occurence for edge '4377785#0').
< Warning: Discarding unknown compound 'cycleway.lane' in type 'cycleway.lane|highway.secondary' (first occurence for edge '4383334').
< Warning: Discarding unusable type 'highway.construction' (first occurence for edge '4391568').
< Warning: Discarding unknown compound 'cycleway.track' in type 'cycleway.track|highway.residential' (first occurence for edge '4395586#0').
< Warning: Discarding unknown compound 'cycleway.share_busway' in type 'cycleway.share_busway|highway.primary' (first occurence for edge '4395950#0').
< Warning: Discarding unknown compound 'cycleway.opposite' in type 'cycleway.opposite|highway.residential' (first occurence for edge '4396234').
< Warning: Discarding unknown compound 'cycleway.track' in type 'cycleway.track|highway.living_street' (first occurence for edge '4410583').
< Warning: Discarding unknown compound 'cycleway.lane' in type 'cycleway.lane|highway.secondary_link' (first occurence for edge '4484071').
< Warning: Discarding unknown compound 'cycleway.track' in type 'cycleway.track|highway.cycleway' (first occurence for edge '4492364#0').
< Warning: Discarding unusable type 'railway.disused' (first occurence for edge '4525886').
< Warning: Discarding unusable type 'highway.proposed' (first occurence for edge '4611776#0').
< Warning: Discarding unknown compound 'cycleway.none' in type 'cycleway.none|highway.tertiary' (first occurence for edge '4612758#0').
< Warning: Discarding unknown compound 'cycleway.track' in type 'cycleway.track|cycleway.track|highway.primary' (first occurence for edge '4615457#0').
< Warning: Discarding unknown compound 'cycleway.track' in type 'cycleway.track|cycleway.track|highway.primary' (first occurence for edge '4615457#0').
< Warning: Discarding unknown compound 'cycleway.shared' in type 'cycleway.shared|highway.secondary' (first occurence for edge '4615594#0').
< Warning: Discarding unknown compound 'cycleway.opposite' in type 'cycleway.opposite|highway.living_street' (first occurence for edge '4639037#0').
< Warning: Discarding unknown compound 'cycleway.opposite_track' in type 'cycleway.opposite_track|cycleway.track|cycleway.track|highway.residential' (first occurence for edge '4686018#0').
< Warning: Discarding unknown compound 'cycleway.track' in type 'cycleway.opposite_track|cycleway.track|cycleway.track|highway.residential' (first occurence for edge '4686018#0').
< Warning: Discarding unknown compound 'cycleway.track' in type 'cycleway.opposite_track|cycleway.track|cycleway.track|highway.residential' (first occurence for edge '4686018#0').
< Warning: Discarding unusable type 'waterway.riverbank' (first occurence for edge '4686373#0').
< Warning: Discarding unknown compound 'cycleway.shared_lane' in type 'cycleway.shared_lane|highway.primary' (first occurence for edge '4790833#0').
< Warning: Discarding unusable type 'railway.abandoned' (first occurence for edge '4790904').
<truncated after showing first 30 lines>
---------- Differences in output ----------
1,97d0
< Parsing types from <DIR>/osmNetconvert.typ.xml'... done.
< Parsing nodes from osm-file 'osm_bbox.osm.xml'... 
< Found duplicate nodes. Substituting 3215103784 with 288002013
< Found duplicate nodes. Substituting 3987794203 with 3987794202
< Found duplicate nodes. Substituting 3997661445 with 3517810193
< Found duplicate nodes. Substituting 4016273048 with 26992494
< Found duplicate nodes. Substituting 4016273049 with 2306772973
< done.
< Parsing edges from osm-file 'osm_bbox.osm.xml'... done.
< Removing duplicate edges... 
< Found duplicate edges. Removing 310058575
< Found duplicate edges. Removing 310058576
< Found duplicate edges. Removing 310058577
< Found duplicate edges. Removing 335703516
< Found duplicate edges. Removing 335703519
< Found duplicate edges. Removing 335703532
< Found duplicate edges. Removing 377118659
< Found duplicate edges. Removing 377494320
< Found duplicate edges. Removing 391385403
< done.
< Adding new type 'highway.service|railway.tram' (first occurence for edge '167272531#0').
< Parsing relations from osm-file 'osm_bbox.osm.xml'... 
< done.
<  Removed 1494 traffic lights before loading plain-XML
<  Import done:
<    37203 nodes loaded.
<    34 types loaded.
<    36921 edges loaded.
< Proj projection parameters used: '+proj=utm +zone=33 +ellps=WGS84 +datum=WGS84 +units=m +no_defs'.
<truncated after showing first 30 lines>
---------- New result in catalogue ----------
No files or directories were created, edited or deleted.

TEST had known bugs (bug 1190 (NONEXISTENT)) on ts-sim-build-ba : xml csv2xml cross3ltl_full_schema ( Last six runs Nov2019 Oct2019 )

Failed to open URL 'https://sumo.dlr.de/trac.wsgi/ticket/1190?format=tab': HTTP Error 404: Not Found.

Please make sure that bug 1190 exists
and that the configuration entry 'bug_system_location' points to the correct trac instance.
The current value is 'https://sumo.dlr.de/trac.wsgi/'.
(This bug was triggered by FAILING to find text in file 'xml' matching 'vehicles')
---------- Differences in xml ----------
1,32d0
< <?xml version="1.0" encoding="UTF-8"?>
< 
< <!-- generated on Tue Dec  3 16:33:35 2013 by SUMO sumo Version dev-SVN-r15233
< This data file and the accompanying materials
< are made available under the terms of the Eclipse Public License v2.0
< which accompanies this distribution, and is available at
< http://www.eclipse.org/legal/epl-v20.html
< SPDX-License-Identifier: EPL-2.0
< <configuration xmlns:xsi="http://www.w3.org/2001/XMLSchema-instance" xsi:noNamespaceSchemaLocation="http://sumo.dlr.de/xsd/sumoConfiguration.xsd">
< 
<     <input>
<         <net-file value="net.net.xml"/>
<         <route-files value="input_routes.rou.xml"/>
<     </input>
< 
<     <output>
<         <full-output value="full.xml"/>
<     </output>
< 
<     <time>
<         <begin value="0"/>
<         <end value="120"/>
<     </time>
< 
<     <report>
<         <no-duration-log value="true"/>
<         <no-step-log value="true"/>
<     </report>
< 
<truncated after showing first 30 lines>

TEST had known bugs (see #5588) on ts-sim-build-ba : xml csv2xml meandata_edges_utf8 ( Last six runs Nov2019 Oct2019 )

python2 csv reader cannot handle utf8
(This bug was triggered by text found in file 'errors' matching 'UnicodeEncodeError')
---------- Differences in errors ----------
0a1,8
> Traceback (most recent call last):
>   File "/home/delphi/gcc/sumo/tests/../tools/xml/csv2xml.py", line 192, in <module>
>     main()
>   File "/home/delphi/gcc/sumo/tests/../tools/xml/csv2xml.py", line 188, in main
>     writeHierarchicalXml(xsd.XsdStructure(options.xsd), options)
>   File "/home/delphi/gcc/sumo/tests/../tools/xml/csv2xml.py", line 150, in writeHierarchicalXml
>     for raw in csv.reader(inputf, delimiter=options.delimiter):
> UnicodeEncodeError: 'ascii' codec can't encode character u'\xe4' in position 25: ordinal not in range(128)
---------- Differences in xml ----------
1,16c1
< <meandata>
<     <interval begin="0.00" end="60.00" id="dump_60">
<         <edge arrived="0" departed="0" entered="0" id="รค" laneChangedFrom="0" laneChangedTo="0" left="0" sampledSeconds="0.00"/>
<         <edge arrived="0" departed="0" entered="0" id="1o" laneChangedFrom="0" laneChangedTo="0" left="0" sampledSeconds="0.00"/>
<         <edge arrived="0" departed="0" entered="0" id="1si" laneChangedFrom="0" laneChangedTo="0" left="0" sampledSeconds="0.00"/>
<         <edge arrived="0" departed="0" entered="0" id="2fi" laneChangedFrom="0" laneChangedTo="0" left="0" sampledSeconds="0.00"/>
<         <edge arrived="0" departed="0" entered="0" id="2o" laneChangedFrom="0" laneChangedTo="0" left="0" sampledSeconds="0.00"/>
<         <edge arrived="0" departed="0" entered="0" id="2si" laneChangedFrom="0" laneChangedTo="0" left="0" sampledSeconds="0.00"/>
<         <edge arrived="0" departed="0" entered="0" id="3fi" laneChangedFrom="0" laneChangedTo="0" left="0" sampledSeconds="0.00"/>
<         <edge arrived="0" departed="0" entered="0" id="3o" laneChangedFrom="0" laneChangedTo="0" left="0" sampledSeconds="0.00"/>
<         <edge arrived="0" departed="0" entered="0" id="3si" laneChangedFrom="0" laneChangedTo="0" left="0" sampledSeconds="0.00"/>
<         <edge arrived="0" departed="0" entered="0" id="4fi" laneChangedFrom="0" laneChangedTo="0" left="0" sampledSeconds="0.00"/>
<         <edge arrived="0" departed="0" entered="0" id="4o" laneChangedFrom="0" laneChangedTo="0" left="0" sampledSeconds="0.00"/>
<         <edge arrived="0" departed="0" entered="0" id="4si" laneChangedFrom="0" laneChangedTo="0" left="0" sampledSeconds="0.00"/>
<     </interval>
< </meandata>
---
> <meandata
\ Kein Zeilenumbruch am Dateiende.