30Sep26rv1_27_1+0821-255a75505d2 - detailed test results for TRACI

To reconnect the TextTest GUI to these results, run:

texttest -a traci -d /home/delphi/gcc/sumo/tests -reconnect /home/delphi/gcc/texttesttmp/gcc.30Sep002625.3459913 -g

To start TextTest for these tests, run:

texttest -a traci -d /home/delphi/gcc/sumo/tests


default: 609 tests: 607 succeeded 2 FAILED

Detailed information for the tests that FAILED:

TEST FAILED on bsvusimbld : get_variable StoppingPlaces ChargingStations VAR_STOP_STARTING_VEHICLES_NUMBER ( Last six runs Sep2026 )

---------- Differences in errors ----------
0a1
> Quitting (on error).
---------- Differences in testclient_out ----------
2,18c2
< 
< -> Command sent: <SimulationStep>:
< .. Command acknowledged (2), [description: ]
< 
< -> Command sent: <GetVariable>:
<   domID=37 varID=104 objID=3/1to2/1
< .. Command acknowledged (37), [description: ]
<   CommandID=53  VariableID=104  ObjectID=3/1to2/1 valueDataType=9 Int value: 0
< 
< -> Command sent: <SimulationStep>:
< .. Command acknowledged (2), [description: ]
< 
< -> Command sent: <SimulationStep>:
< .. Command acknowledged (2), [description: ]
< 
< -> Command sent: <Close>:
< .. Command acknowledged (127), [description: ]
---
> ----

TEST FAILED on bsvusimbld : set_variable Vehicle MoveToXY failed ( Last six runs Sep2026 )

---------- Differences in errors ----------
1c1
< Error: Answered with error to command 0xc4: Could not map vehicle 'veh0', distance to road is 110.00.
---
> Quitting (on error).
---------- Differences in testclient_out ----------
2,41c2
< 
< -> Command sent: <SimulationStep>:
< .. Command acknowledged (2), [description: ]
< 
< -> Command sent: <SimulationStep>:
< .. Command acknowledged (2), [description: ]
< 
< -> Command sent: <SimulationStep>:
< .. Command acknowledged (2), [description: ]
< 
< -> Command sent: <SimulationStep>:
< .. Command acknowledged (2), [description: ]
< 
< -> Command sent: <SimulationStep>:
< .. Command acknowledged (2), [description: ]
< 
< -> Command sent: <SetValue>:
<   domID=196 varID=180 objID=veh0
< .. Answered with error to command (196), [description: Could not map vehicle 'veh0', distance to road is 110.00.]
< 
< -> Command sent: <SimulationStep>:
< .. Command acknowledged (2), [description: ]
< 
< -> Command sent: <SimulationStep>:
< .. Command acknowledged (2), [description: ]
< 
< -> Command sent: <SimulationStep>:
< .. Command acknowledged (2), [description: ]
< 
<truncated after showing first 30 lines>