27Sep20rv1_7_0+0225-03c664a9f7 - detailed test results for NETEDITCHECKOUTPUT

To reconnect the TextTest GUI to these results, run:

texttest.pyw -a neteditcheckoutput -d C:/Users/delphi/Code/sumo/git/tests -reconnect C:/Users/delphi/Code/sumo/msvc12Win32texttesttmp/msvc12Win32.02Oct012520.5876 -g

To start TextTest for these tests, run:

texttest.pyw -a neteditcheckoutput -d C:/Users/delphi/Code/sumo/git/tests


default: 2778 tests: 2491 succeeded 240 known bugs 47 FAILED

Detailed information for the tests that FAILED:

TEST FAILED on ts-sim-winbuild-ba : additionalElements e2MultiLaneDetector inspect file ( Last six runs Oct2020 Sep2020 )

---------- Differences in errors ----------
0a1,2
> Error: Attribute 'file' in definition of e2Detector 'e2MultilaneDetector_0' is empty.
> Quitting (on error).
---------- New result in exitcode ----------
1

TEST FAILED on ts-sim-winbuild-ba : additionalElements e2MultiLaneDetector load freq ( Last six runs Oct2020 Sep2020 )

---------- Differences in errors ----------
1c1,5
< Warning: The given time value 12.50 is not a multiple of the step length 1.00 (in e2Detector 'e2MultilaneDetector_3').
---
> Error: invalid character encountered
>  In file 'additionals.netedit'
>  At line/column 63/146.
> 
> Quitting (on error).
---------- New result in exitcode ----------
1

TEST FAILED on ts-sim-winbuild-ba : additionalElements e2detector create freq ( Last six runs Oct2020 Sep2020 )

---------- Differences in errors ----------
1c1,5
< Warning: The given time value 120.50 is not a multiple of the step length 1.00 (in e2Detector 'e2Detector_gneE0_0_0').
---
> Error: invalid character encountered
>  In file 'additionals.netedit'
>  At line/column 61/135.
> 
> Quitting (on error).
---------- New result in exitcode ----------
1

TEST FAILED on ts-sim-winbuild-ba : additionalElements e2detector load freq ( Last six runs Oct2020 Sep2020 )

---------- Differences in errors ----------
1c1,5
< Warning: The given time value 120.50 is not a multiple of the step length 1.00 (in e2Detector 'E2_04').
---
> Error: invalid character encountered
>  In file 'additionals.netedit'
>  At line/column 63/110.
> 
> Quitting (on error).
---------- New result in exitcode ----------
1

2 TESTS FAILED on ts-sim-winbuild-ba :

---------- Differences in output ----------
1d0
< Loading configuration ... done.
---------- New result in errors ----------
Error: Could not access configuration 'sumo.sumocfg'.
Quitting (on error).
bugs ticket4528 ( Last six runs Oct2020 Sep2020 )
bugs ticket5540 ( Last six runs Oct2020 Sep2020 )

TEST FAILED on ts-sim-winbuild-ba : demandElements flow inspect from ( Last six runs Oct2020 Sep2020 )

---------- Differences in errors ----------
0a1,4
> Warning: No connection between edge 'gneE8' and edge 'gneE5' found.
> Warning: No route for vehicle 'flow_0.0' found.
> Error: Vehicle 'flow_0.0' has no valid route.
> Quitting (on error).
---------- New result in exitcode ----------
1

TEST FAILED on ts-sim-winbuild-ba : demandElements flow inspect via ( Last six runs Oct2020 Sep2020 )

---------- Differences in errors ----------
0a1,3
> Warning: No connection between edge 'gneE2' and edge 'gneE8' found.
> Error: Vehicle 'flow_0.0' has no valid route from edge 'gneE2' to stop edge 'gneE8'.
> Quitting (on error).
---------- New result in exitcode ----------
1

TEST FAILED on ts-sim-winbuild-ba : demandElements flow_embedded create default_continuous ( Last six runs Oct2020 Sep2020 )

---------- Differences in errors ----------
0a1,2
> Error: Vehicle 'flow_0.0' has no valid route. No connection between edge 'gneE4' and edge 'gneE4'.
> Quitting (on error).
---------- New result in exitcode ----------
1

TEST FAILED on ts-sim-winbuild-ba : demandElements flow_embedded inspect parameters ( Last six runs Oct2020 Sep2020 )

---------- Differences in errors ----------
0a1,5
> Error: element 'route' is not allowed for content model '((route|routeDistribution),stop*,param*)'
>  In file 'routes.netedit'
>  At line/column 67/12.
> 
> Quitting (on error).
---------- New result in exitcode ----------
1

TEST FAILED on ts-sim-winbuild-ba : demandElements flow_embedded inspect_selection parameters ( Last six runs Oct2020 Sep2020 )

---------- Differences in errors ----------
1,46c1,5
< Error: Vehicle 'flowB.0' will not be able to depart using the given velocity (junction 'gneJ6' too close)!
< Error: Vehicle 'flowB.1' will not be able to depart using the given velocity (junction 'gneJ6' too close)!
< Error: Vehicle 'flowB.2' will not be able to depart using the given velocity (junction 'gneJ6' too close)!
< Error: Vehicle 'flowB.3' will not be able to depart using the given velocity (junction 'gneJ6' too close)!
< Error: Vehicle 'flowB.4' will not be able to depart using the given velocity (junction 'gneJ6' too close)!
< Error: Vehicle 'flowB.5' will not be able to depart using the given velocity (junction 'gneJ6' too close)!
< Error: Vehicle 'flowB.6' will not be able to depart using the given velocity (junction 'gneJ6' too close)!
< Error: Vehicle 'flowB.7' will not be able to depart using the given velocity (junction 'gneJ6' too close)!
< Error: Vehicle 'flowB.8' will not be able to depart using the given velocity (junction 'gneJ6' too close)!
< Error: Vehicle 'flowB.9' will not be able to depart using the given velocity (junction 'gneJ6' too close)!
< Error: Vehicle 'flowB.10' will not be able to depart using the given velocity (junction 'gneJ6' too close)!
< Error: Vehicle 'flowB.11' will not be able to depart using the given velocity (junction 'gneJ6' too close)!
< Error: Vehicle 'flowB.12' will not be able to depart using the given velocity (junction 'gneJ6' too close)!
< Error: Vehicle 'flowB.13' will not be able to depart using the given velocity (junction 'gneJ6' too close)!
< Error: Vehicle 'flowB.14' will not be able to depart using the given velocity (junction 'gneJ6' too close)!
< Error: Vehicle 'flowB.15' will not be able to depart using the given velocity (junction 'gneJ6' too close)!
< Error: Vehicle 'flowB.16' will not be able to depart using the given velocity (junction 'gneJ6' too close)!
< Error: Vehicle 'flowB.17' will not be able to depart using the given velocity (junction 'gneJ6' too close)!
< Warning: Teleporting vehicle 'flowA.0'; waited too long (jam), lane=':gneJ5_2_0', time=310.00.
< Warning: Vehicle 'flowA.0' ends teleporting on edge 'gneE4', time 310.00.
< Warning: Teleporting vehicle 'flowA.1'; waited too long (jam), lane=':gneJ5_2_0', time=615.00.
< Warning: Vehicle 'flowA.1' ends teleporting on edge 'gneE4', time 615.00.
< Warning: Teleporting vehicle 'flowA.2'; waited too long (jam), lane=':gneJ5_2_0', time=919.00.
< Warning: Vehicle 'flowA.2' ends teleporting on edge 'gneE4', time 919.00.
< Warning: Teleporting vehicle 'flowA.3'; waited too long (jam), lane=':gneJ5_2_0', time=1224.00.
< Warning: Vehicle 'flowA.3' ends teleporting on edge 'gneE4', time 1224.00.
< Warning: Teleporting vehicle 'flowA.4'; waited too long (jam), lane=':gneJ5_2_0', time=1528.00.
< Warning: Vehicle 'flowA.4' ends teleporting on edge 'gneE4', time 1528.00.
< Warning: Teleporting vehicle 'flowA.5'; waited too long (jam), lane=':gneJ5_2_0', time=1833.00.
<truncated after showing first 30 lines>
---------- New result in exitcode ----------
1

TEST FAILED on ts-sim-winbuild-ba : demandElements flow_embedded load route ( Last six runs Oct2020 Sep2020 )

---------- Differences in errors ----------
0a1,2
> Error: Vehicle 'vehicle_2.0' has no valid route. No connection between edge 'gneE2' and edge 'gneE5'.
> Quitting (on error).
---------- New result in exitcode ----------
1

TEST FAILED on ts-sim-winbuild-ba : demandElements person create default_ride default_ride_busstop ( Last six runs Oct2020 Sep2020 )

---------- Differences in errors ----------
1c1,5
< Warning: Person 'person_0' aborted waiting for ANY at busStop 'busStop'.
---
> Error: missing required attribute 'lines'
>  In file 'routes.netedit'
>  At line/column 59/47.
> 
> Quitting (on error).
---------- New result in exitcode ----------
1

TEST FAILED on ts-sim-winbuild-ba : demandElements personFlow create color ( Last six runs Oct2020 Sep2020 )

---------- Differences in errors ----------
0a1,5
> Error: attribute 'vehsPerHour' is not declared for element 'personFlow'
>  In file 'routes.netedit'
>  At line/column 58/97.
> 
> Quitting (on error).
---------- New result in exitcode ----------
1

TEST FAILED on ts-sim-winbuild-ba : demandElements personFlow create default_ride default_ride_busstop ( Last six runs Oct2020 Sep2020 )

---------- Differences in errors ----------
1,1800c1,5
< Warning: Person 'personFlow_0.0' aborted waiting for ANY at busStop 'busStop'.
< Warning: Person 'personFlow_0.1' aborted waiting for ANY at busStop 'busStop'.
< Warning: Person 'personFlow_0.2' aborted waiting for ANY at busStop 'busStop'.
< Warning: Person 'personFlow_0.3' aborted waiting for ANY at busStop 'busStop'.
< Warning: Person 'personFlow_0.4' aborted waiting for ANY at busStop 'busStop'.
< Warning: Person 'personFlow_0.5' aborted waiting for ANY at busStop 'busStop'.
< Warning: Person 'personFlow_0.6' aborted waiting for ANY at busStop 'busStop'.
< Warning: Person 'personFlow_0.7' aborted waiting for ANY at busStop 'busStop'.
< Warning: Person 'personFlow_0.8' aborted waiting for ANY at busStop 'busStop'.
< Warning: Person 'personFlow_0.9' aborted waiting for ANY at busStop 'busStop'.
< Warning: Person 'personFlow_0.10' aborted waiting for ANY at busStop 'busStop'.
< Warning: Person 'personFlow_0.11' aborted waiting for ANY at busStop 'busStop'.
< Warning: Person 'personFlow_0.12' aborted waiting for ANY at busStop 'busStop'.
< Warning: Person 'personFlow_0.13' aborted waiting for ANY at busStop 'busStop'.
< Warning: Person 'personFlow_0.14' aborted waiting for ANY at busStop 'busStop'.
< Warning: Person 'personFlow_0.15' aborted waiting for ANY at busStop 'busStop'.
< Warning: Person 'personFlow_0.16' aborted waiting for ANY at busStop 'busStop'.
< Warning: Person 'personFlow_0.17' aborted waiting for ANY at busStop 'busStop'.
< Warning: Person 'personFlow_0.18' aborted waiting for ANY at busStop 'busStop'.
< Warning: Person 'personFlow_0.19' aborted waiting for ANY at busStop 'busStop'.
< Warning: Person 'personFlow_0.20' aborted waiting for ANY at busStop 'busStop'.
< Warning: Person 'personFlow_0.21' aborted waiting for ANY at busStop 'busStop'.
< Warning: Person 'personFlow_0.22' aborted waiting for ANY at busStop 'busStop'.
< Warning: Person 'personFlow_0.23' aborted waiting for ANY at busStop 'busStop'.
< Warning: Person 'personFlow_0.24' aborted waiting for ANY at busStop 'busStop'.
< Warning: Person 'personFlow_0.25' aborted waiting for ANY at busStop 'busStop'.
< Warning: Person 'personFlow_0.26' aborted waiting for ANY at busStop 'busStop'.
< Warning: Person 'personFlow_0.27' aborted waiting for ANY at busStop 'busStop'.
< Warning: Person 'personFlow_0.28' aborted waiting for ANY at busStop 'busStop'.
<truncated after showing first 30 lines>
---------- New result in exitcode ----------
1

TEST FAILED on ts-sim-winbuild-ba : demandElements personFlow create default_walk default_walk_edges ( Last six runs Oct2020 Sep2020 )

---------- Differences in errors ----------
0a1,5
> Error: attribute 'vehsPerHour' is not declared for element 'personFlow'
>  In file 'routes.netedit'
>  At line/column 58/84.
> 
> Quitting (on error).
---------- New result in exitcode ----------
1

TEST FAILED on ts-sim-winbuild-ba : demandElements personFlow create departPos ( Last six runs Oct2020 Sep2020 )

---------- Differences in errors ----------
1c1,5
< Warning: Invalid departPos 5000.00 given for stopping at gneE2. Using edge end instead.
---
> Error: attribute 'vehsPerHour' is not declared for element 'personFlow'
>  In file 'routes.netedit'
>  At line/column 58/103.
> 
> Quitting (on error).
---------- New result in exitcode ----------
1

2 TESTS FAILED on ts-sim-winbuild-ba :

---------- New result in errors ----------
Error: Attribute 'expected' in definition of a stop is empty.
---------- Missing result in exitcode ----------
1
demandElements stop stopBusStop load expected ( Last six runs Oct2020 Sep2020 )
demandElements stop stopContainerStop load expected ( Last six runs Oct2020 Sep2020 )

TEST FAILED on ts-sim-winbuild-ba : demandElements stop stopChargingStation load expected ( Last six runs Oct2020 Sep2020 )

---------- New result in errors ----------
Error: Attribute 'expected' in definition of a stop is empty.
Warning: Teleporting vehicle 'flow.2'; waited too long (wrong lane), lane='gneE0_0', time=310.00.
Warning: Vehicle 'flow.2' skips stop on lane 'gneE0_0' time=310.00.
Warning: Vehicle 'flow.2' skips stop on lane 'gneE0_0' time=310.00.
Warning: Vehicle 'flow.2' skips stop on lane 'gneE0_0' time=310.00.
Warning: Vehicle 'flow.2' skips stop on lane 'gneE0_0' time=310.00.
Warning: Vehicle 'flow.2' ends teleporting on edge 'gneE1', time 310.00.
Warning: Teleporting vehicle 'flow.3'; waited too long (wrong lane), lane='gneE0_0', time=611.00.
Warning: Vehicle 'flow.3' skips stop on lane 'gneE0_0' time=611.00.
Warning: Vehicle 'flow.3' skips stop on lane 'gneE0_0' time=611.00.
Warning: Vehicle 'flow.3' skips stop on lane 'gneE0_0' time=611.00.
Warning: Vehicle 'flow.3' skips stop on lane 'gneE0_0' time=611.00.
Warning: Vehicle 'flow.3' ends teleporting on edge 'gneE1', time 611.00.
Warning: Teleporting vehicle 'flow.4'; waited too long (wrong lane), lane='gneE0_0', time=912.00.
Warning: Vehicle 'flow.4' skips stop on lane 'gneE0_0' time=912.00.
Warning: Vehicle 'flow.4' skips stop on lane 'gneE0_0' time=912.00.
Warning: Vehicle 'flow.4' skips stop on lane 'gneE0_0' time=912.00.
Warning: Vehicle 'flow.4' skips stop on lane 'gneE0_0' time=912.00.
Warning: Vehicle 'flow.4' ends teleporting on edge 'gneE1', time 912.00.
Warning: Teleporting vehicle 'flow.5'; waited too long (wrong lane), lane='gneE0_0', time=1213.00.
Warning: Vehicle 'flow.5' skips stop on lane 'gneE0_0' time=1213.00.
Warning: Vehicle 'flow.5' skips stop on lane 'gneE0_0' time=1213.00.
Warning: Vehicle 'flow.5' skips stop on lane 'gneE0_0' time=1213.00.
Warning: Vehicle 'flow.5' skips stop on lane 'gneE0_0' time=1213.00.
Warning: Vehicle 'flow.5' ends teleporting on edge 'gneE1', time 1213.00.
---------- Missing result in exitcode ----------
1

3 TESTS FAILED on ts-sim-winbuild-ba :

---------- Differences in errors ----------
0a1,5
> Error: Expected end of tag 'route'
>  In file 'routes.netedit'
>  At line/column 67/7.
> 
> Quitting (on error).
---------- New result in exitcode ----------
1
demandElements stop stopChargingStation volatileRecomputing ( Last six runs Oct2020 Sep2020 )
demandElements stop stopContainerStop volatileRecomputing ( Last six runs Oct2020 Sep2020 )
demandElements stop stopParkingArea volatileRecomputing ( Last six runs Oct2020 Sep2020 )

TEST FAILED on ts-sim-winbuild-ba : demandElements stop stopParkingArea load expected ( Last six runs Oct2020 Sep2020 )

---------- New result in errors ----------
Error: Attribute 'expected' in definition of a stop is empty.
Warning: Teleporting vehicle 'vehicle_0'; waited too long (wrong lane), lane='gneE0_0', time=304.00.
Warning: Vehicle 'vehicle_0' skips stop on lane 'gneE0_0' time=304.00.
Warning: Vehicle 'vehicle_0' skips stop on lane 'gneE0_0' time=304.00.
Warning: Vehicle 'vehicle_0' skips stop on lane 'gneE0_0' time=304.00.
Warning: Vehicle 'vehicle_0' skips stop on lane 'gneE0_0' time=304.00.
Warning: Vehicle 'vehicle_0' ends teleporting on edge 'gneE1', time 304.00.
---------- Missing result in exitcode ----------
1

TEST FAILED on ts-sim-winbuild-ba : demandElements trip inspect from ( Last six runs Oct2020 Sep2020 )

---------- Differences in errors ----------
0a1,4
> Warning: No connection between edge 'gneE8' and edge 'gneE5' found.
> Warning: No route for vehicle 'vehicle_0' found.
> Error: Vehicle 'vehicle_0' has no valid route.
> Quitting (on error).
---------- New result in exitcode ----------
1

TEST FAILED on ts-sim-winbuild-ba : demandElements trip inspect via ( Last six runs Oct2020 Sep2020 )

---------- Differences in errors ----------
0a1,3
> Warning: No connection between edge 'gneE2' and edge 'gneE8' found.
> Error: Vehicle 'vehicle_0' has no valid route from edge 'gneE2' to stop edge 'gneE8'.
> Quitting (on error).
---------- New result in exitcode ----------
1

TEST FAILED on ts-sim-winbuild-ba : demandElements vehicle_embedded create default_continuous ( Last six runs Oct2020 Sep2020 )

---------- Differences in errors ----------
0a1,2
> Error: Vehicle 'vehicle_0' has no valid route. No connection between edge 'gneE4' and edge 'gneE4'.
> Quitting (on error).
---------- New result in exitcode ----------
1

TEST FAILED on ts-sim-winbuild-ba : demandElements vehicle_embedded load departSpeed ( Last six runs Oct2020 Sep2020 )

---------- Differences in errors ----------
0a1,2
> Error: Departure speed for vehicle 'vehicle_3' is too high for the vehicle type 'DEFAULT_VEHTYPE'.
> Quitting (on error).
---------- New result in exitcode ----------
1

TEST FAILED on ts-sim-winbuild-ba : demandElements vehicle_embedded load route ( Last six runs Oct2020 Sep2020 )

---------- Differences in errors ----------
0a1,2
> Error: Vehicle 'vehicle_2' has no valid route. No connection between edge 'gneE2' and edge 'gneE5'.
> Quitting (on error).
---------- New result in exitcode ----------
1

17 TESTS FAILED on ts-sim-winbuild-ba :

---------- Differences in errors ----------
1,9d0
< The number of lanes needs to be specified in the attributes of carFollowing-CC with the "lanesCount" attribute
< Error: The number of lanes needs to be specified in the attributes of carFollowing-CC with the "lanesCount" attribute
< The number of lanes needs to be specified in the attributes of carFollowing-CC with the "lanesCount" attribute
< Error: The number of lanes needs to be specified in the attributes of carFollowing-CC with the "lanesCount" attribute
< The number of lanes needs to be specified in the attributes of carFollowing-CC with the "lanesCount" attribute
< Error: The number of lanes needs to be specified in the attributes of carFollowing-CC with the "lanesCount" attribute
< The number of lanes needs to be specified in the attributes of carFollowing-CC with the "lanesCount" attribute
< Error: The number of lanes needs to be specified in the attributes of carFollowing-CC with the "lanesCount" attribute
< The number of lanes needs to be specified in the attributes of carFollowing-CC with the "lanesCount" attribute
10a2
> Quitting (on error).
---------- New result in exitcode ----------
1
demandElements vehicletype load carfollowingmodel_params cf_cc_c1 ( Last six runs Oct2020 Sep2020 )
demandElements vehicletype load carfollowingmodel_params cf_cc_ccaccel ( Last six runs Oct2020 Sep2020 )
demandElements vehicletype load carfollowingmodel_params cf_cc_ccdecel ( Last six runs Oct2020 Sep2020 )
demandElements vehicletype load carfollowingmodel_params cf_cc_constspacing ( Last six runs Oct2020 Sep2020 )
demandElements vehicletype load carfollowingmodel_params cf_cc_flatbed_d ( Last six runs Oct2020 Sep2020 )
demandElements vehicletype load carfollowingmodel_params cf_cc_flatbed_h ( Last six runs Oct2020 Sep2020 )
demandElements vehicletype load carfollowingmodel_params cf_cc_flatbed_ka ( Last six runs Oct2020 Sep2020 )
demandElements vehicletype load carfollowingmodel_params cf_cc_flatbed_kp ( Last six runs Oct2020 Sep2020 )
demandElements vehicletype load carfollowingmodel_params cf_cc_flatbed_kv ( Last six runs Oct2020 Sep2020 )
demandElements vehicletype load carfollowingmodel_params cf_cc_kp ( Last six runs Oct2020 Sep2020 )
demandElements vehicletype load carfollowingmodel_params cf_cc_lambda ( Last six runs Oct2020 Sep2020 )
demandElements vehicletype load carfollowingmodel_params cf_cc_omegan ( Last six runs Oct2020 Sep2020 )
demandElements vehicletype load carfollowingmodel_params cf_cc_ploeg_h ( Last six runs Oct2020 Sep2020 )
demandElements vehicletype load carfollowingmodel_params cf_cc_ploeg_kd ( Last six runs Oct2020 Sep2020 )
demandElements vehicletype load carfollowingmodel_params cf_cc_ploeg_kp ( Last six runs Oct2020 Sep2020 )
demandElements vehicletype load carfollowingmodel_params cf_cc_tau ( Last six runs Oct2020 Sep2020 )
demandElements vehicletype load carfollowingmodel_params cf_cc_xi ( Last six runs Oct2020 Sep2020 )

TEST FAILED on ts-sim-winbuild-ba : demandElements vehicletype load carfollowingmodel_params cf_cc_lanes_count ( Last six runs Oct2020 Sep2020 )

---------- Differences in errors ----------
1d0
< The number of lanes needs to be specified in the attributes of carFollowing-CC with the "lanesCount" attribute
2a2
> Quitting (on error).
---------- New result in exitcode ----------
1

Detailed information for the tests that had known bugs:

TEST had known bugs (#5893) on ts-sim-winbuild-ba : additionalElements access volatileRecomputing ( Last six runs Oct2020 Sep2020 )

See #5893
(This bug was triggered by text found in file 'errors' matching 'Warning: Ignoring invalid access from non-pedestrian lane')
---------- Differences in errors ----------
0a1,9
> Warning: Ignoring invalid access from non-pedestrian lane 'gneE2_1' in busStop 'busStop_gneE1_0_2'.
> Warning: Ignoring invalid access from non-pedestrian lane 'gneE1_1' in busStop 'busStop_gneE1_0_2'.
> Warning: Ignoring invalid access from non-pedestrian lane 'gneE0_1' in busStop 'busStop_gneE1_0_2'.
> Warning: Ignoring invalid access from non-pedestrian lane 'gneE2_3' in busStop 'busStop_gneE2_0_5'.
> Warning: Ignoring invalid access from non-pedestrian lane 'gneE1_1' in busStop 'busStop_gneE2_0_5'.
> Warning: Ignoring invalid access from non-pedestrian lane 'gneE0_1' in busStop 'busStop_gneE2_0_5'.
> Warning: Ignoring invalid access from non-pedestrian lane 'gneE2_3' in busStop 'busStop_gneE4_0_0'.
> Warning: Ignoring invalid access from non-pedestrian lane 'gneE1_1' in busStop 'busStop_gneE4_0_0'.
> Warning: Ignoring invalid access from non-pedestrian lane 'gneE0_1' in busStop 'busStop_gneE4_0_0'.

234 TESTS had known bugs (Test needed #3045) on ts-sim-winbuild-ba :

#3045
(This bug was triggered by text found in file 'errors' matching 'File 'net.netedit' is not accessible')
---------- New result in errors ----------
Error: File 'net.netedit' is not accessible (No such file or directory).
Quitting (on error).
additionalElements busstop create parkingLength ( Last six runs Oct2020 Sep2020 )
additionalElements busstop inspect parkingLength ( Last six runs Oct2020 Sep2020 )
additionalElements busstop inspect_selection parkingLength ( Last six runs Oct2020 Sep2020 )
additionalElements busstop load parkingLength ( Last six runs Oct2020 Sep2020 )
additionalElements calibrator create id ( Last six runs Oct2020 Sep2020 )
additionalElements e2detector create id ( Last six runs Oct2020 Sep2020 )
additionalElements lanecalibrator create id ( Last six runs Oct2020 Sep2020 )
additionalElements parkingarea create id ( Last six runs Oct2020 Sep2020 )
additionalElements routeprobe create id ( Last six runs Oct2020 Sep2020 )
demandElements flow create begin ( Last six runs Oct2020 Sep2020 )
demandElements flow create end ( Last six runs Oct2020 Sep2020 )
demandElements flow create id ( Last six runs Oct2020 Sep2020 )
demandElements flow create number ( Last six runs Oct2020 Sep2020 )
demandElements flow create period ( Last six runs Oct2020 Sep2020 )
demandElements flow create probability ( Last six runs Oct2020 Sep2020 )
demandElements flow create vehsPerHour ( Last six runs Oct2020 Sep2020 )
demandElements flow fix ( Last six runs Oct2020 Sep2020 )
demandElements flow inspect begin ( Last six runs Oct2020 Sep2020 )
demandElements flow inspect end ( Last six runs Oct2020 Sep2020 )
demandElements flow inspect number ( Last six runs Oct2020 Sep2020 )
demandElements flow inspect period ( Last six runs Oct2020 Sep2020 )
demandElements flow inspect probability ( Last six runs Oct2020 Sep2020 )
demandElements flow inspect vehsPerHour ( Last six runs Oct2020 Sep2020 )
demandElements flow inspect_selection begin ( Last six runs Oct2020 Sep2020 )
demandElements flow inspect_selection end ( Last six runs Oct2020 Sep2020 )
demandElements flow inspect_selection number ( Last six runs Oct2020 Sep2020 )
demandElements flow inspect_selection period ( Last six runs Oct2020 Sep2020 )
demandElements flow inspect_selection probability ( Last six runs Oct2020 Sep2020 )
demandElements flow inspect_selection type ( Last six runs Oct2020 Sep2020 )
demandElements flow inspect_selection vehsPerHour ( Last six runs Oct2020 Sep2020 )
demandElements flow_embedded create begin ( Last six runs Oct2020 Sep2020 )
demandElements flow_embedded create end ( Last six runs Oct2020 Sep2020 )
demandElements flow_embedded create id ( Last six runs Oct2020 Sep2020 )
demandElements flow_embedded create number ( Last six runs Oct2020 Sep2020 )
demandElements flow_embedded create period ( Last six runs Oct2020 Sep2020 )
demandElements flow_embedded create probability ( Last six runs Oct2020 Sep2020 )
demandElements flow_embedded create vehsPerHour ( Last six runs Oct2020 Sep2020 )
demandElements flow_embedded fix ( Last six runs Oct2020 Sep2020 )
demandElements flow_embedded inspect begin ( Last six runs Oct2020 Sep2020 )
demandElements flow_embedded inspect end ( Last six runs Oct2020 Sep2020 )
demandElements flow_embedded inspect number ( Last six runs Oct2020 Sep2020 )
demandElements flow_embedded inspect period ( Last six runs Oct2020 Sep2020 )
demandElements flow_embedded inspect probability ( Last six runs Oct2020 Sep2020 )
demandElements flow_embedded inspect vehsPerHour ( Last six runs Oct2020 Sep2020 )
demandElements flow_embedded inspect_selection begin ( Last six runs Oct2020 Sep2020 )
demandElements flow_embedded inspect_selection end ( Last six runs Oct2020 Sep2020 )
demandElements flow_embedded inspect_selection number ( Last six runs Oct2020 Sep2020 )
demandElements flow_embedded inspect_selection period ( Last six runs Oct2020 Sep2020 )
demandElements flow_embedded inspect_selection probability ( Last six runs Oct2020 Sep2020 )
demandElements flow_embedded inspect_selection type ( Last six runs Oct2020 Sep2020 )
demandElements flow_embedded inspect_selection vehsPerHour ( Last six runs Oct2020 Sep2020 )
demandElements person create id ( Last six runs Oct2020 Sep2020 )
demandElements person fix ( Last six runs Oct2020 Sep2020 )
demandElements person inspect ( Last six runs Oct2020 Sep2020 )
demandElements person inspect_selection ( Last six runs Oct2020 Sep2020 )
demandElements person load ( Last six runs Oct2020 Sep2020 )
demandElements person volatileRecomputing ( Last six runs Oct2020 Sep2020 )
demandElements personFlow create begin ( Last six runs Oct2020 Sep2020 )
demandElements personFlow create end ( Last six runs Oct2020 Sep2020 )
demandElements personFlow create id ( Last six runs Oct2020 Sep2020 )
demandElements personFlow create number ( Last six runs Oct2020 Sep2020 )
demandElements personFlow create period ( Last six runs Oct2020 Sep2020 )
demandElements personFlow create probability ( Last six runs Oct2020 Sep2020 )
demandElements personFlow create vehsPerHour ( Last six runs Oct2020 Sep2020 )
demandElements personFlow fix ( Last six runs Oct2020 Sep2020 )
demandElements personFlow inspect ( Last six runs Oct2020 Sep2020 )
demandElements personFlow inspect_selection ( Last six runs Oct2020 Sep2020 )
demandElements personFlow load ( Last six runs Oct2020 Sep2020 )
demandElements personFlow volatileRecomputing ( Last six runs Oct2020 Sep2020 )
demandElements route create_consecutive id ( Last six runs Oct2020 Sep2020 )
demandElements route create_nonconsecutive id ( Last six runs Oct2020 Sep2020 )
demandElements routeflow create begin ( Last six runs Oct2020 Sep2020 )
demandElements routeflow create end ( Last six runs Oct2020 Sep2020 )
demandElements routeflow create id ( Last six runs Oct2020 Sep2020 )
demandElements routeflow create number ( Last six runs Oct2020 Sep2020 )
demandElements routeflow create period ( Last six runs Oct2020 Sep2020 )
demandElements routeflow create probability ( Last six runs Oct2020 Sep2020 )
demandElements routeflow create vehsPerHour ( Last six runs Oct2020 Sep2020 )
demandElements routeflow fix ( Last six runs Oct2020 Sep2020 )
demandElements routeflow inspect begin ( Last six runs Oct2020 Sep2020 )
demandElements routeflow inspect end ( Last six runs Oct2020 Sep2020 )
demandElements routeflow inspect number ( Last six runs Oct2020 Sep2020 )
demandElements routeflow inspect period ( Last six runs Oct2020 Sep2020 )
demandElements routeflow inspect probability ( Last six runs Oct2020 Sep2020 )
demandElements routeflow inspect vehsPerHour ( Last six runs Oct2020 Sep2020 )
demandElements routeflow inspect_selection begin ( Last six runs Oct2020 Sep2020 )
demandElements routeflow inspect_selection end ( Last six runs Oct2020 Sep2020 )
demandElements routeflow inspect_selection number ( Last six runs Oct2020 Sep2020 )
demandElements routeflow inspect_selection period ( Last six runs Oct2020 Sep2020 )
demandElements routeflow inspect_selection probability ( Last six runs Oct2020 Sep2020 )
demandElements routeflow inspect_selection type ( Last six runs Oct2020 Sep2020 )
demandElements routeflow inspect_selection vehsPerHour ( Last six runs Oct2020 Sep2020 )
demandElements stop stopLane inspect endPos ( Last six runs Oct2020 Sep2020 )
demandElements stop stopLane inspect startPos ( Last six runs Oct2020 Sep2020 )
demandElements trip create id ( Last six runs Oct2020 Sep2020 )
demandElements trip fix ( Last six runs Oct2020 Sep2020 )
demandElements trip inspect_selection type ( Last six runs Oct2020 Sep2020 )
demandElements vehicle create id ( Last six runs Oct2020 Sep2020 )
demandElements vehicle fix ( Last six runs Oct2020 Sep2020 )
demandElements vehicle inspect_selection type ( Last six runs Oct2020 Sep2020 )
demandElements vehicle_embedded create id ( Last six runs Oct2020 Sep2020 )
demandElements vehicle_embedded fix ( Last six runs Oct2020 Sep2020 )
demandElements vehicle_embedded inspect_selection type ( Last six runs Oct2020 Sep2020 )
demandElements vehicletype copy ( Last six runs Oct2020 Sep2020 )
demandElements vehicletype create basic accel ( Last six runs Oct2020 Sep2020 )
demandElements vehicletype create basic color ( Last six runs Oct2020 Sep2020 )
demandElements vehicletype create basic decel ( Last six runs Oct2020 Sep2020 )
demandElements vehicletype create basic default ( Last six runs Oct2020 Sep2020 )
demandElements vehicletype create basic id ( Last six runs Oct2020 Sep2020 )
demandElements vehicletype create basic length ( Last six runs Oct2020 Sep2020 )
demandElements vehicletype create basic maxspeed ( Last six runs Oct2020 Sep2020 )
demandElements vehicletype create basic mingap ( Last six runs Oct2020 Sep2020 )
demandElements vehicletype create basic sigma ( Last six runs Oct2020 Sep2020 )
demandElements vehicletype create basic tau ( Last six runs Oct2020 Sep2020 )
demandElements vehicletype create basic vclass ( Last six runs Oct2020 Sep2020 )
demandElements vehicletype create dialog actionStepLength ( Last six runs Oct2020 Sep2020 )
demandElements vehicletype create dialog boardingduration ( Last six runs Oct2020 Sep2020 )
demandElements vehicletype create dialog carfollowingmodel ( Last six runs Oct2020 Sep2020 )
demandElements vehicletype create dialog carfollowingmodel_params accel ( Last six runs Oct2020 Sep2020 )
demandElements vehicletype create dialog carfollowingmodel_params apparentdecel ( Last six runs Oct2020 Sep2020 )
demandElements vehicletype create dialog carfollowingmodel_params ca_gain_gap_cacc ( Last six runs Oct2020 Sep2020 )
demandElements vehicletype create dialog carfollowingmodel_params ca_gain_gap_dot_cacc ( Last six runs Oct2020 Sep2020 )
demandElements vehicletype create dialog carfollowingmodel_params ca_gain_space ( Last six runs Oct2020 Sep2020 )
demandElements vehicletype create dialog carfollowingmodel_params ca_gain_speed ( Last six runs Oct2020 Sep2020 )
demandElements vehicletype create dialog carfollowingmodel_params cf_cc_c1 ( Last six runs Oct2020 Sep2020 )
demandElements vehicletype create dialog carfollowingmodel_params cf_cc_ccaccel ( Last six runs Oct2020 Sep2020 )
demandElements vehicletype create dialog carfollowingmodel_params cf_cc_ccdecel ( Last six runs Oct2020 Sep2020 )
demandElements vehicletype create dialog carfollowingmodel_params cf_cc_constspacing ( Last six runs Oct2020 Sep2020 )
demandElements vehicletype create dialog carfollowingmodel_params cf_cc_flatbed_d ( Last six runs Oct2020 Sep2020 )
demandElements vehicletype create dialog carfollowingmodel_params cf_cc_flatbed_h ( Last six runs Oct2020 Sep2020 )
demandElements vehicletype create dialog carfollowingmodel_params cf_cc_flatbed_ka ( Last six runs Oct2020 Sep2020 )
demandElements vehicletype create dialog carfollowingmodel_params cf_cc_flatbed_kp ( Last six runs Oct2020 Sep2020 )
demandElements vehicletype create dialog carfollowingmodel_params cf_cc_flatbed_kv ( Last six runs Oct2020 Sep2020 )
demandElements vehicletype create dialog carfollowingmodel_params cf_cc_kp ( Last six runs Oct2020 Sep2020 )
demandElements vehicletype create dialog carfollowingmodel_params cf_cc_lambda ( Last six runs Oct2020 Sep2020 )
demandElements vehicletype create dialog carfollowingmodel_params cf_cc_lanes_count ( Last six runs Oct2020 Sep2020 )
demandElements vehicletype create dialog carfollowingmodel_params cf_cc_omegan ( Last six runs Oct2020 Sep2020 )
demandElements vehicletype create dialog carfollowingmodel_params cf_cc_ploeg_h ( Last six runs Oct2020 Sep2020 )
demandElements vehicletype create dialog carfollowingmodel_params cf_cc_ploeg_kd ( Last six runs Oct2020 Sep2020 )
demandElements vehicletype create dialog carfollowingmodel_params cf_cc_ploeg_kp ( Last six runs Oct2020 Sep2020 )
demandElements vehicletype create dialog carfollowingmodel_params cf_cc_tau ( Last six runs Oct2020 Sep2020 )
demandElements vehicletype create dialog carfollowingmodel_params cf_cc_xi ( Last six runs Oct2020 Sep2020 )
demandElements vehicletype create dialog carfollowingmodel_params cf_idm_delta ( Last six runs Oct2020 Sep2020 )
demandElements vehicletype create dialog carfollowingmodel_params cf_idm_stepping ( Last six runs Oct2020 Sep2020 )
demandElements vehicletype create dialog carfollowingmodel_params cf_idmm_adapt_factor ( Last six runs Oct2020 Sep2020 )
demandElements vehicletype create dialog carfollowingmodel_params cf_idmm_adapt_time ( Last six runs Oct2020 Sep2020 )
demandElements vehicletype create dialog carfollowingmodel_params cf_kerner_phi ( Last six runs Oct2020 Sep2020 )
demandElements vehicletype create dialog carfollowingmodel_params cf_pwagner2009_approb ( Last six runs Oct2020 Sep2020 )
demandElements vehicletype create dialog carfollowingmodel_params cf_pwagner2009_taulast ( Last six runs Oct2020 Sep2020 )
demandElements vehicletype create dialog carfollowingmodel_params cf_w99_cc1 ( Last six runs Oct2020 Sep2020 )
demandElements vehicletype create dialog carfollowingmodel_params cf_w99_cc2 ( Last six runs Oct2020 Sep2020 )
demandElements vehicletype create dialog carfollowingmodel_params cf_w99_cc3 ( Last six runs Oct2020 Sep2020 )
demandElements vehicletype create dialog carfollowingmodel_params cf_w99_cc4 ( Last six runs Oct2020 Sep2020 )
demandElements vehicletype create dialog carfollowingmodel_params cf_w99_cc5 ( Last six runs Oct2020 Sep2020 )
demandElements vehicletype create dialog carfollowingmodel_params cf_w99_cc6 ( Last six runs Oct2020 Sep2020 )
demandElements vehicletype create dialog carfollowingmodel_params cf_w99_cc7 ( Last six runs Oct2020 Sep2020 )
demandElements vehicletype create dialog carfollowingmodel_params cf_w99_cc8 ( Last six runs Oct2020 Sep2020 )
demandElements vehicletype create dialog carfollowingmodel_params cf_w99_cc9 ( Last six runs Oct2020 Sep2020 )
demandElements vehicletype create dialog carfollowingmodel_params cf_wiedemann_estimation ( Last six runs Oct2020 Sep2020 )
demandElements vehicletype create dialog carfollowingmodel_params cf_wiedemann_security ( Last six runs Oct2020 Sep2020 )
demandElements vehicletype create dialog carfollowingmodel_params collision_mingap_factor ( Last six runs Oct2020 Sep2020 )
demandElements vehicletype create dialog carfollowingmodel_params decel ( Last six runs Oct2020 Sep2020 )
demandElements vehicletype create dialog carfollowingmodel_params emergencydecel ( Last six runs Oct2020 Sep2020 )
demandElements vehicletype create dialog carfollowingmodel_params gc_gain_gap_cacc ( Last six runs Oct2020 Sep2020 )
demandElements vehicletype create dialog carfollowingmodel_params gc_gain_gap_dot_cacc ( Last six runs Oct2020 Sep2020 )
demandElements vehicletype create dialog carfollowingmodel_params gc_gain_space ( Last six runs Oct2020 Sep2020 )
demandElements vehicletype create dialog carfollowingmodel_params gc_gain_speed ( Last six runs Oct2020 Sep2020 )
demandElements vehicletype create dialog carfollowingmodel_params gcc_gain_gap_cacc ( Last six runs Oct2020 Sep2020 )
demandElements vehicletype create dialog carfollowingmodel_params gcc_gain_gap_dot_cacc ( Last six runs Oct2020 Sep2020 )
demandElements vehicletype create dialog carfollowingmodel_params gcc_gain_space ( Last six runs Oct2020 Sep2020 )
demandElements vehicletype create dialog carfollowingmodel_params gcc_gain_speed ( Last six runs Oct2020 Sep2020 )
demandElements vehicletype create dialog carfollowingmodel_params headway_time_cacc_to_acc ( Last six runs Oct2020 Sep2020 )
demandElements vehicletype create dialog carfollowingmodel_params k ( Last six runs Oct2020 Sep2020 )
demandElements vehicletype create dialog carfollowingmodel_params sc_gain ( Last six runs Oct2020 Sep2020 )
demandElements vehicletype create dialog carfollowingmodel_params sc_gain_cacc ( Last six runs Oct2020 Sep2020 )
demandElements vehicletype create dialog carfollowingmodel_params sigma ( Last six runs Oct2020 Sep2020 )
demandElements vehicletype create dialog carfollowingmodel_params tau ( Last six runs Oct2020 Sep2020 )
demandElements vehicletype create dialog carfollowingmodel_params tmp1 ( Last six runs Oct2020 Sep2020 )
demandElements vehicletype create dialog carfollowingmodel_params tmp2 ( Last six runs Oct2020 Sep2020 )
demandElements vehicletype create dialog carfollowingmodel_params tmp3 ( Last six runs Oct2020 Sep2020 )
demandElements vehicletype create dialog carfollowingmodel_params tmp4 ( Last six runs Oct2020 Sep2020 )
demandElements vehicletype create dialog carfollowingmodel_params tmp5 ( Last six runs Oct2020 Sep2020 )
demandElements vehicletype create dialog carfollowingmodel_params train_type ( Last six runs Oct2020 Sep2020 )
demandElements vehicletype create dialog color ( Last six runs Oct2020 Sep2020 )
demandElements vehicletype create dialog containercapacity ( Last six runs Oct2020 Sep2020 )
demandElements vehicletype create dialog default ( Last six runs Oct2020 Sep2020 )
demandElements vehicletype create dialog emissionclass ( Last six runs Oct2020 Sep2020 )
demandElements vehicletype create dialog guishape ( Last six runs Oct2020 Sep2020 )
demandElements vehicletype create dialog id ( Last six runs Oct2020 Sep2020 )
demandElements vehicletype create dialog imgfile ( Last six runs Oct2020 Sep2020 )
demandElements vehicletype create dialog impatience ( Last six runs Oct2020 Sep2020 )
demandElements vehicletype create dialog junctionmodel_params jm_crossing_gap ( Last six runs Oct2020 Sep2020 )
demandElements vehicletype create dialog junctionmodel_params jm_drive_after_red_time ( Last six runs Oct2020 Sep2020 )
demandElements vehicletype create dialog junctionmodel_params jm_drive_after_yellow_time ( Last six runs Oct2020 Sep2020 )
demandElements vehicletype create dialog junctionmodel_params jm_drive_red_speed ( Last six runs Oct2020 Sep2020 )
demandElements vehicletype create dialog junctionmodel_params jm_ignore_foe_prob ( Last six runs Oct2020 Sep2020 )
demandElements vehicletype create dialog junctionmodel_params jm_ignore_foe_speed ( Last six runs Oct2020 Sep2020 )
demandElements vehicletype create dialog junctionmodel_params jm_ignore_keep_clear_time ( Last six runs Oct2020 Sep2020 )
demandElements vehicletype create dialog junctionmodel_params jm_sigma_minor ( Last six runs Oct2020 Sep2020 )
demandElements vehicletype create dialog junctionmodel_params jm_timegap_minor ( Last six runs Oct2020 Sep2020 )
demandElements vehicletype create dialog lanechangemodel ( Last six runs Oct2020 Sep2020 )
demandElements vehicletype create dialog lanechangemodel_params lc_accel_lat ( Last six runs Oct2020 Sep2020 )
demandElements vehicletype create dialog lanechangemodel_params lc_assertive ( Last six runs Oct2020 Sep2020 )
demandElements vehicletype create dialog lanechangemodel_params lc_cooperative ( Last six runs Oct2020 Sep2020 )
demandElements vehicletype create dialog lanechangemodel_params lc_impatience ( Last six runs Oct2020 Sep2020 )
demandElements vehicletype create dialog lanechangemodel_params lc_keep_right ( Last six runs Oct2020 Sep2020 )
demandElements vehicletype create dialog lanechangemodel_params lc_lookahead_left ( Last six runs Oct2020 Sep2020 )
demandElements vehicletype create dialog lanechangemodel_params lc_max_speed_lat_factor ( Last six runs Oct2020 Sep2020 )
demandElements vehicletype create dialog lanechangemodel_params lc_max_speed_lat_standing ( Last six runs Oct2020 Sep2020 )
demandElements vehicletype create dialog lanechangemodel_params lc_opposite ( Last six runs Oct2020 Sep2020 )
demandElements vehicletype create dialog lanechangemodel_params lc_overtake_right ( Last six runs Oct2020 Sep2020 )
demandElements vehicletype create dialog lanechangemodel_params lc_pushy ( Last six runs Oct2020 Sep2020 )
demandElements vehicletype create dialog lanechangemodel_params lc_pushy_gap ( Last six runs Oct2020 Sep2020 )
demandElements vehicletype create dialog lanechangemodel_params lc_speed_gain ( Last six runs Oct2020 Sep2020 )
demandElements vehicletype create dialog lanechangemodel_params lc_speed_gain_right ( Last six runs Oct2020 Sep2020 )
demandElements vehicletype create dialog lanechangemodel_params lc_strategic ( Last six runs Oct2020 Sep2020 )
demandElements vehicletype create dialog lanechangemodel_params lc_sublane ( Last six runs Oct2020 Sep2020 )
demandElements vehicletype create dialog lanechangemodel_params lc_time_to_impatience ( Last six runs Oct2020 Sep2020 )
demandElements vehicletype create dialog lanechangemodel_params lc_turn_alignment_distance ( Last six runs Oct2020 Sep2020 )
demandElements vehicletype create dialog latalignment ( Last six runs Oct2020 Sep2020 )
demandElements vehicletype create dialog length ( Last six runs Oct2020 Sep2020 )
demandElements vehicletype create dialog loadingduration ( Last six runs Oct2020 Sep2020 )
demandElements vehicletype create dialog maxspeed ( Last six runs Oct2020 Sep2020 )
demandElements vehicletype create dialog maxspeedlat ( Last six runs Oct2020 Sep2020 )
demandElements vehicletype create dialog mingap ( Last six runs Oct2020 Sep2020 )
demandElements vehicletype create dialog mingaplat ( Last six runs Oct2020 Sep2020 )
demandElements vehicletype create dialog osgfile ( Last six runs Oct2020 Sep2020 )
demandElements vehicletype create dialog personcapacity ( Last six runs Oct2020 Sep2020 )
demandElements vehicletype create dialog speeddev ( Last six runs Oct2020 Sep2020 )
demandElements vehicletype create dialog speedfactor ( Last six runs Oct2020 Sep2020 )
demandElements vehicletype create dialog vclass ( Last six runs Oct2020 Sep2020 )
demandElements vehicletype create dialog width ( Last six runs Oct2020 Sep2020 )
netElements edges templates ( Last six runs Oct2020 Sep2020 )
selection basic contextual_menu ( Last six runs Oct2020 Sep2020 )

TEST had known bugs (Routeprobes #5941) on ts-sim-winbuild-ba : additionalElements calibrator inspect routeprobe ( Last six runs Oct2020 Sep2020 )

#5941
(This bug was triggered by text found in file 'errors' matching 'is not known')
---------- Differences in errors ----------
1c1,2
< Warning: No flow intervals in calibrator 'calibrator_gneE2_0'.
---
> Error: The routeProbe 'customRouteProbeName' to use within the calibrator 'calibrator_gneE2_0' is not known.
> Quitting (on error).
---------- New result in exitcode ----------
1

TEST had known bugs (Routeprobes #5941) on ts-sim-winbuild-ba : additionalElements calibrator load routeProbe ( Last six runs Oct2020 Sep2020 )

#5941
(This bug was triggered by text found in file 'errors' matching 'is not known')
---------- Differences in errors ----------
1c1
< Warning: No flow intervals in calibrator 'calibrator01'.
---
> Error: The routeProbe '%%$%$$$' to use within the calibrator 'calibrator01' is not known.
3a4
> Quitting (on error).
---------- New result in exitcode ----------
1

TEST had known bugs (Routeprobes #5941) on ts-sim-winbuild-ba : additionalElements lanecalibrator inspect routeprobe ( Last six runs Oct2020 Sep2020 )

#5941
(This bug was triggered by text found in file 'errors' matching 'is not known')
---------- Differences in errors ----------
1c1,2
< Warning: No flow intervals in calibrator 'laneCalibrator_gneE2_1_0'.
---
> Error: The routeProbe 'customRouteProbeName' to use within the calibrator 'laneCalibrator_gneE3_1_0' is not known.
> Quitting (on error).
---------- New result in exitcode ----------
1

TEST had known bugs (Routeprobes #5941) on ts-sim-winbuild-ba : additionalElements lanecalibrator load routeProbe ( Last six runs Oct2020 Sep2020 )

#5941
(This bug was triggered by text found in file 'errors' matching 'is not known')
---------- Differences in errors ----------
1c1
< Warning: No flow intervals in calibrator 'calibrator01'.
---
> Error: The routeProbe '%%$%$$$' to use within the calibrator 'calibrator01' is not known.
3c3,4
< Warning: No flow intervals in calibrator 'calibrator03'.
---
> Error: The routeProbe 'myRouteProbe' to use within the calibrator 'calibrator03' is not known.
> Quitting (on error).
---------- New result in exitcode ----------
1

TEST had known bugs (#5875) on ts-sim-winbuild-ba : demandElements routeflow load line ( Last six runs Oct2020 Sep2020 )

See #5875
(This bug was triggered by text found in file 'errors' matching 'Error: Attribute 'line' in definition of flow 'flow_1' is empty')
---------- Differences in errors ----------
0a1
> Error: Attribute 'line' in definition of flow 'flow_1' is empty.