13Oct19rv1_3_1+0586-b836e15250 - detailed test results for COMPLEX

To reconnect the TextTest GUI to these results, run:

texttestc.py -a complex -d C:/Users/delphi/Code/sumoInternal/git/tests -reconnect C:/Users/delphi/Code/sumoInternal/msvc12extrax64texttesttmp/msvc12extrax64.31Oct072229.21040 -g

To start TextTest for these tests, run:

texttestc.py -a complex -d C:/Users/delphi/Code/sumoInternal/git/tests

Total: 757 tests: 693 succeeded 36 known bugs 28 FAILED


libsumo.python3: 161 tests: 153 succeeded 6 known bugs 2 FAILED

Detailed information for the tests that FAILED:

TEST FAILED on ts-sim-winbuild-ba : traci pythonApi lane ( Last six runs Oct2019 )

---------- Differences in output ----------
14,15c14,16
< links [('2si_0', True, True, False, '', 'M', 's', 7.249827584156712), ('2si_1', True, True, False, '', 'M', 's', 4.459820624195518), ('2si_2', True, True, False, '', 'M', 's', 3.0)]
< shape ((1000.0, 501.65000000000003), (751.5, 501.65000000000003))
---
> links [('2si_0', True, True, False), ('2si_1', True, True, False), ('2si_2', True, True, False)]
> linksExtended [('2si_0', True, True, False, '', 'M', 's', 7.249827584156764), ('2si_1', True, True, False, '', 'M', 's', 4.45982062419556), ('2si_2', True, True, False, '', 'M', 's', 3.0)]
> shape ((1000.0, 501.65), (751.5, 501.65))
17,23c18,24
< CO2 3655.9332315441243
< CO 134.99569372949378
< HC 0.7001697688063016
< PMx 0.07689796956352524
< NOx 1.605517698575536
< Fuel 1.5715746576853664
< Noise 64.53183306655048
---
> CO2 4962.098029013955
> CO 148.4043943117062
> HC 0.793287746205698
> PMx 0.10689025015863887
> NOx 2.197042560996833
> Fuel 2.133021417095528
> Noise 68.96613013111516
25c26
< meanSpeed 3.1154472965048625
---
> meanSpeed 4.033343723951839
28c29
< traveltime 79.76382726126856
---
<truncated after showing first 30 lines>

TEST FAILED on ts-sim-winbuild-ba : traci pythonApi load ( Last six runs Oct2019 )

---------- Differences in output ----------
2,6c2,4
< Loading configuration... done.
< Loading configuration... done.
< step=1 departed=('horiz',)
< step=2 departed=()
< step=3 departed=()
---
> step=1.0 departed=('horiz',)
> step=2.0 departed=()
> step=3.0 departed=()

Detailed information for the tests that had known bugs:

TEST had known bugs (#4727) on ts-sim-winbuild-ba : traci ContextSubscriptionFilters leadFollow carFollowing ( Last six runs Oct2019 )

#4727
(This bug was triggered by text found in file 'output' matching '.')
---------- Differences in output ----------
4d3
< lead_straight
6d4
< [002] Context results for vehicle 'ego':
7a6
> [002] Context results for vehicle 'ego':
9d7
< [003] Context results for vehicle 'ego':
10a9
> [003] Context results for vehicle 'ego':
12d10
< [004] Context results for vehicle 'ego':
13a12
> [004] Context results for vehicle 'ego':
15d13
< [005] Context results for vehicle 'ego':
16a15
> [005] Context results for vehicle 'ego':
18d16
< [006] Context results for vehicle 'ego':
19a18
> [006] Context results for vehicle 'ego':
21d19
< [007] Context results for vehicle 'ego':
22a21
> [007] Context results for vehicle 'ego':
24d22
< [008] Context results for vehicle 'ego':
25a24
> [008] Context results for vehicle 'ego':
<truncated after showing first 30 lines>

2 TESTS had known bugs (#4727) on ts-sim-winbuild-ba :

#4727
(This bug was triggered by text found in file 'output' matching '.')
---------- Differences in output ----------
4a5
> follow_straight
7d7
< follow_straight
9a10
> follow_straight
12d12
< follow_straight
14a15
> follow_straight
17d17
< follow_straight
19a20
> follow_straight
22d22
< follow_straight
24a25
> follow_straight
27d27
< follow_straight
29a30
> follow_straight
32d32
< follow_straight
34a35
> follow_straight
37d37
< follow_straight
39a40
> follow_straight
<truncated after showing first 30 lines>
traci ContextSubscriptionFilters leadFollow laneChangeLeft ( Last six runs Oct2019 )
traci ContextSubscriptionFilters leadFollow laneChangeRight ( Last six runs Oct2019 )

TEST had known bugs (#4727) on ts-sim-winbuild-ba : traci ContextSubscriptionFilters leadFollow laneChangeNeighbors ( Last six runs Oct2019 )

#4727
(This bug was triggered by text found in file 'output' matching '.')
---------- Differences in output ----------
4,5d3
< follow_straight
< follow_right
6a5,7
> follow_right
> follow_straight
> lead_left
9d9
< lead_left
11,12d10
< follow_straight
< follow_right
13a12,14
> follow_right
> follow_straight
> lead_left
16d16
< lead_left
18,19d17
< follow_straight
< follow_right
20a19,21
> follow_right
> follow_straight
> lead_left
23d23
< lead_left
25,26d24
< follow_straight
< follow_right
<truncated after showing first 30 lines>

TEST had known bugs (see #3263) on ts-sim-winbuild-ba : traci pythonApi moveToXY keepRoute2 ( Last six runs Oct2019 )

mapping failure
(This bug was triggered by text found in file 'output' matching 'failed')
---------- Differences in output ----------
0a1,2
> internal corner (inside, segment2) failed: x=198, x2=198.0,   y=1.9, y2=1.9,   lane=middle_0, lane2=middle_0, pos=102, pos2=98.0   posLat=2.0 posLat2=1.9
> internal corner (outside, far) failed: x=203, x2=203.0,   y=-4, y2=-4.0,   lane=, lane2=middle_0, pos=-1073741824.0, pos2=100.0   posLat=-1073741824.0 posLat2=-1.4142135623730951

TEST had known bugs (see #5383) on ts-sim-winbuild-ba : traci pythonApi moveToXY permissions ( Last six runs Oct2019 )

mapping failure
(This bug was triggered by text found in file 'output' matching 'failed')
---------- Differences in output ----------
0a1,2
> shifted to left lane (permissions) failed: mode=2 x=40, x2=40.0,   y=-1.5, y2=-1.5,   lane=beg_1, lane2=, pos=40, pos2=-1073741824.0   posLat=0.0 posLat2=-1073741824.0
> right lane (ignore permissions) failed: mode=6 x=40, x2=40.0,   y=-1.6, y2=-1.6,   lane=beg_0, lane2=, pos=40, pos2=-1073741824.0   posLat=0.0 posLat2=-1073741824.0

meso: 298 tests: 275 succeeded 15 known bugs 8 FAILED

Detailed information for the tests that FAILED:

TEST FAILED on ts-sim-winbuild-ba : netconvert osm_roundtrip ( Last six runs Oct2019 )

---------- Differences in net ----------
22c22
<     <type id="highway.secondary" priority="11" numLanes="2" speed="27.78" disallow="tram rail_urban rail rail_electric rail_fast ship" oneway="0"/>
---
>     <type id="highway.secondary" priority="11" numLanes="1" speed="27.78" disallow="tram rail_urban rail rail_electric rail_fast ship" oneway="0"/>

TEST FAILED on ts-sim-winbuild-ba : state rerouting ( Last six runs Oct2019 )

---------- Differences in state ----------
6,7c6
<     <route id="!veh276!var#1" state="0" edges="gneE0 gneE1 gneE2 gneE3"/>
<     <route id="!veh276!var#2" state="0" edges="gneE0 gneE4 gneE5 gneE3"/>
---
>     <route id="!veh276!var#1" state="0" edges="gneE0 gneE4 gneE5 gneE3"/>
13,14c12
<     <route id="!veh279!var#1" state="0" edges="gneE0 gneE1 gneE2 gneE3"/>
<     <route id="!veh279!var#2" state="0" edges="gneE0 gneE4 gneE5 gneE3"/>
---
>     <route id="!veh279!var#1" state="0" edges="gneE0 gneE4 gneE5 gneE3"/>
19,20c17
<     <route id="!veh281!var#1" state="0" edges="gneE0 gneE1 gneE2 gneE3"/>
<     <route id="!veh281!var#2" state="0" edges="gneE0 gneE4 gneE5 gneE3"/>
---
>     <route id="!veh281!var#1" state="0" edges="gneE0 gneE4 gneE5 gneE3"/>
22,23c19
<     <route id="!veh282!var#1" state="0" edges="gneE0 gneE1 gneE2 gneE3"/>
<     <route id="!veh282!var#2" state="0" edges="gneE0 gneE4 gneE5 gneE3"/>
---
>     <route id="!veh282!var#1" state="0" edges="gneE0 gneE4 gneE5 gneE3"/>
28,29c24
<     <route id="!veh284!var#1" state="0" edges="gneE0 gneE1 gneE2 gneE3"/>
<     <route id="!veh284!var#2" state="0" edges="gneE0 gneE4 gneE5 gneE3"/>
---
>     <route id="!veh284!var#1" state="0" edges="gneE0 gneE4 gneE5 gneE3"/>
33,34c28
<     <route id="!veh286!var#1" state="0" edges="gneE0 gneE1 gneE2 gneE3"/>
<     <route id="!veh286!var#2" state="0" edges="gneE0 gneE4 gneE5 gneE3"/>
---
>     <route id="!veh286!var#1" state="0" edges="gneE0 gneE4 gneE5 gneE3"/>
<truncated after showing first 30 lines>
---------- Differences in vehroutes ----------
447c447
<             <route replacedOnEdge="" reason="device.rerouting" replacedAtTime="171.00" probability="0" edges="gneE0 gneE1 gneE2 gneE3"/>
---
>             <route replacedOnEdge="gneE0" reason="device.rerouting" replacedAtTime="188.00" probability="0" edges="gneE0 gneE1 gneE2 gneE3"/>
470c470
<             <route replacedOnEdge="" reason="device.rerouting" replacedAtTime="176.00" probability="0" edges="gneE0 gneE1 gneE2 gneE3"/>
---
>             <route replacedOnEdge="gneE0" reason="device.rerouting" replacedAtTime="196.00" probability="0" edges="gneE0 gneE1 gneE2 gneE3"/>
580c580,583
<         <route edges="gneE0 gneE4 gneE5 gneE3"/>
---
>         <routeDistribution>
>             <route replacedOnEdge="gneE0" reason="device.rerouting" replacedAtTime="243.00" probability="0" edges="gneE0 gneE4 gneE5 gneE3"/>
>             <route edges="gneE0 gneE1 gneE2 gneE3"/>
>         </routeDistribution>
604c607,610
<         <route edges="gneE0 gneE4 gneE5 gneE3"/>
---
>         <routeDistribution>
>             <route replacedOnEdge="gneE0" reason="device.rerouting" replacedAtTime="253.00" probability="0" edges="gneE0 gneE4 gneE5 gneE3"/>
>             <route edges="gneE0 gneE1 gneE2 gneE3"/>
>         </routeDistribution>
612c618,621
<         <route edges="gneE0 gneE4 gneE5 gneE3"/>
---
>         <routeDistribution>
>             <route replacedOnEdge="gneE0" reason="device.rerouting" replacedAtTime="258.00" probability="0" edges="gneE0 gneE4 gneE5 gneE3"/>
>             <route edges="gneE0 gneE1 gneE2 gneE3"/>
>         </routeDistribution>
624,627c633
<truncated after showing first 30 lines>
---------- Differences in vehroutes2 ----------
8d7
<             <route replacedOnEdge="" reason="device.rerouting" replacedAtTime="336.00" probability="0" edges="gneE0 gneE1 gneE2 gneE3"/>
30d28
<             <route replacedOnEdge="" reason="device.rerouting" replacedAtTime="340.00" probability="0" edges="gneE0 gneE1 gneE2 gneE3"/>
38c36
<             <route replacedOnEdge="" reason="device.rerouting" replacedAtTime="340.00" probability="0" edges="gneE0 gneE1 gneE2 gneE3"/>
---
>             <route replacedOnEdge="gneE0" reason="device.rerouting" replacedAtTime="483.00" probability="0" edges="gneE0 gneE1 gneE2 gneE3"/>
46d43
<             <route replacedOnEdge="" reason="device.rerouting" replacedAtTime="341.00" probability="0" edges="gneE0 gneE1 gneE2 gneE3"/>
54d50
<             <route replacedOnEdge="" reason="device.rerouting" replacedAtTime="344.00" probability="0" edges="gneE0 gneE1 gneE2 gneE3"/>
62c58
<             <route replacedOnEdge="" reason="device.rerouting" replacedAtTime="344.00" probability="0" edges="gneE0 gneE1 gneE2 gneE3"/>
---
>             <route replacedOnEdge="gneE0" reason="device.rerouting" replacedAtTime="488.00" probability="0" edges="gneE0 gneE1 gneE2 gneE3"/>
70d65
<             <route replacedOnEdge="" reason="device.rerouting" replacedAtTime="344.00" probability="0" edges="gneE0 gneE1 gneE2 gneE3"/>
78d72
<             <route replacedOnEdge="" reason="device.rerouting" replacedAtTime="347.00" probability="0" edges="gneE0 gneE1 gneE2 gneE3"/>
93d86
<             <route replacedOnEdge="" reason="device.rerouting" replacedAtTime="347.00" probability="0" edges="gneE0 gneE1 gneE2 gneE3"/>
108d100
<             <route replacedOnEdge="" reason="device.rerouting" replacedAtTime="349.00" probability="0" edges="gneE0 gneE1 gneE2 gneE3"/>
114,117c106
<         <routeDistribution>
<             <route replacedOnEdge="" reason="device.rerouting" replacedAtTime="351.00" probability="0" edges="gneE0 gneE1 gneE2 gneE3"/>
<             <route edges="gneE0 gneE4 gneE5 gneE3"/>
<         </routeDistribution>
---
<truncated after showing first 30 lines>

TEST FAILED on ts-sim-winbuild-ba : sumo ToCDevice ToC_with_sampled_responseTime ( Last six runs Oct2019 )

---------- Differences in fcd ----------
648c648
<         <vehicle id="ToC_veh" x="54.37" y="1327.89" angle="162.00" type="automated@ToC_veh" speed="19.60" pos="191.19" lane="6/1to7/1_0" slope="0.00"/>
---
>         <vehicle id="ToC_veh" x="54.13" y="1328.63" angle="162.00" type="manual" speed="18.82" pos="190.41" lane="6/1to7/1_0" slope="0.00"/>
651c651
<         <vehicle id="ToC_veh" x="60.32" y="1309.59" angle="162.00" type="manual" speed="19.24" pos="210.43" lane="6/1to7/1_0" slope="0.00"/>
---
>         <vehicle id="ToC_veh" x="60.07" y="1310.33" angle="162.00" type="manual" speed="19.24" pos="209.65" lane="6/1to7/1_0" slope="0.00"/>
654c654
<         <vehicle id="ToC_veh" x="66.14" y="1291.68" angle="162.00" type="manual" speed="18.84" pos="229.26" lane="6/1to7/1_0" slope="0.00"/>
---
>         <vehicle id="ToC_veh" x="65.89" y="1292.42" angle="162.00" type="manual" speed="18.84" pos="228.48" lane="6/1to7/1_0" slope="0.00"/>
657c657
<         <vehicle id="ToC_veh" x="72.16" y="1273.12" angle="162.00" type="manual" speed="19.51" pos="248.77" lane="6/1to7/1_0" slope="0.00"/>
---
>         <vehicle id="ToC_veh" x="71.92" y="1273.87" angle="162.00" type="manual" speed="19.51" pos="247.99" lane="6/1to7/1_0" slope="0.00"/>
660c660
<         <vehicle id="ToC_veh" x="78.09" y="1254.88" angle="162.00" type="manual" speed="19.19" pos="267.96" lane="6/1to7/1_0" slope="0.00"/>
---
>         <vehicle id="ToC_veh" x="77.85" y="1255.62" angle="162.00" type="manual" speed="19.19" pos="267.17" lane="6/1to7/1_0" slope="0.00"/>
663c663
<         <vehicle id="ToC_veh" x="84.05" y="1236.55" angle="162.00" type="manual" speed="19.27" pos="287.23" lane="6/1to7/1_0" slope="0.00"/>
---
>         <vehicle id="ToC_veh" x="83.81" y="1237.29" angle="162.00" type="manual" speed="19.27" pos="286.45" lane="6/1to7/1_0" slope="0.00"/>
666c666
<         <vehicle id="ToC_veh" x="90.02" y="1218.16" angle="162.00" type="manual" speed="19.33" pos="306.56" lane="6/1to7/1_0" slope="0.00"/>
---
>         <vehicle id="ToC_veh" x="89.78" y="1218.90" angle="162.00" type="manual" speed="19.33" pos="305.78" lane="6/1to7/1_0" slope="0.00"/>
669c669
<         <vehicle id="ToC_veh" x="95.76" y="1200.50" angle="162.00" type="manual" speed="18.56" pos="325.13" lane="6/1to7/1_0" slope="0.00"/>
<truncated after showing first 30 lines>
---------- Differences in output ----------
1088,1090c1088,1090
<   currentAwareness = 1.00
<   currentSpeed = 19.6
<   state = PREPARING_TOC
---
>   currentAwareness = 0.25
>   currentSpeed = 18.8176383486
>   state = RECOVERING
1093c1093
<   currentAwareness = 0.25
---
>   currentAwareness = 0.35
1098c1098
<   currentAwareness = 0.35
---
>   currentAwareness = 0.45
1103c1103
<   currentAwareness = 0.45
---
>   currentAwareness = 0.55
1108c1108
<   currentAwareness = 0.55
---
>   currentAwareness = 0.65
1113c1113
<   currentAwareness = 0.65
---
>   currentAwareness = 0.75
1118c1118
<   currentAwareness = 0.75
<truncated after showing first 30 lines>
---------- Differences in tocs ----------
6c6
<     <ToCdown id="ToC_veh" t="215.00" lane="6/1to7/1_0" lanePos="0.19"/>
---
>     <ToCdown id="ToC_veh" t="214.00" lane="6/1to7/1_0" lanePos="0.17"/>

TEST FAILED on ts-sim-winbuild-ba : sumo ToCDevice dynamic_ToC ( Last six runs Oct2019 )

---------- Differences in output ----------
348,351c348,352
<   currentAwareness = 1.00
<   currentSpeed = 13.89
<   state = PREPARING_TOC
< Time 54.0: Current lane of veh 'ToC_veh': WE_1
---
>   currentAwareness = 0.25
>   currentSpeed = 13.60330855
>   state = RECOVERING
> Switched to manual mode: Allowing LCs!
> Time 54.0: Current lane of veh 'ToC_veh': WE_0
354c355
<   currentAwareness = 0.25
---
>   currentAwareness = 0.35
361,362c362,363
<   currentAwareness = 0.35
<   currentSpeed = 13.5805231258
---
>   currentAwareness = 0.45
>   currentSpeed = 13.3196243835
368,369c369,370
<   currentAwareness = 0.45
<   currentSpeed = 13.3196243835
---
>   currentAwareness = 0.55
>   currentSpeed = 13.244425754
375,376c376,377
<   currentAwareness = 0.55
<   currentSpeed = 13.244425754
<truncated after showing first 30 lines>
---------- Differences in tocs ----------
7c7
<     <ToCdown id="ToC_veh" t="53.00" lane="WE_1" lanePos="0.69"/>
---
>     <ToCdown id="ToC_veh" t="52.00" lane="WE_1" lanePos="0.68"/>

TEST FAILED on ts-sim-winbuild-ba : sumo ToCDevice dynamic_ToC_stop ( Last six runs Oct2019 )

---------- Differences in output ----------
556,561d555
<   currentAwareness = 1.00
<   currentSpeed = 0.0
<   state = PREPARING_TOC
< Time 90.0: Current lane of veh 'ToC_veh': WE_1
< time 90.0
< ToC device infos for vehicle 'ToC_veh'
566,567c560,561
< Time 91.0: Current lane of veh 'ToC_veh': WE_0
< time 91.0
---
> Time 90.0: Current lane of veh 'ToC_veh': WE_0
> time 90.0
573,574c567,568
< Time 92.0: Current lane of veh 'ToC_veh': :gneJ1_0_0
< time 92.0
---
> Time 91.0: Current lane of veh 'ToC_veh': :gneJ1_0_0
> time 91.0
580,581c574,575
< Time 93.0: Current lane of veh 'ToC_veh': :gneJ1_0_0
< time 93.0
---
> Time 92.0: Current lane of veh 'ToC_veh': :gneJ1_0_0
> time 92.0
587,588c581,582
< Time 94.0: Current lane of veh 'ToC_veh': NS_0
< time 94.0
---
> Time 93.0: Current lane of veh 'ToC_veh': NS_0
<truncated after showing first 30 lines>
---------- Differences in tocs ----------
7c7
<     <ToCdown id="ToC_veh" t="89.00" lane="WE_1" lanePos="0.99"/>
---
>     <ToCdown id="ToC_veh" t="88.00" lane="WE_1" lanePos="0.99"/>

TEST FAILED on ts-sim-winbuild-ba : traas webservice ( Last six runs Oct2019 )

---------- Differences in errors ----------
0a1,49
> Okt 13, 2019 7:36:00 AM com.sun.xml.ws.server.sei.TieHandler createResponse
> SCHWERWIEGEND: null
> java.lang.NullPointerException
> 	at de.tudresden.sumo.util.Sumo.start_ws(Sumo.java:140)
> 	at de.tudresden.ws.ServiceImpl.start(ServiceImpl.java:66)
> 	at sun.reflect.NativeMethodAccessorImpl.invoke0(Native Method)
> 	at sun.reflect.NativeMethodAccessorImpl.invoke(Unknown Source)
> 	at sun.reflect.DelegatingMethodAccessorImpl.invoke(Unknown Source)
> 	at java.lang.reflect.Method.invoke(Unknown Source)
> 	at com.sun.xml.ws.util.Trampoline.invoke(MethodUtil.java:82)
> 	at sun.reflect.NativeMethodAccessorImpl.invoke0(Native Method)
> 	at sun.reflect.NativeMethodAccessorImpl.invoke(Unknown Source)
> 	at sun.reflect.DelegatingMethodAccessorImpl.invoke(Unknown Source)
> 	at java.lang.reflect.Method.invoke(Unknown Source)
> 	at com.sun.xml.ws.util.MethodUtil.invoke(MethodUtil.java:107)
> 	at com.sun.xml.ws.api.server.MethodUtil.invoke(MethodUtil.java:64)
> 	at com.sun.xml.ws.api.server.InstanceResolver$1.invoke(InstanceResolver.java:250)
> 	at com.sun.xml.ws.server.InvokerTube$2.invoke(InvokerTube.java:149)
> 	at com.sun.xml.ws.server.sei.SEIInvokerTube.processRequest(SEIInvokerTube.java:88)
> 	at com.sun.xml.ws.api.pipe.Fiber.__doRun(Fiber.java:1136)
> 	at com.sun.xml.ws.api.pipe.Fiber._doRun(Fiber.java:1050)
> 	at com.sun.xml.ws.api.pipe.Fiber.doRun(Fiber.java:1019)
> 	at com.sun.xml.ws.api.pipe.Fiber.runSync(Fiber.java:877)
> 	at com.sun.xml.ws.server.WSEndpointImpl$2.process(WSEndpointImpl.java:419)
> 	at com.sun.xml.ws.transport.http.HttpAdapter$HttpToolkit.handle(HttpAdapter.java:868)
> 	at com.sun.xml.ws.transport.http.HttpAdapter.handle(HttpAdapter.java:422)
> 	at com.sun.xml.ws.transport.http.server.WSHttpHandler.handleExchange(WSHttpHandler.java:113)
> 	at com.sun.xml.ws.transport.http.server.WSHttpHandler.handle(WSHttpHandler.java:97)
> 	at com.sun.net.httpserver.Filter$Chain.doFilter(Unknown Source)
<truncated after showing first 30 lines>

TEST FAILED on ts-sim-winbuild-ba : traci pythonApi gui ( Last six runs Oct2019 )

---------- Differences in png ----------
Binary files C:/Users/delphi/Code/sumoInternal/msvc12extrax64texttesttmp/msvc12extrax64.13Oct073121.3324/complex.meso/traci/pythonApi/gui/framework_tmp/png.complexorigcmp and C:/Users/delphi/Code/sumoInternal/msvc12extrax64texttesttmp/msvc12extrax64.13Oct073121.3324/complex.meso/traci/pythonApi/gui/framework_tmp/png.complexcmp differ

TEST FAILED on ts-sim-winbuild-ba : tutorial city_mobil ( Last six runs Oct2019 )

---------- Differences in output ----------
4c4
< waiting time (max, mean, dev): True True True
---
> waiting time (max, mean, dev): False True False
16c16
< ('footmainout', 'footmain3to4') True True True
---
> ('footmainout', 'footmain3to4') True True False
20c20
< ('footmainout', 'footmain7to8') True True True
---
> ('footmainout', 'footmain7to8') True True False
22c22
< waiting time (max, mean, dev): True True True
---
> waiting time (max, mean, dev): False True False
34c34
< ('footmainout', 'footmain3to4') True True True
---
> ('footmainout', 'footmain3to4') True True False
38c38
< ('footmainout', 'footmain7to8') True True True
---
> ('footmainout', 'footmain7to8') True True False

Detailed information for the tests that had known bugs:

TEST had known bugs (bug 1691 (NONEXISTENT)) on ts-sim-winbuild-ba : netconvert dlr-navteq_roundtrip ( Last six runs Oct2019 )

Failed to open URL 'https://sumo.dlr.de/trac.wsgi/ticket/1691?format=tab': <urlopen error [SSL: CERTIFICATE_VERIFY_FAILED] certificate verify failed (_ssl.c:590)>.

Please make sure that bug 1691 exists
and that the configuration entry 'bug_system_location' points to the correct trac instance.
The current value is 'https://sumo.dlr.de/trac.wsgi/'.
(This bug was triggered by text found in file 'net' matching '.*')
---------- Differences in net ----------
4c4
< <net version="1.1" junctionCornerDetail="5" limitTurnSpeed="5.50" xmlns:xsi="http://www.w3.org/2001/XMLSchema-instance" xsi:noNamespaceSchemaLocation="http://sumo.dlr.de/xsd/net_file.xsd">
---
> <net version="1.3" junctionCornerDetail="5" limitTurnSpeed="5.50" xmlns:xsi="http://www.w3.org/2001/XMLSchema-instance" xsi:noNamespaceSchemaLocation="http://sumo.dlr.de/xsd/net_file.xsd">
2768c2768
<     <connection from="-26816553" to="26816541" fromLane="0" toLane="0" via=":294168098_5_0" dir="L" state="="/>
---
>     <connection from="-26816553" to="26816541" fromLane="0" toLane="0" via=":294168098_5_0" dir="l" state="="/>
2975c2975
<     <connection from="27445116" to="27445117" fromLane="0" toLane="0" via=":294169338_0_0" dir="s" state="="/>
---
>     <connection from="27445116" to="27445117" fromLane="0" toLane="0" via=":294169338_0_0" dir="R" state="="/>
3216c3216
<     <connection from=":294168098_5" to="26816541" fromLane="0" toLane="0" dir="L" state="M"/>
---
>     <connection from=":294168098_5" to="26816541" fromLane="0" toLane="0" dir="l" state="M"/>
3241c3241
<     <connection from=":294169338_0" to="27445117" fromLane="0" toLane="0" dir="s" state="M"/>
---
>     <connection from=":294169338_0" to="27445117" fromLane="0" toLane="0" dir="R" state="M"/>

TEST had known bugs (bug 1691 (NONEXISTENT)) on ts-sim-winbuild-ba : netconvert matsim_roundtrip ( Last six runs Oct2019 )

Failed to open URL 'https://sumo.dlr.de/trac.wsgi/ticket/1691?format=tab': <urlopen error [SSL: CERTIFICATE_VERIFY_FAILED] certificate verify failed (_ssl.c:590)>.

Please make sure that bug 1691 exists
and that the configuration entry 'bug_system_location' points to the correct trac instance.
The current value is 'https://sumo.dlr.de/trac.wsgi/'.
(This bug was triggered by text found in file 'net' matching '.*')
---------- Differences in net ----------
4c4
< <net version="1.1" junctionCornerDetail="5" limitTurnSpeed="5.50" xmlns:xsi="http://www.w3.org/2001/XMLSchema-instance" xsi:noNamespaceSchemaLocation="http://sumo.dlr.de/xsd/net_file.xsd">
---
> <net version="1.3" junctionCornerDetail="5" limitTurnSpeed="5.50" xmlns:xsi="http://www.w3.org/2001/XMLSchema-instance" xsi:noNamespaceSchemaLocation="http://sumo.dlr.de/xsd/net_file.xsd">
880c880
<         <lane id=":294830184_7_0" index="0" speed="5.56" length="14.38" shape="915.07,462.77 918.06,460.17 921.14,459.20 924.29,459.87 927.52,462.17"/>
---
>         <lane id=":294830184_7_0" index="0" speed="5.56" length="13.52" shape="915.07,462.77 917.74,460.95 921.19,460.22 924.69,460.61 927.52,462.17"/>
3708c3708
<     <connection from="-26004787#2" to="26004966#2" fromLane="0" toLane="0" via=":283722837_12_0" dir="s" state="="/>
---
>     <connection from="-26004787#2" to="26004966#2" fromLane="0" toLane="0" via=":283722837_12_0" dir="R" state="="/>
3724c3724
<     <connection from="-26004868#0" to="-5198585#7" fromLane="0" toLane="0" via=":283719736_13_0" dir="R" state="m"/>
---
>     <connection from="-26004868#0" to="-5198585#7" fromLane="0" toLane="0" via=":283719736_13_0" dir="r" state="m"/>
3747c3747
<     <connection from="-26816553" to="-26816413#1" fromLane="0" toLane="0" via=":294168098_4_0" dir="R" state="="/>
---
>     <connection from="-26816553" to="-26816413#1" fromLane="0" toLane="0" via=":294168098_4_0" dir="r" state="="/>
4015c4015
<     <connection from="26816413#1" to="26816553" fromLane="0" toLane="0" via=":294168098_1_0" dir="L" state="="/>
---
>     <connection from="26816413#1" to="26816553" fromLane="0" toLane="0" via=":294168098_1_0" dir="l" state="="/>
4023c4023
<     <connection from="26816590#0" to="26816590#1" fromLane="0" toLane="0" via=":294169338_0_0" dir="s" state="="/>
---
>     <connection from="26816590#0" to="26816590#1" fromLane="0" toLane="0" via=":294169338_0_0" dir="R" state="="/>
4037c4037
<     <connection from="26843038#0" to="26843038#1" fromLane="0" toLane="0" via=":294830184_7_0" dir="L" state="="/>
<truncated after showing first 30 lines>

TEST had known bugs (see #254) on ts-sim-winbuild-ba : sumo output one_vehicle ( Last six runs Oct2019 )

different outputs from detectors which should detect the same
(This bug was triggered by text found in file 'output' matching 'failed')
---------- Differences in output ----------
10c10
< success 0.1 ['--step-length', '.1', '--end', '100'] ['3/1to2/1_0']
---
> failed 0.1 ['--step-length', '.1', '--end', '100'] 3/1to2/1_0 (71.3, 71.4) [('e2', 10.0), ('e3', -1.0), ('edge', -1.0), ('lane', -1.0)]
12c12
< success 1 ['--step-length', '.1', '--end', '100'] ['3/1to2/1_0']
---
> failed 1 ['--step-length', '.1', '--end', '100'] 3/1to2/1_0 (72.0, 73.0) [('e2', 10.0), ('e3', -1.0), ('edge', -1.0), ('lane', -1.0)]
14c14
< success 10 ['--step-length', '.1', '--end', '100'] ['3/1to2/1_0']
---
> failed 10 ['--step-length', '.1', '--end', '100'] 3/1to2/1_0 (80.0, 90.0) [('e2', 10.0), ('e3', -1.0), ('edge', -1.0), ('lane', -1.0)]
18c18
< success 0.1 ['--step-length', '.1', '--end', '1000'] ['3/1to2/1_0']
---
> failed 0.1 ['--step-length', '.1', '--end', '1000'] 3/1to2/1_0 (71.3, 71.4) [('e2', 10.0), ('e3', -1.0), ('edge', -1.0), ('lane', -1.0)]
20c20
< success 1 ['--step-length', '.1', '--end', '1000'] ['3/1to2/1_0']
---
> failed 1 ['--step-length', '.1', '--end', '1000'] 3/1to2/1_0 (72.0, 73.0) [('e2', 10.0), ('e3', -1.0), ('edge', -1.0), ('lane', -1.0)]
22c22
< success 10 ['--step-length', '.1', '--end', '1000'] ['3/1to2/1_0']
---
> failed 10 ['--step-length', '.1', '--end', '1000'] 3/1to2/1_0 (80.0, 90.0) [('e2', 10.0), ('e3', -1.0), ('edge', -1.0), ('lane', -1.0)]
24c24
< success 100 ['--step-length', '.1', '--end', '1000'] ['3/1to2/1_0']
---
> failed 100 ['--step-length', '.1', '--end', '1000'] 3/1to2/1_0 (100.0, 200.0) [('e1', -1.0), ('e2', 10.0), ('e3', -1.0), ('edge', -1.0), ('lane', -1.0)]
34c34
< success 0.1 ['--step-length', '1', '--end', '100'] ['3/1to2/1_0']
<truncated after showing first 30 lines>

TEST had known bugs (see #254) on ts-sim-winbuild-ba : sumo output teleport ( Last six runs Oct2019 )

different outputs from detectors which should detect the same
(This bug was triggered by text found in file 'output' matching 'failed')
---------- Differences in output ----------
2c2
< success ['--step-length', '.1', '--end', '51'] ['2/1to1/1_0']
---
> success 0.1 ['--step-length', '.1', '--end', '51'] ['2/1to1/1_0']
4c4
< success ['--step-length', '.1', '--end', '51'] ['2/1to1/1_0', '1/1to0/1_0']
---
> success 0.1 ['--step-length', '.1', '--end', '51'] ['2/1to1/1_0', '1/1to0/1_0']
6c6
< success ['--step-length', '.1', '--end', '51'] ['2/1to1/1_0']
---
> success 1 ['--step-length', '.1', '--end', '51'] ['2/1to1/1_0']
8c8
< success ['--step-length', '.1', '--end', '51'] ['2/1to1/1_0', '1/1to0/1_0']
---
> success 1 ['--step-length', '.1', '--end', '51'] ['2/1to1/1_0', '1/1to0/1_0']
10c10
< success ['--step-length', '.1', '--end', '51'] ['2/1to1/1_0']
---
> success 10 ['--step-length', '.1', '--end', '51'] ['2/1to1/1_0']
12c12
< success ['--step-length', '.1', '--end', '51'] ['2/1to1/1_0', '1/1to0/1_0']
---
> success 10 ['--step-length', '.1', '--end', '51'] ['2/1to1/1_0', '1/1to0/1_0']
14c14
< success ['--step-length', '.1', '--end', '51'] ['2/1to1/1_0']
---
> success 100 ['--step-length', '.1', '--end', '51'] ['2/1to1/1_0']
16c16
< success ['--step-length', '.1', '--end', '51'] ['2/1to1/1_0', '1/1to0/1_0']
<truncated after showing first 30 lines>

TEST had known bugs (see #254) on ts-sim-winbuild-ba : sumo output teleport_multihop ( Last six runs Oct2019 )

different outputs from detectors which should detect the same
(This bug was triggered by text found in file 'output' matching 'failed')
---------- Differences in output ----------
34c34
< success 0.1 ['--step-length', '.1', '--end', '1000'] 2/1to1/1_0 (230.0, 230.1) [('e2', 9.99), ('e3', 10.0), ('edge', 9.99), ('lane', 9.99)]
---
> failed 0.1 ['--step-length', '.1', '--end', '1000'] 2/1to1/1_0 (149.0, 149.1) [('e2', 9.99), ('e3', 10.0), ('edge', 10.0), ('lane', 10.0)]
36c36
< success 0.1 ['--step-length', '.1', '--end', '1000'] 1/1to0/1_0 (148.1, 148.2) [('e2', 9.99), ('e3', 10.0), ('edge', 9.99), ('lane', 9.99)]
---
> failed 0.1 ['--step-length', '.1', '--end', '1000'] 2/1to1/1_0 (149.0, 149.1) [('e2', 9.99), ('e3', 10.0), ('edge', 10.0), ('lane', 10.0)]
38c38
< success 1 ['--step-length', '.1', '--end', '1000'] 2/1to1/1_0 (230.0, 231.0) [('e2', 9.99), ('e3', 10.0), ('edge', 9.99), ('lane', 9.99)]
---
> failed 1 ['--step-length', '.1', '--end', '1000'] 2/1to1/1_0 (149.0, 150.0) [('e2', 9.93), ('e3', 10.0), ('edge', 10.0), ('lane', 10.0)]
40c40
< success 1 ['--step-length', '.1', '--end', '1000'] 1/1to0/1_0 (148.0, 149.0) [('e2', 9.91), ('e3', 10.0), ('edge', 9.91), ('lane', 9.91)]
---
> failed 1 ['--step-length', '.1', '--end', '1000'] 2/1to1/1_0 (149.0, 150.0) [('e2', 9.93), ('e3', 10.0), ('edge', 10.0), ('lane', 10.0)]
42c42
< success 10 ['--step-length', '.1', '--end', '1000'] 2/1to1/1_0 (230.0, 240.0) [('e2', 9.42), ('e3', 9.9), ('edge', 9.42), ('lane', 9.42)]
---
> failed 10 ['--step-length', '.1', '--end', '1000'] 2/1to1/1_0 (140.0, 150.0) [('e2', 9.99), ('e3', 10.0), ('edge', 10.0), ('lane', 10.0)]
44c44
< success 10 ['--step-length', '.1', '--end', '1000'] 1/1to0/1_0 (140.0, 150.0) [('e2', 9.96), ('e3', 9.99), ('edge', 9.96), ('lane', 9.96)]
---
> failed 10 ['--step-length', '.1', '--end', '1000'] 2/1to1/1_0 (140.0, 150.0) [('e2', 9.99), ('e3', 10.0), ('edge', 10.0), ('lane', 10.0)]
46c46
< success 100 ['--step-length', '.1', '--end', '1000'] 2/1to1/1_0 (200.0, 300.0) [('e1', 10.0), ('e2', 9.22), ('e3', 5.71), ('edge', 9.22), ('lane', 9.22)]
---
> failed 100 ['--step-length', '.1', '--end', '1000'] 2/1to1/1_0 (100.0, 200.0) [('e1', 10.0), ('e2', 7.95), ('e3', 10.0), ('edge', 10.0), ('lane', 10.0)]
48c48
< success 100 ['--step-length', '.1', '--end', '1000'] 1/1to0/1_0 (100.0, 200.0) [('e1', 9.53), ('e2', 5.82), ('e3', 6.93), ('edge', 5.82), ('lane', 5.82)]
<truncated after showing first 30 lines>

TEST had known bugs (see #254) on ts-sim-winbuild-ba : sumo output teleport_multihop_newDefaults ( Last six runs Oct2019 )

different outputs from detectors which should detect the same
(This bug was triggered by text found in file 'output' matching 'failed')
---------- Differences in output ----------
18c18
< success 0.1 ['--step-length', '.1', '--end', '100'] ['2/1to1/1_0']
---
> failed 0.1 ['--step-length', '.1', '--end', '100'] 2/1to1/1_0 (76.2, 76.3) [('e2', 10.49), ('e3', 10.35), ('edge', 10.49), ('lane', 10.49)]
20c20
< success 0.1 ['--step-length', '.1', '--end', '100'] ['2/1to1/1_0', '1/1to0/1_0']
---
> failed 0.1 ['--step-length', '.1', '--end', '100'] 2/1to1/1_0 (76.2, 76.3) [('e2', 10.49), ('e3', 10.35), ('edge', 10.49), ('lane', 10.49)]
22c22
< success 1 ['--step-length', '.1', '--end', '100'] ['2/1to1/1_0']
---
> failed 1 ['--step-length', '.1', '--end', '100'] 2/1to1/1_0 (76.0, 77.0) [('e2', 10.39), ('e3', 10.35), ('edge', 10.39), ('lane', 10.39)]
24c24
< success 1 ['--step-length', '.1', '--end', '100'] ['2/1to1/1_0', '1/1to0/1_0']
---
> failed 1 ['--step-length', '.1', '--end', '100'] 2/1to1/1_0 (76.0, 77.0) [('e2', 10.39), ('e3', 10.35), ('edge', 10.39), ('lane', 10.39)]
26c26
< success 10 ['--step-length', '.1', '--end', '100'] ['2/1to1/1_0']
---
> failed 10 ['--step-length', '.1', '--end', '100'] 2/1to1/1_0 (70.0, 80.0) [('e2', 10.42), ('e3', 10.25), ('edge', 10.42), ('lane', 10.42)]
28c28
< success 10 ['--step-length', '.1', '--end', '100'] ['2/1to1/1_0', '1/1to0/1_0']
---
> failed 10 ['--step-length', '.1', '--end', '100'] 2/1to1/1_0 (70.0, 80.0) [('e2', 10.42), ('e3', 10.25), ('edge', 10.42), ('lane', 10.42)]
30c30
< success 100 ['--step-length', '.1', '--end', '100'] ['2/1to1/1_0']
---
> failed 100 ['--step-length', '.1', '--end', '100'] 2/1to1/1_0 (0.0, 100.0) [('e1', 10.27), ('e2', 10.24), ('e3', 9.59), ('edge', 10.24), ('lane', 10.24)]
32c32
< success 100 ['--step-length', '.1', '--end', '100'] ['2/1to1/1_0', '1/1to0/1_0']
<truncated after showing first 30 lines>

TEST had known bugs (see #254) on ts-sim-winbuild-ba : sumo output two_same_vehicles ( Last six runs Oct2019 )

different outputs from detectors which should detect the same
(This bug was triggered by text found in file 'output' matching 'failed')
---------- Differences in output ----------
10c10
< success 0.1 ['--step-length', '.1', '--end', '100'] ['3/1to2/1_0']
---
> failed 0.1 ['--step-length', '.1', '--end', '100'] 3/1to2/1_0 (75.4, 75.5) [('e2', 10.0), ('e3', -1.0), ('edge', -1.0), ('lane', -1.0)]
12c12
< success 1 ['--step-length', '.1', '--end', '100'] ['3/1to2/1_0']
---
> failed 1 ['--step-length', '.1', '--end', '100'] 3/1to2/1_0 (76.0, 77.0) [('e2', 10.0), ('e3', -1.0), ('edge', -1.0), ('lane', -1.0)]
14c14
< success 10 ['--step-length', '.1', '--end', '100'] ['3/1to2/1_0']
---
> failed 10 ['--step-length', '.1', '--end', '100'] 3/1to2/1_0 (80.0, 90.0) [('e2', 10.0), ('e3', -1.0), ('edge', -1.0), ('lane', -1.0)]
18c18
< success 0.1 ['--step-length', '.1', '--end', '1000'] ['3/1to2/1_0']
---
> failed 0.1 ['--step-length', '.1', '--end', '1000'] 3/1to2/1_0 (75.4, 75.5) [('e2', 10.0), ('e3', -1.0), ('edge', -1.0), ('lane', -1.0)]
20c20
< success 1 ['--step-length', '.1', '--end', '1000'] ['3/1to2/1_0']
---
> failed 1 ['--step-length', '.1', '--end', '1000'] 3/1to2/1_0 (76.0, 77.0) [('e2', 10.0), ('e3', -1.0), ('edge', -1.0), ('lane', -1.0)]
22c22
< success 10 ['--step-length', '.1', '--end', '1000'] ['3/1to2/1_0']
---
> failed 10 ['--step-length', '.1', '--end', '1000'] 3/1to2/1_0 (80.0, 90.0) [('e2', 10.0), ('e3', -1.0), ('edge', -1.0), ('lane', -1.0)]
24c24
< success 100 ['--step-length', '.1', '--end', '1000'] ['3/1to2/1_0']
---
> failed 100 ['--step-length', '.1', '--end', '1000'] 3/1to2/1_0 (100.0, 200.0) [('e1', -1.0), ('e2', 10.0), ('e3', -1.0), ('edge', -1.0), ('lane', -1.0)]
34c34
< success 0.1 ['--step-length', '1', '--end', '100'] ['3/1to2/1_0']
<truncated after showing first 30 lines>

TEST had known bugs (see #254) on ts-sim-winbuild-ba : sumo output two_vehicles_diff_length ( Last six runs Oct2019 )

different outputs from detectors which should detect the same
(This bug was triggered by text found in file 'output' matching 'failed')
---------- Differences in output ----------
10c10
< success 0.1 ['--step-length', '.1', '--end', '100'] ['3/1to2/1_0']
---
> failed 0.1 ['--step-length', '.1', '--end', '100'] 3/1to2/1_0 (76.4, 76.5) [('e2', 10.0), ('e3', -1.0), ('edge', -1.0), ('lane', -1.0)]
12c12
< success 1 ['--step-length', '.1', '--end', '100'] ['3/1to2/1_0']
---
> failed 1 ['--step-length', '.1', '--end', '100'] 3/1to2/1_0 (77.0, 78.0) [('e2', 10.0), ('e3', -1.0), ('edge', -1.0), ('lane', -1.0)]
14c14
< success 10 ['--step-length', '.1', '--end', '100'] ['3/1to2/1_0']
---
> failed 10 ['--step-length', '.1', '--end', '100'] 3/1to2/1_0 (80.0, 90.0) [('e2', 10.0), ('e3', -1.0), ('edge', -1.0), ('lane', -1.0)]
18c18
< success 0.1 ['--step-length', '.1', '--end', '1000'] ['3/1to2/1_0']
---
> failed 0.1 ['--step-length', '.1', '--end', '1000'] 3/1to2/1_0 (76.4, 76.5) [('e2', 10.0), ('e3', -1.0), ('edge', -1.0), ('lane', -1.0)]
20c20
< success 1 ['--step-length', '.1', '--end', '1000'] ['3/1to2/1_0']
---
> failed 1 ['--step-length', '.1', '--end', '1000'] 3/1to2/1_0 (77.0, 78.0) [('e2', 10.0), ('e3', -1.0), ('edge', -1.0), ('lane', -1.0)]
22c22
< success 10 ['--step-length', '.1', '--end', '1000'] ['3/1to2/1_0']
---
> failed 10 ['--step-length', '.1', '--end', '1000'] 3/1to2/1_0 (80.0, 90.0) [('e2', 10.0), ('e3', -1.0), ('edge', -1.0), ('lane', -1.0)]
24c24
< success 100 ['--step-length', '.1', '--end', '1000'] ['3/1to2/1_0']
---
> failed 100 ['--step-length', '.1', '--end', '1000'] 3/1to2/1_0 (100.0, 200.0) [('e1', -1.0), ('e2', 10.0), ('e3', -1.0), ('edge', -1.0), ('lane', -1.0)]
34c34
< success 0.1 ['--step-length', '1', '--end', '100'] ['3/1to2/1_0']
<truncated after showing first 30 lines>

TEST had known bugs (see #254) on ts-sim-winbuild-ba : sumo output two_vehicles_diff_speed ( Last six runs Oct2019 )

different outputs from detectors which should detect the same
(This bug was triggered by text found in file 'output' matching 'failed')
---------- Differences in output ----------
0a1,48
> Loading configuration... done.
> failed 0.1 ['--step-length', '.1', '--end', '51'] 3/1to2/1_0 (38.4, 38.5) [('e2', 9.6), ('e3', 9.5), ('edge', 9.6), ('lane', 9.6)]
> Loading configuration... done.
> failed 1 ['--step-length', '.1', '--end', '51'] 3/1to2/1_0 (38.0, 39.0) [('e2', 9.64), ('e3', 9.5), ('edge', 9.64), ('lane', 9.64)]
> Loading configuration... done.
> failed 10 ['--step-length', '.1', '--end', '51'] 3/1to2/1_0 (30.0, 40.0) [('e2', 9.86), ('e3', 9.5), ('edge', 9.86), ('lane', 9.86)]
> Loading configuration... done.
> failed 100 ['--step-length', '.1', '--end', '51'] 3/1to2/1_0 (0.0, 51.0) [('e2', 9.62), ('e3', 9.5), ('edge', 9.62), ('lane', 9.62)]
> Loading configuration... done.
> failed 0.1 ['--step-length', '.1', '--end', '100'] 3/1to2/1_0 (38.4, 38.5) [('e2', 9.6), ('e3', 9.5), ('edge', 9.6), ('lane', 9.6)]
> Loading configuration... done.
> failed 1 ['--step-length', '.1', '--end', '100'] 3/1to2/1_0 (38.0, 39.0) [('e2', 9.64), ('e3', 9.5), ('edge', 9.64), ('lane', 9.64)]
> Loading configuration... done.
> failed 10 ['--step-length', '.1', '--end', '100'] 3/1to2/1_0 (30.0, 40.0) [('e2', 9.86), ('e3', 9.5), ('edge', 9.86), ('lane', 9.86)]
> Loading configuration... done.
> failed 100 ['--step-length', '.1', '--end', '100'] 3/1to2/1_0 (0.0, 100.0) [('e1', 9.5), ('e2', 9.53), ('e3', 9.5), ('edge', 9.47), ('lane', 9.47)]
> Loading configuration... done.
> failed 0.1 ['--step-length', '.1', '--end', '1000'] 3/1to2/1_0 (38.4, 38.5) [('e2', 9.6), ('e3', 9.5), ('edge', 9.6), ('lane', 9.6)]
> Loading configuration... done.
> failed 1 ['--step-length', '.1', '--end', '1000'] 3/1to2/1_0 (38.0, 39.0) [('e2', 9.64), ('e3', 9.5), ('edge', 9.64), ('lane', 9.64)]
> Loading configuration... done.
> failed 10 ['--step-length', '.1', '--end', '1000'] 3/1to2/1_0 (30.0, 40.0) [('e2', 9.86), ('e3', 9.5), ('edge', 9.86), ('lane', 9.86)]
> Loading configuration... done.
> failed 100 ['--step-length', '.1', '--end', '1000'] 3/1to2/1_0 (0.0, 100.0) [('e1', 9.5), ('e2', 9.53), ('e3', 9.5), ('edge', 9.47), ('lane', 9.47)]
> Loading configuration... done.
> failed 0.1 ['--step-length', '1', '--end', '51'] 3/1to2/1_0 (39.0, 40.0) [('e2', 9.6), ('e3', 9.5), ('edge', 9.6), ('lane', 9.6)]
> Loading configuration... done.
> failed 1 ['--step-length', '1', '--end', '51'] 3/1to2/1_0 (39.0, 40.0) [('e2', 9.6), ('e3', 9.5), ('edge', 9.6), ('lane', 9.6)]
> Loading configuration... done.
<truncated after showing first 30 lines>

TEST had known bugs (#4727) on ts-sim-winbuild-ba : traci ContextSubscriptionFilters leadFollow carFollowing ( Last six runs Oct2019 )

#4727
(This bug was triggered by text found in file 'output' matching '.')
---------- Differences in output ----------
4d3
< lead_straight
6d4
< [002] Context results for vehicle 'ego':
7a6
> [002] Context results for vehicle 'ego':
9d7
< [003] Context results for vehicle 'ego':
10a9
> [003] Context results for vehicle 'ego':
12d10
< [004] Context results for vehicle 'ego':
13a12
> [004] Context results for vehicle 'ego':
15d13
< [005] Context results for vehicle 'ego':
16a15
> [005] Context results for vehicle 'ego':
18d16
< [006] Context results for vehicle 'ego':
19a18
> [006] Context results for vehicle 'ego':
21d19
< [007] Context results for vehicle 'ego':
22a21
> [007] Context results for vehicle 'ego':
24d22
< [008] Context results for vehicle 'ego':
25a24
> [008] Context results for vehicle 'ego':
<truncated after showing first 30 lines>

2 TESTS had known bugs (#4727) on ts-sim-winbuild-ba :

#4727
(This bug was triggered by text found in file 'output' matching '.')
---------- Differences in output ----------
4a5
> follow_straight
7d7
< follow_straight
9a10
> follow_straight
12d12
< follow_straight
14a15
> follow_straight
17d17
< follow_straight
19a20
> follow_straight
22d22
< follow_straight
24a25
> follow_straight
27d27
< follow_straight
29a30
> follow_straight
32d32
< follow_straight
34a35
> follow_straight
37d37
< follow_straight
39a40
> follow_straight
<truncated after showing first 30 lines>
traci ContextSubscriptionFilters leadFollow laneChangeLeft ( Last six runs Oct2019 )
traci ContextSubscriptionFilters leadFollow laneChangeRight ( Last six runs Oct2019 )

TEST had known bugs (#4727) on ts-sim-winbuild-ba : traci ContextSubscriptionFilters leadFollow laneChangeNeighbors ( Last six runs Oct2019 )

#4727
(This bug was triggered by text found in file 'output' matching '.')
---------- Differences in output ----------
4,5d3
< follow_straight
< follow_right
6a5,7
> follow_right
> follow_straight
> lead_left
9d9
< lead_left
11,12d10
< follow_straight
< follow_right
13a12,14
> follow_right
> follow_straight
> lead_left
16d16
< lead_left
18,19d17
< follow_straight
< follow_right
20a19,21
> follow_right
> follow_straight
> lead_left
23d23
< lead_left
25,26d24
< follow_straight
< follow_right
<truncated after showing first 30 lines>

TEST had known bugs (see #3263) on ts-sim-winbuild-ba : traci pythonApi moveToXY keepRoute2 ( Last six runs Oct2019 )

mapping failure
(This bug was triggered by text found in file 'output' matching 'failed')
---------- Differences in output ----------
0a1,2
> internal corner (inside, segment2) failed: x=198, x2=198.0,   y=1.9, y2=1.9,   lane=middle_0, lane2=middle_0, pos=102, pos2=98.0   posLat=2.0 posLat2=1.9
> internal corner (outside, far) failed: x=203, x2=203.0,   y=-4, y2=-4.0,   lane=, lane2=middle_0, pos=-1073741824.0, pos2=100.0   posLat=-1073741824.0 posLat2=-1.41421356237

TEST had known bugs (see #5383) on ts-sim-winbuild-ba : traci pythonApi moveToXY permissions ( Last six runs Oct2019 )

mapping failure
(This bug was triggered by text found in file 'output' matching 'failed')
---------- Differences in output ----------
0a1,2
> shifted to left lane (permissions) failed: mode=2 x=40, x2=40.0,   y=-1.5, y2=-1.5,   lane=beg_1, lane2=, pos=40, pos2=-1073741824.0   posLat=0.0 posLat2=-1073741824.0
> right lane (ignore permissions) failed: mode=6 x=40, x2=40.0,   y=-1.6, y2=-1.6,   lane=beg_0, lane2=, pos=40, pos2=-1073741824.0   posLat=0.0 posLat2=-1073741824.0

python3: 298 tests: 265 succeeded 18 FAILED 15 known bugs

Detailed information for the tests that FAILED:

TEST FAILED on ts-sim-winbuild-ba : netconvert osm_roundtrip ( Last six runs Oct2019 )

---------- Differences in errors ----------
1,31c1,4
< Warning: Discarding unusable type 'waterway.riverbank' (first occurence for edge '4616435').
< Warning: Discarding unusable type 'waterway.canal' (first occurence for edge '5363708').
< Warning: Discarding unknown compound 'cycleway.opposite_track' in type 'cycleway.opposite_track|highway.primary' (first occurence for edge '7216737').
< Warning: Discarding unusable type 'railway.construction' (first occurence for edge '11390634').
< Warning: Discarding unusable type 'highway.construction' (first occurence for edge '24154002').
< Warning: Discarding unknown compound 'cycleway.track' in type 'cycleway.track|highway.primary' (first occurence for edge '24214693').
< Warning: Reducing junction cluster 283018817,38919652,38919712,38919808 (5 incoming edges)
< Warning: Minor green from edge '7216737#3' to edge '24214694' exceeds 19.44m/s. Maybe a left-turn lane is missing.
< Warning: Minor green from edge '-24214693#0' to edge '-7727483#3' exceeds 19.44m/s. Maybe a left-turn lane is missing.
< Warning: Minor green from edge '7727483#1' to edge '-7216737#3' exceeds 19.44m/s. Maybe a left-turn lane is missing.
< Warning: Minor green from edge '-24214694' to edge '24214693#0' exceeds 19.44m/s. Maybe a left-turn lane is missing.
< --- 
< +++ 
< @@ -219,7 +219,7 @@
<          <lane id="-7216737#3_1" index="1" disallow="tram rail_urban rail rail_electric rail_fast ship" speed="27.78" length="162.74" shape="486.04,118.77 633.84,105.16"/>
<      </edge>
<      <edge id="-7727483#0" from="294169342" to="38920501" priority="10" type="highway.tertiary">
< -        <lane id="-7727483#0_0" index="0" disallow="tram rail_urban rail rail_electric rail_fast ship" speed="22.22" length="4.46" shape="496.86,309.53 496.88,309.73"/>
< +        <lane id="-7727483#0_0" index="0" disallow="tram rail_urban rail rail_electric rail_fast ship" speed="22.22" length="4.46" shape="497.05,311.65 497.06,311.85"/>
<      </edge>
<      <edge id="-7727483#3" from="32266935" to="294169342" priority="10" type="highway.tertiary" shape="478.98,121.02 482.98,167.40 484.69,187.19 488.69,233.50 492.80,281.09 495.08,307.55">
<          <lane id="-7727483#3_0" index="0" disallow="tram rail_urban rail rail_electric rail_fast ship" speed="22.22" length="187.22" shape="481.48,131.37 484.58,167.26 486.29,187.05 490.29,233.36 494.40,280.95 496.27,302.68"/>
< @@ -977,7 +977,7 @@
<      <junction id="38919927" type="priority" x="297.39" y="446.01" incLanes="-6137233#0_0" intLanes="" shape="297.39,446.01 296.76,449.15 297.39,446.01">
<          <request index="0" response="0" foes="0"/>
<      </junction>
< -    <junction id="38920501" type="priority" x="495.47" y="311.99" incLanes="27441289_0 -7727483#0_0" intLanes="" shape="492.27,312.15 498.66,311.83 498.65,311.60">
< +    <junction id="38920501" type="priority" x="495.47" y="311.99" incLanes="27441289_0 -7727483#0_0" intLanes="" shape="492.27,312.13 498.66,311.82 498.65,311.57">
<          <request index="0" response="00" foes="00"/>
<truncated after showing first 30 lines>
---------- Differences in output ----------
1,2d0
< Success.
< Success.
---------- Missing result in net ----------
<?xml version="1.0" encoding="UTF-8"?>


<net version="1.3" junctionCornerDetail="5" limitTurnSpeed="5.50" xmlns:xsi="http://www.w3.org/2001/XMLSchema-instance" xsi:noNamespaceSchemaLocation="http://sumo.dlr.de/xsd/net_file.xsd">

    <location netOffset="-399345.66,-5809365.64" convBoundary="-1.27,0.00,1737.68,767.39" origBoundary="13.364829,52.424764,13.574340,52.459643" projParameter="+proj=utm +zone=33 +ellps=WGS84 +datum=WGS84 +units=m +no_defs"/>

    <type id="highway.bridleway" priority="1" numLanes="1" speed="2.78" allow="pedestrian" oneway="1" width="2.00"/>
    <type id="highway.bus_guideway" priority="1" numLanes="1" speed="27.78" allow="bus" oneway="1"/>
    <type id="highway.cycleway" priority="1" numLanes="1" speed="8.33" allow="bicycle" oneway="0" width="1.00"/>
    <type id="highway.footway" priority="1" numLanes="1" speed="2.78" allow="pedestrian" oneway="1" width="2.00"/>
    <type id="highway.ford" priority="1" numLanes="1" speed="2.78" allow="army" oneway="0"/>
    <type id="highway.living_street" priority="2" numLanes="1" speed="2.78" disallow="tram rail_urban rail rail_electric rail_fast ship" oneway="0"/>
    <type id="highway.motorway" priority="14" numLanes="2" speed="39.44" allow="private emergency authority army vip passenger hov taxi bus coach delivery truck trailer motorcycle evehicle custom1 custom2" oneway="1"/>
    <type id="highway.motorway_link" priority="9" numLanes="1" speed="22.22" allow="private emergency authority army vip passenger hov taxi bus coach delivery truck trailer motorcycle evehicle custom1 custom2" oneway="1"/>
    <type id="highway.path" priority="1" numLanes="1" speed="2.78" allow="pedestrian bicycle" oneway="1" width="2.00"/>
    <type id="highway.pedestrian" priority="1" numLanes="1" speed="2.78" allow="pedestrian" oneway="1" width="2.00"/>
    <type id="highway.primary" priority="12" numLanes="2" speed="27.78" disallow="tram rail_urban rail rail_electric rail_fast ship" oneway="0"/>
    <type id="highway.primary_link" priority="7" numLanes="1" speed="22.22" disallow="tram rail_urban rail rail_electric rail_fast ship" oneway="0"/>
    <type id="highway.raceway" priority="15" numLanes="2" speed="83.33" allow="vip" oneway="0"/>
    <type id="highway.residential" priority="3" numLanes="1" speed="13.89" disallow="tram rail_urban rail rail_electric rail_fast ship" oneway="0"/>
    <type id="highway.secondary" priority="11" numLanes="2" speed="27.78" disallow="tram rail_urban rail rail_electric rail_fast ship" oneway="0"/>
    <type id="highway.secondary_link" priority="6" numLanes="1" speed="22.22" disallow="tram rail_urban rail rail_electric rail_fast ship" oneway="0"/>
    <type id="highway.service" priority="1" numLanes="1" speed="5.56" allow="pedestrian delivery bicycle" oneway="0"/>
    <type id="highway.stairs" priority="1" numLanes="1" speed="1.39" allow="pedestrian" oneway="1" width="2.00"/>
    <type id="highway.step" priority="1" numLanes="1" speed="1.39" allow="pedestrian" oneway="1" width="2.00"/>
    <type id="highway.steps" priority="1" numLanes="1" speed="1.39" allow="pedestrian" oneway="1" width="2.00"/>
    <type id="highway.tertiary" priority="10" numLanes="1" speed="22.22" disallow="tram rail_urban rail rail_electric rail_fast ship" oneway="0"/>
    <type id="highway.tertiary_link" priority="5" numLanes="1" speed="22.22" disallow="tram rail_urban rail rail_electric rail_fast ship" oneway="0"/>
    <type id="highway.track" priority="1" numLanes="1" speed="5.56" disallow="tram rail_urban rail rail_electric rail_fast ship" oneway="0"/>
<truncated after showing first 30 lines>

TEST FAILED on ts-sim-winbuild-ba : simpla openGap ( Last six runs Oct2019 )

---------- Differences in output ----------
259,260c259,260
< # gap = 19.601
< # speedDiff = -2.48689957516e-14
---
> # gap = 19.601000000000084
> # speedDiff = -2.4868995751603507e-14
266,268c266,268
< speed 19.6
< speed w/o traci 19.6
< acceleration -7.1054273576e-15
---
> speed 19.60000000000002
> speed w/o traci 19.60000000000002
> acceleration -7.105427357601002e-15
270c270
< lanePos 160.169
---
> lanePos 160.16899999999993
277c277
< lanePos 187.27
---
> lanePos 187.26999999999998
279,280c279,280
< # gap = 19.601
< # speedDiff = -1.7763568394e-14
---
> # gap = 19.601000000000056
> # speedDiff = -1.7763568394002505e-14
286,288c286,288
< speed 19.6
<truncated after showing first 30 lines>

TEST FAILED on ts-sim-winbuild-ba : sumo ToCDevice ToC_with_sampled_responseTime ( Last six runs Oct2019 )

---------- Differences in fcd ----------
648c648
<         <vehicle id="ToC_veh" x="54.37" y="1327.89" angle="162.00" type="automated@ToC_veh" speed="19.60" pos="191.19" lane="6/1to7/1_0" slope="0.00"/>
---
>         <vehicle id="ToC_veh" x="54.13" y="1328.63" angle="162.00" type="manual" speed="18.82" pos="190.41" lane="6/1to7/1_0" slope="0.00"/>
651c651
<         <vehicle id="ToC_veh" x="60.32" y="1309.59" angle="162.00" type="manual" speed="19.24" pos="210.43" lane="6/1to7/1_0" slope="0.00"/>
---
>         <vehicle id="ToC_veh" x="60.07" y="1310.33" angle="162.00" type="manual" speed="19.24" pos="209.65" lane="6/1to7/1_0" slope="0.00"/>
654c654
<         <vehicle id="ToC_veh" x="66.14" y="1291.68" angle="162.00" type="manual" speed="18.84" pos="229.26" lane="6/1to7/1_0" slope="0.00"/>
---
>         <vehicle id="ToC_veh" x="65.89" y="1292.42" angle="162.00" type="manual" speed="18.84" pos="228.48" lane="6/1to7/1_0" slope="0.00"/>
657c657
<         <vehicle id="ToC_veh" x="72.16" y="1273.12" angle="162.00" type="manual" speed="19.51" pos="248.77" lane="6/1to7/1_0" slope="0.00"/>
---
>         <vehicle id="ToC_veh" x="71.92" y="1273.87" angle="162.00" type="manual" speed="19.51" pos="247.99" lane="6/1to7/1_0" slope="0.00"/>
660c660
<         <vehicle id="ToC_veh" x="78.09" y="1254.88" angle="162.00" type="manual" speed="19.19" pos="267.96" lane="6/1to7/1_0" slope="0.00"/>
---
>         <vehicle id="ToC_veh" x="77.85" y="1255.62" angle="162.00" type="manual" speed="19.19" pos="267.17" lane="6/1to7/1_0" slope="0.00"/>
663c663
<         <vehicle id="ToC_veh" x="84.05" y="1236.55" angle="162.00" type="manual" speed="19.27" pos="287.23" lane="6/1to7/1_0" slope="0.00"/>
---
>         <vehicle id="ToC_veh" x="83.81" y="1237.29" angle="162.00" type="manual" speed="19.27" pos="286.45" lane="6/1to7/1_0" slope="0.00"/>
666c666
<         <vehicle id="ToC_veh" x="90.02" y="1218.16" angle="162.00" type="manual" speed="19.33" pos="306.56" lane="6/1to7/1_0" slope="0.00"/>
---
>         <vehicle id="ToC_veh" x="89.78" y="1218.90" angle="162.00" type="manual" speed="19.33" pos="305.78" lane="6/1to7/1_0" slope="0.00"/>
669c669
<         <vehicle id="ToC_veh" x="95.76" y="1200.50" angle="162.00" type="manual" speed="18.56" pos="325.13" lane="6/1to7/1_0" slope="0.00"/>
<truncated after showing first 30 lines>
---------- Differences in output ----------
1088,1090c1088,1090
<   currentAwareness = 1.00
<   currentSpeed = 19.6
<   state = PREPARING_TOC
---
>   currentAwareness = 0.25
>   currentSpeed = 18.817638348625042
>   state = RECOVERING
1093c1093
<   currentAwareness = 0.25
---
>   currentAwareness = 0.35
1098c1098
<   currentAwareness = 0.35
---
>   currentAwareness = 0.45
1103c1103
<   currentAwareness = 0.45
---
>   currentAwareness = 0.55
1108c1108
<   currentAwareness = 0.55
---
>   currentAwareness = 0.65
1113c1113
<   currentAwareness = 0.65
---
>   currentAwareness = 0.75
1118c1118
<   currentAwareness = 0.75
<truncated after showing first 30 lines>
---------- Differences in tocs ----------
6c6
<     <ToCdown id="ToC_veh" t="215.00" lane="6/1to7/1_0" lanePos="0.19"/>
---
>     <ToCdown id="ToC_veh" t="214.00" lane="6/1to7/1_0" lanePos="0.17"/>

TEST FAILED on ts-sim-winbuild-ba : sumo ToCDevice dynamic_ToC ( Last six runs Oct2019 )

---------- Differences in output ----------
348,351c348,352
<   currentAwareness = 1.00
<   currentSpeed = 13.89
<   state = PREPARING_TOC
< Time 54.0: Current lane of veh 'ToC_veh': WE_1
---
>   currentAwareness = 0.25
>   currentSpeed = 13.603308550044895
>   state = RECOVERING
> Switched to manual mode: Allowing LCs!
> Time 54.0: Current lane of veh 'ToC_veh': WE_0
354c355
<   currentAwareness = 0.25
---
>   currentAwareness = 0.35
361,362c362,363
<   currentAwareness = 0.35
<   currentSpeed = 13.5805231258
---
>   currentAwareness = 0.45
>   currentSpeed = 13.319624383477494
368,369c369,370
<   currentAwareness = 0.45
<   currentSpeed = 13.3196243835
---
>   currentAwareness = 0.55
>   currentSpeed = 13.244425754002297
375,376c376,377
<   currentAwareness = 0.55
<   currentSpeed = 13.244425754
<truncated after showing first 30 lines>
---------- Differences in tocs ----------
7c7
<     <ToCdown id="ToC_veh" t="53.00" lane="WE_1" lanePos="0.69"/>
---
>     <ToCdown id="ToC_veh" t="52.00" lane="WE_1" lanePos="0.68"/>

TEST FAILED on ts-sim-winbuild-ba : sumo ToCDevice dynamic_ToC_stop ( Last six runs Oct2019 )

---------- Differences in output ----------
556c556
<   currentAwareness = 1.00
---
>   currentAwareness = 0.25
558,559c558,560
<   state = PREPARING_TOC
< Time 90.0: Current lane of veh 'ToC_veh': WE_1
---
>   state = RECOVERING
> Switched to manual mode: Allowing LCs!
> Time 90.0: Current lane of veh 'ToC_veh': WE_0
562c563
<   currentAwareness = 0.25
---
>   currentAwareness = 0.35
566c567
< Time 91.0: Current lane of veh 'ToC_veh': WE_0
---
> Time 91.0: Current lane of veh 'ToC_veh': :gneJ1_0_0
569,570c570,571
<   currentAwareness = 0.35
<   currentSpeed = 0.0
---
>   currentAwareness = 0.45
>   currentSpeed = 2.0296243834774943
576,577c577,578
<   currentAwareness = 0.45
<   currentSpeed = 2.02962438348
---
>   currentAwareness = 0.55
<truncated after showing first 30 lines>
---------- Differences in tocs ----------
7c7
<     <ToCdown id="ToC_veh" t="89.00" lane="WE_1" lanePos="0.99"/>
---
>     <ToCdown id="ToC_veh" t="88.00" lane="WE_1" lanePos="0.99"/>

TEST FAILED on ts-sim-winbuild-ba : sumo lane_change best_lanes ( Last six runs Oct2019 )

---------- Differences in output ----------
9c9
< lane 0 ok
---
> lane 0 mismatches
30,32c30,32
< lane 0 ok
< lane 1 ok
< lane 2 ok
---
> lane 0 mismatches
> lane 1 mismatches
> lane 2 mismatches
53,55c53,55
< lane 0 ok
< lane 1 ok
< lane 2 ok
---
> lane 0 mismatches
> lane 1 mismatches
> lane 2 mismatches
76,78c76,78
< lane 0 ok
< lane 1 ok
< lane 2 ok
---
> lane 0 mismatches
> lane 1 mismatches
> lane 2 mismatches
99,101c99,101
< lane 0 ok
<truncated after showing first 30 lines>

TEST FAILED on ts-sim-winbuild-ba : sumo protobuf ( Last six runs Oct2019 )

---------- Differences in errors ----------
0a1,22
> Traceback (most recent call last):
>   File "C:\Users\delphi\Code\sumoInternal\git\tools\xml\protobuf2xml.py", line 27, in <module>
>     import google.protobuf.descriptor
> ModuleNotFoundError: No module named 'google'
> Traceback (most recent call last):
>   File "C:\Users\delphi\Code\sumoInternal\git\tools\xml\xml2protobuf.py", line 199, in <module>
>     main()
>   File "C:\Users\delphi\Code\sumoInternal\git\tools\xml\xml2protobuf.py", line 186, in main
>     attrFinder.xsdStruc._namedEnumerations, options.protodir, base)
>   File "C:\Users\delphi\Code\sumoInternal\git\tools\xml\xml2protobuf.py", line 151, in generateProto
>     for name, enum in enums.iteritems():
> AttributeError: 'dict' object has no attribute 'iteritems'
> Error: send failed: Software caused tcpip::Socket abort
> Quitting (on error).
> Error: Error on closing output devices.
> Error: send failed: Software caused tcpip::Socket abort
> Traceback (most recent call last):
>   File "C:/Users/delphi/Code/sumoInternal/git/tests\..\tests/complex/sumo/protobuf/runner.py", line 79, in <module>
>     connect(IN_PORT, OUT_PORT)
>   File "C:/Users/delphi/Code/sumoInternal/git/tests\..\tests/complex/sumo/protobuf/runner.py", line 35, in connect
>     i.connect(("localhost", inPort))
> ConnectionRefusedError: [WinError 10061] Es konnte keine Verbindung hergestellt werden, da der Zielcomputer die Verbindung verweigerte
---------- Differences in output ----------
3,7d2
< --- 
< +++ 
< -
< -<trajectories xmlns:xsi="http://www.w3.org/2001/XMLSchema-instance" xsi:noNamespaceSchemaLocation="http://sumo.dlr.de/xsd/amitran/trajectories.xsd" timeStepSize="1000">
< +<trajectories timeStepSize="1000">

TEST FAILED on ts-sim-winbuild-ba : sumo socketout ( Last six runs Oct2019 )

---------- Differences in errors ----------
6a7,16
> Exception in thread Thread-1:
> Traceback (most recent call last):
>   File "C:\Python37\lib\threading.py", line 917, in _bootstrap_inner
>     self.run()
>   File "C:\Python37\lib\threading.py", line 865, in run
>     self._target(*self._args, **self._kwargs)
>   File "C:/Users/delphi/Code/sumoInternal/git/tests\..\tests/complex/sumo/socketout/runner.py", line 50, in main
>     msg = msg + chunk
> TypeError: can only concatenate str (not "bytes") to str
> 
---------- Differences in output ----------
2,30d1
< <?xml version="1.0" encoding="UTF-8"?>
< 
< 
< <meandata xmlns:xsi="http://www.w3.org/2001/XMLSchema-instance" xsi:noNamespaceSchemaLocation="http://sumo.dlr.de/xsd/meandata_file.xsd">
<     <interval begin="0.00" end="60.00" id="dump_60">
<         <edge id="3/1to2/1" sampledSeconds="54.90" CO_abs="1056.825000" CO2_abs="115961.000000" HC_abs="7.304750" PMx_abs="0.684725" NOx_abs="38.170750" fuel_abs="49.848181" electricity_abs="0"
<             CO_normed="162.380282" CO2_normed="17817.311140" HC_normed="1.122369" PMx_normed="0.105207" NOx_normed="5.864904" fuel_normed="7.659131" electricity_normed="0"
<             traveltime="39.05" CO_perVeh="751.712500" CO2_perVeh="82482.277778" HC_perVeh="5.195819" PMx_perVeh="0.487040" NOx_perVeh="27.150597" fuel_perVeh="35.456675" electricity_perVeh="0"/>
<         <edge id="4/1to3/1" sampledSeconds="58.70" CO_abs="1129.975000" CO2_abs="123987.444444" HC_abs="7.810361" PMx_abs="0.732119" NOx_abs="40.812806" fuel_abs="53.298510" electricity_abs="0"
<             CO_normed="173.619718" CO2_normed="19050.567648" HC_normed="1.200055" PMx_normed="0.112490" NOx_normed="6.270854" fuel_normed="8.189272" electricity_normed="0"
<             traveltime="39.05" CO_perVeh="751.712500" CO2_perVeh="82482.277778" HC_perVeh="5.195819" PMx_perVeh="0.487040" NOx_perVeh="27.150597" fuel_perVeh="35.456675" electricity_perVeh="0"/>
<     </interval>
<     <interval begin="60.00" end="120.00" id="dump_60">
<         <edge id="1/1to0/1" sampledSeconds="18.70" CO_abs="359.975000" CO2_abs="39498.555556" HC_abs="2.488139" PMx_abs="0.233231" NOx_abs="13.001694" fuel_abs="16.979253" electricity_abs="0"
<             CO_normed="55.309859" CO2_normed="6068.920188" HC_normed="0.382300" PMx_normed="0.035836" NOx_normed="1.997700" fuel_normed="2.608848" electricity_normed="0"
<             traveltime="39.05" CO_perVeh="751.712500" CO2_perVeh="82482.277778" HC_perVeh="5.195819" PMx_perVeh="0.487040" NOx_perVeh="27.150597" fuel_perVeh="35.456675" electricity_perVeh="0"/>
<         <edge id="2/1to1/1" sampledSeconds="78.70" CO_abs="1514.975000" CO2_abs="166231.888889" HC_abs="10.471472" PMx_abs="0.981564" NOx_abs="54.718361" fuel_abs="71.458139" electricity_abs="0"
<             CO_normed="232.774648" CO2_normed="25541.391379" HC_normed="1.608933" PMx_normed="0.150816" NOx_normed="8.407431" fuel_normed="10.979484" electricity_normed="0"
<             traveltime="39.05" CO_perVeh="751.712500" CO2_perVeh="82482.277778" HC_perVeh="5.195819" PMx_perVeh="0.487040" NOx_perVeh="27.150597" fuel_perVeh="35.456675" electricity_perVeh="0"/>
<         <edge id="3/1to2/1" sampledSeconds="23.80" CO_abs="458.150000" CO2_abs="50270.888889" HC_abs="3.166722" PMx_abs="0.296839" NOx_abs="16.547611" fuel_abs="21.609958" electricity_abs="0"
<             CO_normed="70.394366" CO2_normed="7724.080239" HC_normed="0.486564" PMx_normed="0.045609" NOx_normed="2.542527" fuel_normed="3.320352" electricity_normed="0"
<             traveltime="39.05" CO_perVeh="751.712500" CO2_perVeh="82482.277778" HC_perVeh="5.195819" PMx_perVeh="0.487040" NOx_perVeh="27.150597" fuel_perVeh="35.456675" electricity_perVeh="0"/>
<     </interval>
<     <interval begin="120.00" end="150.00" id="dump_60">
<         <edge id="1/1to0/1" sampledSeconds="57.50" CO_abs="1106.875000" CO2_abs="121452.777778" HC_abs="7.650694" PMx_abs="0.717153" NOx_abs="39.978472" fuel_abs="52.208932" electricity_abs="0"
<             CO_normed="340.140845" CO2_normed="37322.236449" HC_normed="2.351046" PMx_normed="0.220380" NOx_normed="12.285318" fuel_normed="16.043718" electricity_normed="0"
<             traveltime="39.05" CO_perVeh="751.712500" CO2_perVeh="82482.277778" HC_perVeh="5.195819" PMx_perVeh="0.487040" NOx_perVeh="27.150597" fuel_perVeh="35.456675" electricity_perVeh="0"/>
<     </interval>
< </meandata>
<truncated after showing first 30 lines>

TEST FAILED on ts-sim-winbuild-ba : sumo speedMap ( Last six runs Oct2019 )

---------- Differences in errors ----------
1,36c1,4
< Warning: Teleporting vehicle '8'; collision with vehicle '7', lane='1/1to2/1_0', gap=-0.49, time=1.00 stage=move.
< Warning: Teleporting vehicle '14'; collision with vehicle '13', lane='1/1to2/1_0', gap=-0.14, time=1.00 stage=move.
< Warning: Teleporting vehicle '18'; collision with vehicle '17', lane='1/1to2/1_0', gap=-0.19, time=1.00 stage=move.
< Warning: Vehicle '8' ends teleporting on edge '2/1to3/1', time 1.00.
< Warning: Vehicle '14' ends teleporting on edge '2/1to3/1', time 1.00.
< Warning: Vehicle '18' ends teleporting on edge '2/1to3/1', time 1.00.
< Warning: Teleporting vehicle '5'; collision with vehicle '4', lane='1/1to2/1_0', gap=-0.26, time=2.00 stage=move.
< Warning: Teleporting vehicle '12'; collision with vehicle '11', lane='1/1to2/1_0', gap=-0.38, time=2.00 stage=move.
< Warning: Teleporting vehicle '21'; collision with vehicle '20', lane='1/1to2/1_0', gap=-0.30, time=2.00 stage=move.
< Warning: Vehicle '5' ends teleporting on edge '2/1to3/1', time 2.00.
< Warning: Vehicle '12' ends teleporting on edge '2/1to3/1', time 2.00.
< Warning: Vehicle '21' ends teleporting on edge '2/1to3/1', time 2.00.
< Warning: Teleporting vehicle '3'; collision with vehicle '2', lane='1/1to2/1_0', gap=-0.44, time=3.00 stage=move.
< Warning: Teleporting vehicle '11'; collision with vehicle '10', lane='1/1to2/1_0', gap=-0.37, time=3.00 stage=move.
< Warning: Vehicle '3' ends teleporting on edge '2/1to3/1', time 3.00.
< Warning: Vehicle '11' ends teleporting on edge '2/1to3/1', time 3.00.
< Warning: Teleporting vehicle '23'; collision with vehicle '22', lane='1/1to2/1_0', gap=-0.20, time=4.00 stage=move.
< Warning: Vehicle '23' ends teleporting on edge '2/1to3/1', time 4.00.
< Warning: Teleporting vehicle '13'; collision with vehicle '10', lane='1/1to2/1_0', gap=-0.49, time=6.00 stage=move.
< Warning: Vehicle '13' ends teleporting on edge '2/1to3/1', time 6.00.
< Warning: Teleporting vehicle '4'; collision with vehicle '2', lane='1/1to2/1_0', gap=-0.03, time=7.00 stage=move.
< Warning: Vehicle '4' ends teleporting on edge '2/1to3/1', time 7.00.
< Warning: Teleporting vehicle '15'; collision with vehicle '10', lane='1/1to2/1_0', gap=-0.74, time=8.00 stage=move.
< Warning: Vehicle '15' ends teleporting on edge '2/1to3/1', time 8.00.
< Warning: Teleporting vehicle '22'; collision with vehicle '20', lane='1/1to2/1_0', gap=-0.08, time=12.00 stage=move.
< Warning: Vehicle '22' ends teleporting on edge '2/1to3/1', time 12.00.
< Warning: Teleporting vehicle '9'; collision with vehicle '7', lane='1/1to2/1_0', gap=-1.53, time=13.00 stage=move.
< Warning: Teleporting vehicle '17'; collision with vehicle '16', lane='1/1to2/1_0', gap=-0.92, time=13.00 stage=move.
< Warning: Vehicle '9' ends teleporting on edge '2/1to3/1', time 13.00.
<truncated after showing first 30 lines>
---------- Differences in output ----------
2,10d1
< Loading configuration... done.
< Loading configuration... done.
< Loading configuration... done.
< Loading configuration... done.
< Loading configuration... done.
< Loading configuration... done.
< Loading configuration... done.
< Loading configuration... done.
< Loading configuration... done.
---------- Differences in state ----------
39,63c39,63
<                 <vehicle id="24" pos="308.00" speed="0.00"/>
<                 <vehicle id="23" pos="316.00" speed="0.00"/>
<                 <vehicle id="22" pos="324.00" speed="0.00"/>
<                 <vehicle id="21" pos="332.00" speed="0.00"/>
<                 <vehicle id="20" pos="340.00" speed="0.00"/>
<                 <vehicle id="19" pos="348.00" speed="0.00"/>
<                 <vehicle id="18" pos="356.00" speed="0.00"/>
<                 <vehicle id="17" pos="364.00" speed="0.00"/>
<                 <vehicle id="16" pos="372.00" speed="0.00"/>
<                 <vehicle id="15" pos="380.00" speed="0.00"/>
<                 <vehicle id="14" pos="388.00" speed="0.00"/>
<                 <vehicle id="13" pos="396.00" speed="0.00"/>
<                 <vehicle id="12" pos="404.00" speed="0.00"/>
<                 <vehicle id="11" pos="412.00" speed="0.00"/>
<                 <vehicle id="10" pos="420.00" speed="0.00"/>
<                 <vehicle id="9" pos="428.00" speed="0.00"/>
<                 <vehicle id="8" pos="436.00" speed="0.00"/>
<                 <vehicle id="7" pos="444.00" speed="0.00"/>
<                 <vehicle id="6" pos="452.00" speed="0.00"/>
<                 <vehicle id="5" pos="460.00" speed="0.00"/>
<                 <vehicle id="4" pos="468.00" speed="0.00"/>
<                 <vehicle id="3" pos="476.00" speed="0.00"/>
<                 <vehicle id="2" pos="484.00" speed="0.00"/>
<                 <vehicle id="1" pos="492.00" speed="0.00"/>
<                 <vehicle id="0" pos="502.60" speed="2.60"/>
---
>                 <vehicle id="24" pos="308.45" speed="0.45"/>
>                 <vehicle id="23" pos="316.37" speed="0.37"/>
>                 <vehicle id="22" pos="324.33" speed="0.33"/>
<truncated after showing first 30 lines>

TEST FAILED on ts-sim-winbuild-ba : traas webservice ( Last six runs Oct2019 )

---------- Differences in errors ----------
0a1,49
> Okt 13, 2019 7:38:33 AM com.sun.xml.ws.server.sei.TieHandler createResponse
> SCHWERWIEGEND: null
> java.lang.NullPointerException
> 	at de.tudresden.sumo.util.Sumo.start_ws(Sumo.java:140)
> 	at de.tudresden.ws.ServiceImpl.start(ServiceImpl.java:66)
> 	at sun.reflect.NativeMethodAccessorImpl.invoke0(Native Method)
> 	at sun.reflect.NativeMethodAccessorImpl.invoke(Unknown Source)
> 	at sun.reflect.DelegatingMethodAccessorImpl.invoke(Unknown Source)
> 	at java.lang.reflect.Method.invoke(Unknown Source)
> 	at com.sun.xml.ws.util.Trampoline.invoke(MethodUtil.java:82)
> 	at sun.reflect.NativeMethodAccessorImpl.invoke0(Native Method)
> 	at sun.reflect.NativeMethodAccessorImpl.invoke(Unknown Source)
> 	at sun.reflect.DelegatingMethodAccessorImpl.invoke(Unknown Source)
> 	at java.lang.reflect.Method.invoke(Unknown Source)
> 	at com.sun.xml.ws.util.MethodUtil.invoke(MethodUtil.java:107)
> 	at com.sun.xml.ws.api.server.MethodUtil.invoke(MethodUtil.java:64)
> 	at com.sun.xml.ws.api.server.InstanceResolver$1.invoke(InstanceResolver.java:250)
> 	at com.sun.xml.ws.server.InvokerTube$2.invoke(InvokerTube.java:149)
> 	at com.sun.xml.ws.server.sei.SEIInvokerTube.processRequest(SEIInvokerTube.java:88)
> 	at com.sun.xml.ws.api.pipe.Fiber.__doRun(Fiber.java:1136)
> 	at com.sun.xml.ws.api.pipe.Fiber._doRun(Fiber.java:1050)
> 	at com.sun.xml.ws.api.pipe.Fiber.doRun(Fiber.java:1019)
> 	at com.sun.xml.ws.api.pipe.Fiber.runSync(Fiber.java:877)
> 	at com.sun.xml.ws.server.WSEndpointImpl$2.process(WSEndpointImpl.java:419)
> 	at com.sun.xml.ws.transport.http.HttpAdapter$HttpToolkit.handle(HttpAdapter.java:868)
> 	at com.sun.xml.ws.transport.http.HttpAdapter.handle(HttpAdapter.java:422)
> 	at com.sun.xml.ws.transport.http.server.WSHttpHandler.handleExchange(WSHttpHandler.java:113)
> 	at com.sun.xml.ws.transport.http.server.WSHttpHandler.handle(WSHttpHandler.java:97)
> 	at com.sun.net.httpserver.Filter$Chain.doFilter(Unknown Source)
<truncated after showing first 30 lines>

TEST FAILED on ts-sim-winbuild-ba : traci busySocket sumo-gui ( Last six runs Oct2019 )

---------- Differences in output ----------
1,2d0
< Loading configuration... done.
< Loading configuration... done.

TEST FAILED on ts-sim-winbuild-ba : traci clientCloses sumo-gui ( Last six runs Oct2019 )

---------- Differences in output ----------
3,4c3
< Loading configuration... done.
< Print ended at step 100
---
> Print ended at step 100.0
6,7c5
< Loading configuration... done.
< Print ended at step 100
---
> Print ended at step 100.0
10,11c8
< Loading configuration... done.
< Print ended at step 100
---
> Print ended at step 100.0
13,14c10
< Loading configuration... done.
< Print ended at step 100
---
> Print ended at step 100.0
17,18c13
< Loading configuration... done.
< Print ended at step 100
---
> Print ended at step 100.0
20,21c15
< Loading configuration... done.
< Print ended at step 100
---
> Print ended at step 100.0
<truncated after showing first 30 lines>

2 TESTS FAILED on ts-sim-winbuild-ba :

---------- Differences in output ----------
1d0
< Loading configuration... done.
traci closingOutput sumo-gui ( Last six runs Oct2019 )
traci pythonApi polygon_dynamics_gui ( Last six runs Oct2019 )

TEST FAILED on ts-sim-winbuild-ba : traci multipleConnections concurringSubscriptions sumo ( Last six runs Oct2019 )

---------- Differences in output ----------
44d43
<    1 vehicle subscription results: {'horiz': {64: 0.01613915640426617, 70: 2.6}}
46,47d44
<    1 vehicle subscription results: {'horiz': {64: 0.5315016328959228, 70: 2.6}}
<    1 vehicle subscription results: {'horiz': {64: 1.4338497789110989, 70: 2.6}}
50,51d46
<    1 vehicle subscription results: {'horiz': {64: 1.4893398348105495, 70: 2.6}}
<    1 vehicle subscription results: {'horiz': {64: 10.523440164644573, 70: 2.6}}
54,55d48
<    1 vehicle subscription results: {'horiz': {64: 10.526434975504245, 70: 2.6}}
<    1 vehicle subscription results: {'horiz': {64: 10.532165719699416, 70: 2.6}}
58d50
<    1 vehicle subscription results: {'horiz': {64: 10.535951593392829, 70: 2.6}}
60,61d51
<    1 vehicle subscription results: {'horiz': {64: 10.536626112382228, 70: 2.6}}
<    1 vehicle subscription results: {'horiz': {64: 10.54520899990138, 70: 2.6}}
64,65d53
<    1 vehicle subscription results: {'horiz': {64: 10.618038373291794, 70: 2.6}}
<    1 vehicle subscription results: {'horiz': {64: 10.638090702719357, 70: 2.6}}
68,69d55
<    1 vehicle subscription results: {'horiz': {64: 10.650777486912276, 70: 2.6}}
<    1 vehicle subscription results: {'horiz': {64: 10.66834688889794, 70: 2.6}}
72d57
<    1 vehicle subscription results: {'horiz': {64: 10.673222782849635, 70: 2.6}}
74,75d58
<    1 vehicle subscription results: {'horiz': {64: 10.689824454989585, 70: 2.6}}
<    1 vehicle subscription results: {'horiz': {64: 10.70680370327581, 70: 2.6}}
78,79d60
<    1 vehicle subscription results: {'horiz': {64: 10.715621645297224, 70: 2.6}}
<    1 vehicle subscription results: {'horiz': {64: 10.725812634164768, 70: 2.6}}
<truncated after showing first 30 lines>

TEST FAILED on ts-sim-winbuild-ba : traci pythonApi gui ( Last six runs Oct2019 )

---------- Differences in output ----------
1d0
< Loading configuration... done.
---------- Differences in png ----------
Binary files C:/Users/delphi/Code/sumoInternal/msvc12extrax64texttesttmp/msvc12extrax64.13Oct073121.3324/complex.python3/traci/pythonApi/gui/framework_tmp/png.complexorigcmp and C:/Users/delphi/Code/sumoInternal/msvc12extrax64texttesttmp/msvc12extrax64.13Oct073121.3324/complex.python3/traci/pythonApi/gui/framework_tmp/png.complexcmp differ

TEST FAILED on ts-sim-winbuild-ba : traci pythonApi load ( Last six runs Oct2019 )

---------- Differences in output ----------
2,6c2,4
< Loading configuration... done.
< Loading configuration... done.
< step=1 departed=('horiz',)
< step=2 departed=()
< step=3 departed=()
---
> step=1.0 departed=('horiz',)
> step=2.0 departed=()
> step=3.0 departed=()

TEST FAILED on ts-sim-winbuild-ba : tutorial city_mobil ( Last six runs Oct2019 )

---------- Differences in output ----------
4c4
< waiting time (max, mean, dev): True True True
---
> waiting time (max, mean, dev): False True False
19,20c19,20
< ('footmainout', 'footmain6to7') True True True
< ('footmainout', 'footmain7to8') True True True
---
> ('footmainout', 'footmain6to7') True True False
> ('footmainout', 'footmain7to8') True True False
22c22
< waiting time (max, mean, dev): True True True
---
> waiting time (max, mean, dev): False True False
37,38c37,38
< ('footmainout', 'footmain6to7') True True True
< ('footmainout', 'footmain7to8') True True True
---
> ('footmainout', 'footmain6to7') True True False
> ('footmainout', 'footmain7to8') True True False

Detailed information for the tests that had known bugs:

TEST had known bugs (bug 1691 (NONEXISTENT)) on ts-sim-winbuild-ba : netconvert dlr-navteq_roundtrip ( Last six runs Oct2019 )

Failed to open URL 'https://sumo.dlr.de/trac.wsgi/ticket/1691?format=tab': <urlopen error [SSL: CERTIFICATE_VERIFY_FAILED] certificate verify failed (_ssl.c:590)>.

Please make sure that bug 1691 exists
and that the configuration entry 'bug_system_location' points to the correct trac instance.
The current value is 'https://sumo.dlr.de/trac.wsgi/'.
(This bug was triggered by text found in file 'net' matching '.*')
---------- Differences in net ----------
4c4
< <net version="1.1" junctionCornerDetail="5" limitTurnSpeed="5.50" xmlns:xsi="http://www.w3.org/2001/XMLSchema-instance" xsi:noNamespaceSchemaLocation="http://sumo.dlr.de/xsd/net_file.xsd">
---
> <net version="1.3" junctionCornerDetail="5" limitTurnSpeed="5.50" xmlns:xsi="http://www.w3.org/2001/XMLSchema-instance" xsi:noNamespaceSchemaLocation="http://sumo.dlr.de/xsd/net_file.xsd">
2768c2768
<     <connection from="-26816553" to="26816541" fromLane="0" toLane="0" via=":294168098_5_0" dir="L" state="="/>
---
>     <connection from="-26816553" to="26816541" fromLane="0" toLane="0" via=":294168098_5_0" dir="l" state="="/>
2975c2975
<     <connection from="27445116" to="27445117" fromLane="0" toLane="0" via=":294169338_0_0" dir="s" state="="/>
---
>     <connection from="27445116" to="27445117" fromLane="0" toLane="0" via=":294169338_0_0" dir="R" state="="/>
3216c3216
<     <connection from=":294168098_5" to="26816541" fromLane="0" toLane="0" dir="L" state="M"/>
---
>     <connection from=":294168098_5" to="26816541" fromLane="0" toLane="0" dir="l" state="M"/>
3241c3241
<     <connection from=":294169338_0" to="27445117" fromLane="0" toLane="0" dir="s" state="M"/>
---
>     <connection from=":294169338_0" to="27445117" fromLane="0" toLane="0" dir="R" state="M"/>

TEST had known bugs (bug 1691 (NONEXISTENT)) on ts-sim-winbuild-ba : netconvert matsim_roundtrip ( Last six runs Oct2019 )

Failed to open URL 'https://sumo.dlr.de/trac.wsgi/ticket/1691?format=tab': <urlopen error [SSL: CERTIFICATE_VERIFY_FAILED] certificate verify failed (_ssl.c:590)>.

Please make sure that bug 1691 exists
and that the configuration entry 'bug_system_location' points to the correct trac instance.
The current value is 'https://sumo.dlr.de/trac.wsgi/'.
(This bug was triggered by text found in file 'net' matching '.*')
---------- Differences in net ----------
4c4
< <net version="1.1" junctionCornerDetail="5" limitTurnSpeed="5.50" xmlns:xsi="http://www.w3.org/2001/XMLSchema-instance" xsi:noNamespaceSchemaLocation="http://sumo.dlr.de/xsd/net_file.xsd">
---
> <net version="1.3" junctionCornerDetail="5" limitTurnSpeed="5.50" xmlns:xsi="http://www.w3.org/2001/XMLSchema-instance" xsi:noNamespaceSchemaLocation="http://sumo.dlr.de/xsd/net_file.xsd">
880c880
<         <lane id=":294830184_7_0" index="0" speed="5.56" length="14.38" shape="915.07,462.77 918.06,460.17 921.14,459.20 924.29,459.87 927.52,462.17"/>
---
>         <lane id=":294830184_7_0" index="0" speed="5.56" length="13.52" shape="915.07,462.77 917.74,460.95 921.19,460.22 924.69,460.61 927.52,462.17"/>
3708c3708
<     <connection from="-26004787#2" to="26004966#2" fromLane="0" toLane="0" via=":283722837_12_0" dir="s" state="="/>
---
>     <connection from="-26004787#2" to="26004966#2" fromLane="0" toLane="0" via=":283722837_12_0" dir="R" state="="/>
3724c3724
<     <connection from="-26004868#0" to="-5198585#7" fromLane="0" toLane="0" via=":283719736_13_0" dir="R" state="m"/>
---
>     <connection from="-26004868#0" to="-5198585#7" fromLane="0" toLane="0" via=":283719736_13_0" dir="r" state="m"/>
3747c3747
<     <connection from="-26816553" to="-26816413#1" fromLane="0" toLane="0" via=":294168098_4_0" dir="R" state="="/>
---
>     <connection from="-26816553" to="-26816413#1" fromLane="0" toLane="0" via=":294168098_4_0" dir="r" state="="/>
4015c4015
<     <connection from="26816413#1" to="26816553" fromLane="0" toLane="0" via=":294168098_1_0" dir="L" state="="/>
---
>     <connection from="26816413#1" to="26816553" fromLane="0" toLane="0" via=":294168098_1_0" dir="l" state="="/>
4023c4023
<     <connection from="26816590#0" to="26816590#1" fromLane="0" toLane="0" via=":294169338_0_0" dir="s" state="="/>
---
>     <connection from="26816590#0" to="26816590#1" fromLane="0" toLane="0" via=":294169338_0_0" dir="R" state="="/>
4037c4037
<     <connection from="26843038#0" to="26843038#1" fromLane="0" toLane="0" via=":294830184_7_0" dir="L" state="="/>
<truncated after showing first 30 lines>

TEST had known bugs (see #254) on ts-sim-winbuild-ba : sumo output one_vehicle ( Last six runs Oct2019 )

different outputs from detectors which should detect the same
(This bug was triggered by text found in file 'output' matching 'failed')
---------- Differences in output ----------
10c10
< success 0.1 ['--step-length', '.1', '--end', '100'] ['3/1to2/1_0']
---
> failed 0.1 ['--step-length', '.1', '--end', '100'] 3/1to2/1_0 (71.3, 71.4) <zip object at 0x0000002ABBCAF0C8>
12c12
< success 1 ['--step-length', '.1', '--end', '100'] ['3/1to2/1_0']
---
> failed 1 ['--step-length', '.1', '--end', '100'] 3/1to2/1_0 (72.0, 73.0) <zip object at 0x0000002ABB834848>
14c14
< success 10 ['--step-length', '.1', '--end', '100'] ['3/1to2/1_0']
---
> failed 10 ['--step-length', '.1', '--end', '100'] 3/1to2/1_0 (80.0, 90.0) <zip object at 0x0000002ABB834288>
18c18
< success 0.1 ['--step-length', '.1', '--end', '1000'] ['3/1to2/1_0']
---
> failed 0.1 ['--step-length', '.1', '--end', '1000'] 3/1to2/1_0 (71.3, 71.4) <zip object at 0x0000002ABC30F088>
20c20
< success 1 ['--step-length', '.1', '--end', '1000'] ['3/1to2/1_0']
---
> failed 1 ['--step-length', '.1', '--end', '1000'] 3/1to2/1_0 (72.0, 73.0) <zip object at 0x0000002ABB8D5E48>
22c22
< success 10 ['--step-length', '.1', '--end', '1000'] ['3/1to2/1_0']
---
> failed 10 ['--step-length', '.1', '--end', '1000'] 3/1to2/1_0 (80.0, 90.0) <zip object at 0x0000002ABBC9A748>
24c24
< success 100 ['--step-length', '.1', '--end', '1000'] ['3/1to2/1_0']
---
> failed 100 ['--step-length', '.1', '--end', '1000'] 3/1to2/1_0 (100.0, 200.0) <zip object at 0x0000002ABBC1F488>
34c34
< success 0.1 ['--step-length', '1', '--end', '100'] ['3/1to2/1_0']
<truncated after showing first 30 lines>

TEST had known bugs (see #254) on ts-sim-winbuild-ba : sumo output teleport ( Last six runs Oct2019 )

different outputs from detectors which should detect the same
(This bug was triggered by text found in file 'output' matching 'failed')
---------- Differences in output ----------
2c2
< success ['--step-length', '.1', '--end', '51'] ['2/1to1/1_0']
---
> success 0.1 ['--step-length', '.1', '--end', '51'] ['2/1to1/1_0']
4c4
< success ['--step-length', '.1', '--end', '51'] ['2/1to1/1_0', '1/1to0/1_0']
---
> success 0.1 ['--step-length', '.1', '--end', '51'] ['2/1to1/1_0', '1/1to0/1_0']
6c6
< success ['--step-length', '.1', '--end', '51'] ['2/1to1/1_0']
---
> success 1 ['--step-length', '.1', '--end', '51'] ['2/1to1/1_0']
8c8
< success ['--step-length', '.1', '--end', '51'] ['2/1to1/1_0', '1/1to0/1_0']
---
> success 1 ['--step-length', '.1', '--end', '51'] ['2/1to1/1_0', '1/1to0/1_0']
10c10
< success ['--step-length', '.1', '--end', '51'] ['2/1to1/1_0']
---
> success 10 ['--step-length', '.1', '--end', '51'] ['2/1to1/1_0']
12c12
< success ['--step-length', '.1', '--end', '51'] ['2/1to1/1_0', '1/1to0/1_0']
---
> success 10 ['--step-length', '.1', '--end', '51'] ['2/1to1/1_0', '1/1to0/1_0']
14c14
< success ['--step-length', '.1', '--end', '51'] ['2/1to1/1_0']
---
> success 100 ['--step-length', '.1', '--end', '51'] ['2/1to1/1_0']
16c16
< success ['--step-length', '.1', '--end', '51'] ['2/1to1/1_0', '1/1to0/1_0']
<truncated after showing first 30 lines>

TEST had known bugs (see #254) on ts-sim-winbuild-ba : sumo output teleport_multihop ( Last six runs Oct2019 )

different outputs from detectors which should detect the same
(This bug was triggered by text found in file 'output' matching 'failed')
---------- Differences in output ----------
34c34
< success 0.1 ['--step-length', '.1', '--end', '1000'] 2/1to1/1_0 (230.0, 230.1) [('e2', 9.99), ('e3', 10.0), ('edge', 9.99), ('lane', 9.99)]
---
> failed 0.1 ['--step-length', '.1', '--end', '1000'] 2/1to1/1_0 (149.0, 149.1) <zip object at 0x000000141BAC4A48>
36c36
< success 0.1 ['--step-length', '.1', '--end', '1000'] 1/1to0/1_0 (148.1, 148.2) [('e2', 9.99), ('e3', 10.0), ('edge', 9.99), ('lane', 9.99)]
---
> failed 0.1 ['--step-length', '.1', '--end', '1000'] 2/1to1/1_0 (149.0, 149.1) <zip object at 0x000000141BEBB088>
38c38
< success 1 ['--step-length', '.1', '--end', '1000'] 2/1to1/1_0 (230.0, 231.0) [('e2', 9.99), ('e3', 10.0), ('edge', 9.99), ('lane', 9.99)]
---
> failed 1 ['--step-length', '.1', '--end', '1000'] 2/1to1/1_0 (149.0, 150.0) <zip object at 0x000000141BABC7C8>
40c40
< success 1 ['--step-length', '.1', '--end', '1000'] 1/1to0/1_0 (148.0, 149.0) [('e2', 9.91), ('e3', 10.0), ('edge', 9.91), ('lane', 9.91)]
---
> failed 1 ['--step-length', '.1', '--end', '1000'] 2/1to1/1_0 (149.0, 150.0) <zip object at 0x000000141B34ABC8>
42c42
< success 10 ['--step-length', '.1', '--end', '1000'] 2/1to1/1_0 (230.0, 240.0) [('e2', 9.42), ('e3', 9.9), ('edge', 9.42), ('lane', 9.42)]
---
> failed 10 ['--step-length', '.1', '--end', '1000'] 2/1to1/1_0 (140.0, 150.0) <zip object at 0x000000141AE97808>
44c44
< success 10 ['--step-length', '.1', '--end', '1000'] 1/1to0/1_0 (140.0, 150.0) [('e2', 9.96), ('e3', 9.99), ('edge', 9.96), ('lane', 9.96)]
---
> failed 10 ['--step-length', '.1', '--end', '1000'] 2/1to1/1_0 (140.0, 150.0) <zip object at 0x000000141AE97808>
46c46
< success 100 ['--step-length', '.1', '--end', '1000'] 2/1to1/1_0 (200.0, 300.0) [('e1', 10.0), ('e2', 9.22), ('e3', 5.71), ('edge', 9.22), ('lane', 9.22)]
---
> failed 100 ['--step-length', '.1', '--end', '1000'] 2/1to1/1_0 (100.0, 200.0) <zip object at 0x000000141ADF8188>
48c48
< success 100 ['--step-length', '.1', '--end', '1000'] 1/1to0/1_0 (100.0, 200.0) [('e1', 9.53), ('e2', 5.82), ('e3', 6.93), ('edge', 5.82), ('lane', 5.82)]
<truncated after showing first 30 lines>

TEST had known bugs (see #254) on ts-sim-winbuild-ba : sumo output teleport_multihop_newDefaults ( Last six runs Oct2019 )

different outputs from detectors which should detect the same
(This bug was triggered by text found in file 'output' matching 'failed')
---------- Differences in output ----------
18c18
< success 0.1 ['--step-length', '.1', '--end', '100'] ['2/1to1/1_0']
---
> failed 0.1 ['--step-length', '.1', '--end', '100'] 2/1to1/1_0 (76.2, 76.3) <zip object at 0x0000006938F1A148>
20c20
< success 0.1 ['--step-length', '.1', '--end', '100'] ['2/1to1/1_0', '1/1to0/1_0']
---
> failed 0.1 ['--step-length', '.1', '--end', '100'] 2/1to1/1_0 (76.2, 76.3) <zip object at 0x0000006938F5E148>
22c22
< success 1 ['--step-length', '.1', '--end', '100'] ['2/1to1/1_0']
---
> failed 1 ['--step-length', '.1', '--end', '100'] 2/1to1/1_0 (76.0, 77.0) <zip object at 0x0000006938F5AFC8>
24c24
< success 1 ['--step-length', '.1', '--end', '100'] ['2/1to1/1_0', '1/1to0/1_0']
---
> failed 1 ['--step-length', '.1', '--end', '100'] 2/1to1/1_0 (76.0, 77.0) <zip object at 0x0000006938A2BB88>
26c26
< success 10 ['--step-length', '.1', '--end', '100'] ['2/1to1/1_0']
---
> failed 10 ['--step-length', '.1', '--end', '100'] 2/1to1/1_0 (70.0, 80.0) <zip object at 0x0000006938A88848>
28c28
< success 10 ['--step-length', '.1', '--end', '100'] ['2/1to1/1_0', '1/1to0/1_0']
---
> failed 10 ['--step-length', '.1', '--end', '100'] 2/1to1/1_0 (70.0, 80.0) <zip object at 0x0000006938F5AFC8>
30c30
< success 100 ['--step-length', '.1', '--end', '100'] ['2/1to1/1_0']
---
> failed 100 ['--step-length', '.1', '--end', '100'] 2/1to1/1_0 (0.0, 100.0) <zip object at 0x0000006938A93708>
32c32
< success 100 ['--step-length', '.1', '--end', '100'] ['2/1to1/1_0', '1/1to0/1_0']
<truncated after showing first 30 lines>

TEST had known bugs (see #254) on ts-sim-winbuild-ba : sumo output two_same_vehicles ( Last six runs Oct2019 )

different outputs from detectors which should detect the same
(This bug was triggered by text found in file 'output' matching 'failed')
---------- Differences in output ----------
10c10
< success 0.1 ['--step-length', '.1', '--end', '100'] ['3/1to2/1_0']
---
> failed 0.1 ['--step-length', '.1', '--end', '100'] 3/1to2/1_0 (75.4, 75.5) <zip object at 0x000000A9B5813208>
12c12
< success 1 ['--step-length', '.1', '--end', '100'] ['3/1to2/1_0']
---
> failed 1 ['--step-length', '.1', '--end', '100'] 3/1to2/1_0 (76.0, 77.0) <zip object at 0x000000A9B533F608>
14c14
< success 10 ['--step-length', '.1', '--end', '100'] ['3/1to2/1_0']
---
> failed 10 ['--step-length', '.1', '--end', '100'] 3/1to2/1_0 (80.0, 90.0) <zip object at 0x000000A9B533F608>
18c18
< success 0.1 ['--step-length', '.1', '--end', '1000'] ['3/1to2/1_0']
---
> failed 0.1 ['--step-length', '.1', '--end', '1000'] 3/1to2/1_0 (75.4, 75.5) <zip object at 0x000000A9B5E71B48>
20c20
< success 1 ['--step-length', '.1', '--end', '1000'] ['3/1to2/1_0']
---
> failed 1 ['--step-length', '.1', '--end', '1000'] 3/1to2/1_0 (76.0, 77.0) <zip object at 0x000000A9B581E888>
22c22
< success 10 ['--step-length', '.1', '--end', '1000'] ['3/1to2/1_0']
---
> failed 10 ['--step-length', '.1', '--end', '1000'] 3/1to2/1_0 (80.0, 90.0) <zip object at 0x000000A9B57C65C8>
24c24
< success 100 ['--step-length', '.1', '--end', '1000'] ['3/1to2/1_0']
---
> failed 100 ['--step-length', '.1', '--end', '1000'] 3/1to2/1_0 (100.0, 200.0) <zip object at 0x000000A9B57C65C8>
34c34
< success 0.1 ['--step-length', '1', '--end', '100'] ['3/1to2/1_0']
<truncated after showing first 30 lines>

TEST had known bugs (see #254) on ts-sim-winbuild-ba : sumo output two_vehicles_diff_length ( Last six runs Oct2019 )

different outputs from detectors which should detect the same
(This bug was triggered by text found in file 'output' matching 'failed')
---------- Differences in output ----------
10c10
< success 0.1 ['--step-length', '.1', '--end', '100'] ['3/1to2/1_0']
---
> failed 0.1 ['--step-length', '.1', '--end', '100'] 3/1to2/1_0 (76.4, 76.5) <zip object at 0x000000A97E6235C8>
12c12
< success 1 ['--step-length', '.1', '--end', '100'] ['3/1to2/1_0']
---
> failed 1 ['--step-length', '.1', '--end', '100'] 3/1to2/1_0 (77.0, 78.0) <zip object at 0x000000A97E1921C8>
14c14
< success 10 ['--step-length', '.1', '--end', '100'] ['3/1to2/1_0']
---
> failed 10 ['--step-length', '.1', '--end', '100'] 3/1to2/1_0 (80.0, 90.0) <zip object at 0x000000A97E148A88>
18c18
< success 0.1 ['--step-length', '.1', '--end', '1000'] ['3/1to2/1_0']
---
> failed 0.1 ['--step-length', '.1', '--end', '1000'] 3/1to2/1_0 (76.4, 76.5) <zip object at 0x000000A97EC81EC8>
20c20
< success 1 ['--step-length', '.1', '--end', '1000'] ['3/1to2/1_0']
---
> failed 1 ['--step-length', '.1', '--end', '1000'] 3/1to2/1_0 (77.0, 78.0) <zip object at 0x000000A97E5EE0C8>
22c22
< success 10 ['--step-length', '.1', '--end', '1000'] ['3/1to2/1_0']
---
> failed 10 ['--step-length', '.1', '--end', '1000'] 3/1to2/1_0 (80.0, 90.0) <zip object at 0x000000A97E5D8948>
24c24
< success 100 ['--step-length', '.1', '--end', '1000'] ['3/1to2/1_0']
---
> failed 100 ['--step-length', '.1', '--end', '1000'] 3/1to2/1_0 (100.0, 200.0) <zip object at 0x000000A97E5D8548>
34c34
< success 0.1 ['--step-length', '1', '--end', '100'] ['3/1to2/1_0']
<truncated after showing first 30 lines>

TEST had known bugs (see #254) on ts-sim-winbuild-ba : sumo output two_vehicles_diff_speed ( Last six runs Oct2019 )

different outputs from detectors which should detect the same
(This bug was triggered by text found in file 'output' matching 'failed')
---------- Differences in output ----------
0a1,48
> Loading configuration... done.
> failed 0.1 ['--step-length', '.1', '--end', '51'] 3/1to2/1_0 (38.4, 38.5) <zip object at 0x00000041429C8148>
> Loading configuration... done.
> failed 1 ['--step-length', '.1', '--end', '51'] 3/1to2/1_0 (38.0, 39.0) <zip object at 0x00000041429C8088>
> Loading configuration... done.
> failed 10 ['--step-length', '.1', '--end', '51'] 3/1to2/1_0 (30.0, 40.0) <zip object at 0x00000041429C8088>
> Loading configuration... done.
> failed 100 ['--step-length', '.1', '--end', '51'] 3/1to2/1_0 (0.0, 51.0) <zip object at 0x00000041429C89C8>
> Loading configuration... done.
> failed 0.1 ['--step-length', '.1', '--end', '100'] 3/1to2/1_0 (38.4, 38.5) <zip object at 0x00000041429F7A88>
> Loading configuration... done.
> failed 1 ['--step-length', '.1', '--end', '100'] 3/1to2/1_0 (38.0, 39.0) <zip object at 0x0000004142611408>
> Loading configuration... done.
> failed 10 ['--step-length', '.1', '--end', '100'] 3/1to2/1_0 (30.0, 40.0) <zip object at 0x0000004142611408>
> Loading configuration... done.
> failed 100 ['--step-length', '.1', '--end', '100'] 3/1to2/1_0 (0.0, 100.0) <zip object at 0x0000004142622108>
> Loading configuration... done.
> failed 0.1 ['--step-length', '.1', '--end', '1000'] 3/1to2/1_0 (38.4, 38.5) <zip object at 0x0000004143057508>
> Loading configuration... done.
> failed 1 ['--step-length', '.1', '--end', '1000'] 3/1to2/1_0 (38.0, 39.0) <zip object at 0x00000041429C4908>
> Loading configuration... done.
> failed 10 ['--step-length', '.1', '--end', '1000'] 3/1to2/1_0 (30.0, 40.0) <zip object at 0x00000041429A57C8>
> Loading configuration... done.
> failed 100 ['--step-length', '.1', '--end', '1000'] 3/1to2/1_0 (0.0, 100.0) <zip object at 0x00000041429A57C8>
> Loading configuration... done.
> failed 0.1 ['--step-length', '1', '--end', '51'] 3/1to2/1_0 (39.0, 40.0) <zip object at 0x00000041429C4FC8>
> Loading configuration... done.
> failed 1 ['--step-length', '1', '--end', '51'] 3/1to2/1_0 (39.0, 40.0) <zip object at 0x00000041429A5708>
> Loading configuration... done.
<truncated after showing first 30 lines>

TEST had known bugs (#4727) on ts-sim-winbuild-ba : traci ContextSubscriptionFilters leadFollow carFollowing ( Last six runs Oct2019 )

#4727
(This bug was triggered by text found in file 'output' matching '.')
---------- Differences in output ----------
4d3
< lead_straight
6d4
< [002] Context results for vehicle 'ego':
7a6
> [002] Context results for vehicle 'ego':
9d7
< [003] Context results for vehicle 'ego':
10a9
> [003] Context results for vehicle 'ego':
12d10
< [004] Context results for vehicle 'ego':
13a12
> [004] Context results for vehicle 'ego':
15d13
< [005] Context results for vehicle 'ego':
16a15
> [005] Context results for vehicle 'ego':
18d16
< [006] Context results for vehicle 'ego':
19a18
> [006] Context results for vehicle 'ego':
21d19
< [007] Context results for vehicle 'ego':
22a21
> [007] Context results for vehicle 'ego':
24d22
< [008] Context results for vehicle 'ego':
25a24
> [008] Context results for vehicle 'ego':
<truncated after showing first 30 lines>

2 TESTS had known bugs (#4727) on ts-sim-winbuild-ba :

#4727
(This bug was triggered by text found in file 'output' matching '.')
---------- Differences in output ----------
4a5
> follow_straight
7d7
< follow_straight
9a10
> follow_straight
12d12
< follow_straight
14a15
> follow_straight
17d17
< follow_straight
19a20
> follow_straight
22d22
< follow_straight
24a25
> follow_straight
27d27
< follow_straight
29a30
> follow_straight
32d32
< follow_straight
34a35
> follow_straight
37d37
< follow_straight
39a40
> follow_straight
<truncated after showing first 30 lines>
traci ContextSubscriptionFilters leadFollow laneChangeLeft ( Last six runs Oct2019 )
traci ContextSubscriptionFilters leadFollow laneChangeRight ( Last six runs Oct2019 )

TEST had known bugs (#4727) on ts-sim-winbuild-ba : traci ContextSubscriptionFilters leadFollow laneChangeNeighbors ( Last six runs Oct2019 )

#4727
(This bug was triggered by text found in file 'output' matching '.')
---------- Differences in output ----------
4,5d3
< follow_straight
< follow_right
6a5,7
> follow_right
> follow_straight
> lead_left
9d9
< lead_left
11,12d10
< follow_straight
< follow_right
13a12,14
> follow_right
> follow_straight
> lead_left
16d16
< lead_left
18,19d17
< follow_straight
< follow_right
20a19,21
> follow_right
> follow_straight
> lead_left
23d23
< lead_left
25,26d24
< follow_straight
< follow_right
<truncated after showing first 30 lines>

TEST had known bugs (see #3263) on ts-sim-winbuild-ba : traci pythonApi moveToXY keepRoute2 ( Last six runs Oct2019 )

mapping failure
(This bug was triggered by text found in file 'output' matching 'failed')
---------- Differences in output ----------
0a1,2
> internal corner (inside, segment2) failed: x=198, x2=198.0,   y=1.9, y2=1.9,   lane=middle_0, lane2=middle_0, pos=102, pos2=98.0   posLat=2.0 posLat2=1.9
> internal corner (outside, far) failed: x=203, x2=203.0,   y=-4, y2=-4.0,   lane=, lane2=middle_0, pos=-1073741824.0, pos2=100.0   posLat=-1073741824.0 posLat2=-1.4142135623730951

TEST had known bugs (see #5383) on ts-sim-winbuild-ba : traci pythonApi moveToXY permissions ( Last six runs Oct2019 )

mapping failure
(This bug was triggered by text found in file 'output' matching 'failed')
---------- Differences in output ----------
0a1,2
> shifted to left lane (permissions) failed: mode=2 x=40, x2=40.0,   y=-1.5, y2=-1.5,   lane=beg_1, lane2=, pos=40, pos2=-1073741824.0   posLat=0.0 posLat2=-1073741824.0
> right lane (ignore permissions) failed: mode=6 x=40, x2=40.0,   y=-1.6, y2=-1.6,   lane=beg_0, lane2=, pos=40, pos2=-1073741824.0   posLat=0.0 posLat2=-1073741824.0