Test results for POLYCONVERT

(generated by delphi at 25Sep13:21)

gdal

Last six runs

Aug2020 Sep2020

test_default.gdal.png

Test20Sep20rv1_7_0+0147-c8056dbd2721Sep20rv1_7_0+0151-194128b1a622Sep20rv1_7_0+0176-fce35e5b1c23Sep20rv1_7_0+0187-bcb4b5620224Sep20rv1_7_0+0194-1ef5c1c0b725Sep20rv1_7_0+0204-a16c614f70
Summary3 tests: 3 FAILED 3 tests: 3 FAILED 3 tests: 3 FAILED 3 tests: 3 FAILED 3 tests: 3 FAILED 3 tests: 3 FAILED
import shape default errors different ts-sim-winbuild-baerrors different ts-sim-winbuild-baerrors different ts-sim-winbuild-baerrors different ts-sim-winbuild-baerrors different ts-sim-winbuild-baerrors different ts-sim-winbuild-ba
import shape handmade errors different ts-sim-winbuild-baerrors different ts-sim-winbuild-baerrors different ts-sim-winbuild-baerrors different ts-sim-winbuild-baerrors different ts-sim-winbuild-baerrors different ts-sim-winbuild-ba
import shape network errors different(+) ts-sim-winbuild-baerrors different(+) ts-sim-winbuild-baerrors different(+) ts-sim-winbuild-baerrors different(+) ts-sim-winbuild-baerrors different(+) ts-sim-winbuild-baerrors different(+) ts-sim-winbuild-ba