20Aug19rv1_3_0+0003-42d5df9ddc - detailed test results for TOOLS

To reconnect the TextTest GUI to these results, run:

texttestc.py -a tools -d C:/Users/delphi/Code/sumoInternal/git/tests -reconnect C:/Users/delphi/Code/sumoInternal/msvc12extrax64texttesttmp/msvc12extrax64.31Aug075810.3700 -g

To start TextTest for these tests, run:

texttestc.py -a tools -d C:/Users/delphi/Code/sumoInternal/git/tests


python3: 453 tests: 93 succeeded 357 FAILED 3 known bugs

Detailed information for the tests that FAILED:

288 TESTS FAILED on ts-sim-winbuild-ba :

---------- Differences in errors ----------
0a1,2
> C:\Users\delphi\Code\sumoInternal\git\tools\sumolib\__init__.py:28: UserWarning: No module named 'matplotlib'
>   warnings.warn(str(e))
assign Assignment plain ( Last six runs Aug2019 )
assign Assignment simple ( Last six runs Aug2019 )
assign calibration 2ndTestNetwork_sumoFormat ( Last six runs Aug2019 )
assign calibration demand_adjustment ( Last six runs Aug2019 )
assign calibration fixed_demand ( Last six runs Aug2019 )
assign calibration multi_route_files ( Last six runs Aug2019 )
assign calibration p2p_demand_adjustment ( Last six runs Aug2019 )
assign calibration p2p_simple ( Last six runs Aug2019 )
assign costFunctionChecker flow ( Last six runs Aug2019 )
assign costFunctionChecker identity ( Last six runs Aug2019 )
assign costFunctionChecker simple ( Last six runs Aug2019 )
assign costFunctionChecker three ( Last six runs Aug2019 )
assign dua-iterate binary ( Last six runs Aug2019 )
assign dua-iterate convergence ( Last six runs Aug2019 )
assign dua-iterate external_gawron ( Last six runs Aug2019 )
assign dua-iterate filtered_tripinfo ( Last six runs Aug2019 )
assign dua-iterate recognize_error ( Last six runs Aug2019 )
assign dua-iterate simple ( Last six runs Aug2019 )
assign dua-iterate start_with_routes ( Last six runs Aug2019 )
assign dua-iterate unordered_input ( Last six runs Aug2019 )
assign dua-iterate vtypes_add ( Last six runs Aug2019 )
assign dua-iterate weight_memory ( Last six runs Aug2019 )
assign one-shot simple ( Last six runs Aug2019 )
detector flowFromEdgeData bell_pfe routes_out ( Last six runs Aug2019 )
detector flowFromEdgeData bell_pfe routes_out_lanes ( Last six runs Aug2019 )
detector flowFromEdgeData intervals 1h ( Last six runs Aug2019 )
detector flowFromEdgeData intervals 1st_h ( Last six runs Aug2019 )
detector flowFromEdgeData intervals 2h ( Last six runs Aug2019 )
detector flowFromEdgeData misc max-turn-flow ( Last six runs Aug2019 )
detector flowFromEdgeData misc three_split ( Last six runs Aug2019 )
detector flowFromEdgeData motorway_ramps all_main ( Last six runs Aug2019 )
detector flowFromEdgeData motorway_ramps all_main_aggregate ( Last six runs Aug2019 )
detector flowFromEdgeData motorway_ramps all_main_aggregate_1time ( Last six runs Aug2019 )
detector flowFromEdgeData motorway_ramps all_main_aggregate_lateData ( Last six runs Aug2019 )
detector flowFromEdgeData motorway_ramps ambiguous ( Last six runs Aug2019 )
detector flowFromEdgeData motorway_ramps ambiguous_restrict ( Last six runs Aug2019 )
detector flowFromEdgeData motorway_ramps ambiguous_restrict_od ( Last six runs Aug2019 )
detector flowFromEdgeData motorway_ramps pull ( Last six runs Aug2019 )
detector flowFromEdgeData motorway_ramps random ( Last six runs Aug2019 )
detector flowFromEdgeData motorway_ramps via-detectors ( Last six runs Aug2019 )
detector flowFromRoutes bell_pfe routes_out ( Last six runs Aug2019 )
detector flowFromRoutes bell_pfe routes_out_firstname ( Last six runs Aug2019 )
detector flowFromRoutes bell_pfe routes_out_geh ( Last six runs Aug2019 )
detector flowFromRoutes bell_pfe routes_out_lanes ( Last six runs Aug2019 )
detector flowFromRoutes misc max-turn-flow ( Last six runs Aug2019 )
detector flowFromRoutes misc three_split ( Last six runs Aug2019 )
detector flowFromRoutes motorway_ramps all_main ( Last six runs Aug2019 )
detector flowFromRoutes motorway_ramps all_main_aggregate ( Last six runs Aug2019 )
detector flowFromRoutes motorway_ramps all_main_aggregate_1time ( Last six runs Aug2019 )
detector flowFromRoutes motorway_ramps all_main_aggregate_lateData ( Last six runs Aug2019 )
detector flowFromRoutes motorway_ramps ambiguous ( Last six runs Aug2019 )
detector flowFromRoutes motorway_ramps ambiguous_restrict ( Last six runs Aug2019 )
detector flowFromRoutes motorway_ramps ambiguous_restrict_od ( Last six runs Aug2019 )
detector flowFromRoutes motorway_ramps no_vehicles ( Last six runs Aug2019 )
detector flowFromRoutes motorway_ramps pull ( Last six runs Aug2019 )
detector flowFromRoutes motorway_ramps random ( Last six runs Aug2019 )
detector flowFromRoutes motorway_ramps restrict_inconsistent ( Last six runs Aug2019 )
detector flowFromRoutes motorway_ramps via-detectors ( Last six runs Aug2019 )
detector flowrouter bell_pfe lanes_zero ( Last six runs Aug2019 )
detector flowrouter bell_pfe plain ( Last six runs Aug2019 )
detector flowrouter bell_pfe routes_out ( Last six runs Aug2019 )
detector flowrouter bell_pfe routes_out_lanes ( Last six runs Aug2019 )
detector flowrouter bell_pfe zero ( Last six runs Aug2019 )
detector flowrouter bugs ticket5951 ( Last six runs Aug2019 )
detector flowrouter bugs ticket_3285 ( Last six runs Aug2019 )
detector flowrouter misc max-turn-flow ( Last six runs Aug2019 )
detector flowrouter misc source_sink_output ( Last six runs Aug2019 )
detector flowrouter misc three_split ( Last six runs Aug2019 )
detector flowrouter motorway_ramps all_main ( Last six runs Aug2019 )
detector flowrouter motorway_ramps all_main_aggregate ( Last six runs Aug2019 )
detector flowrouter motorway_ramps all_main_aggregate_1time ( Last six runs Aug2019 )
detector flowrouter motorway_ramps all_main_aggregate_lateData ( Last six runs Aug2019 )
detector flowrouter motorway_ramps ambiguous ( Last six runs Aug2019 )
detector flowrouter motorway_ramps ambiguous_restrict ( Last six runs Aug2019 )
detector flowrouter motorway_ramps ambiguous_restrict_od ( Last six runs Aug2019 )
detector flowrouter motorway_ramps debug ( Last six runs Aug2019 )
detector flowrouter motorway_ramps pull ( Last six runs Aug2019 )
detector flowrouter motorway_ramps random ( Last six runs Aug2019 )
detector flowrouter motorway_ramps restrict_inconsistent ( Last six runs Aug2019 )
detector flowrouter motorway_ramps via-detectors ( Last six runs Aug2019 )
detector flowrouter vclass edge_disallowed ( Last six runs Aug2019 )
detector flowrouter vclass edge_disallowed_limit ( Last six runs Aug2019 )
detector flowrouter vclass lane_disallowed ( Last six runs Aug2019 )
district edgesInDistricts group_by_param ( Last six runs Aug2019 )
district edgesInDistricts group_by_prefix ( Last six runs Aug2019 )
district edgesInDistricts plain ( Last six runs Aug2019 )
district edgesInDistricts simple ( Last six runs Aug2019 )
district edgesInDistricts vclass ( Last six runs Aug2019 )
district edgesInDistricts weighted ( Last six runs Aug2019 )
district filterDistricts keep_all ( Last six runs Aug2019 )
district filterDistricts passenger ( Last six runs Aug2019 )
district generateBidiDistricts travel_dist ( Last six runs Aug2019 )
district generateBidiDistricts travel_dist_radius1000 ( Last six runs Aug2019 )
misc addStops2Routes example ( Last six runs Aug2019 )
misc generateParkingLots example ( Last six runs Aug2019 )
net netcheck broken ( Last six runs Aug2019 )
net netcheck components ( Last six runs Aug2019 )
net netcheck cross1l ( Last six runs Aug2019 )
net netcheck destination ( Last six runs Aug2019 )
net netcheck ignore_connections ( Last six runs Aug2019 )
net netcheck source ( Last six runs Aug2019 )
net netcheck source_vclass ( Last six runs Aug2019 )
net netcheck source_vclass_invalid ( Last six runs Aug2019 )
net netcheck source_vclass_pedestrian ( Last six runs Aug2019 )
net netdiff change_to_unwritten_default ( Last six runs Aug2019 )
net netdiff copy_location ( Last six runs Aug2019 )
net netdiff crossing ( Last six runs Aug2019 )
net netdiff deleted_tll ( Last six runs Aug2019 )
net netdiff direct ( Last six runs Aug2019 )
net netdiff duplicate_phases ( Last six runs Aug2019 )
net netdiff join_junctions ( Last six runs Aug2019 )
net netdiff params ( Last six runs Aug2019 )
net netdiff patch_on_import ( Last six runs Aug2019 )
net netdiff roundabout ( Last six runs Aug2019 )
net netdiff split_edge ( Last six runs Aug2019 )
net netextract cross1l ( Last six runs Aug2019 )
net netextract cross3ltl ( Last six runs Aug2019 )
output converter boundary fcdfilter ( Last six runs Aug2019 )
output converter boundary gpsdat ( Last six runs Aug2019 )
output converter gpsdat ( Last six runs Aug2019 )
output converter gpx ( Last six runs Aug2019 )
output converter ns2 activity_only ( Last six runs Aug2019 )
output converter ns2 all ( Last six runs Aug2019 )
output converter ns2 config_only ( Last six runs Aug2019 )
output converter ns2 ignore-gaps ( Last six runs Aug2019 )
output converter ns2 keep_orig_ids ( Last six runs Aug2019 )
output converter ns2 mobility_only ( Last six runs Aug2019 )
output converter omnet ( Last six runs Aug2019 )
output converter persons gpsdat ( Last six runs Aug2019 )
output converter persons gpx ( Last six runs Aug2019 )
output converter persons ns2 ( Last six runs Aug2019 )
output converter persons omnet ( Last six runs Aug2019 )
output converter persons phem ( Last six runs Aug2019 )
output converter persons shawn ( Last six runs Aug2019 )
output converter phem all ( Last six runs Aug2019 )
output converter phem dri_only ( Last six runs Aug2019 )
output converter phem errors phem_fzp__no_fcd ( Last six runs Aug2019 )
output converter phem errors phem_fzp__no_net ( Last six runs Aug2019 )
output converter phem flt_only ( Last six runs Aug2019 )
output converter phem fzp_only ( Last six runs Aug2019 )
output converter phem str_only ( Last six runs Aug2019 )
output converter shawn ( Last six runs Aug2019 )
output converter time b0ed ( Last six runs Aug2019 )
output converter time b100ed ( Last six runs Aug2019 )
output converter time b50e100d ( Last six runs Aug2019 )
output converter time b50e100d10 ( Last six runs Aug2019 )
output converter time be100d ( Last six runs Aug2019 )
output converter time bed1 ( Last six runs Aug2019 )
output converter time bed2 ( Last six runs Aug2019 )
output generateTLSE1Detectors plain ( Last six runs Aug2019 )
output generateTLSE2Detectors plain ( Last six runs Aug2019 )
output generateTLSE3Detectors complicated ( Last six runs Aug2019 )
output generateTLSE3Detectors cross1ltl ( Last six runs Aug2019 )
output generateTLSE3Detectors cross3ltl ( Last six runs Aug2019 )
output generateTLSE3Detectors explicit ( Last six runs Aug2019 )
output generateTLSE3Detectors followTurnaround ( Last six runs Aug2019 )
output generateTLSE3Detectors interior ( Last six runs Aug2019 )
output generateTLSE3Detectors interior_joined ( Last six runs Aug2019 )
output generateTLSE3Detectors joined ( Last six runs Aug2019 )
output generateTLSE3Detectors minPos ( Last six runs Aug2019 )
output generateTLSE3Detectors plain ( Last six runs Aug2019 )
output generateTLSE3Detectors prefix ( Last six runs Aug2019 )
output tripinfoByTAZ routeLength ( Last six runs Aug2019 )
output tripinfoByTAZ taz_file ( Last six runs Aug2019 )
output tripinfoByTAZ taz_from_trips ( Last six runs Aug2019 )
output tripinfoByTAZ xml_out ( Last six runs Aug2019 )
output tripinfoDiff ( Last six runs Aug2019 )
output tripinfoDiff_persons ( Last six runs Aug2019 )
public_transport ptlines2flows basic ( Last six runs Aug2019 )
public_transport ptlines2flows begin_end ( Last six runs Aug2019 )
public_transport ptlines2flows few_stops ( Last six runs Aug2019 )
public_transport ptlines2flows hrtime ( Last six runs Aug2019 )
public_transport ptlines2flows name_missing ( Last six runs Aug2019 )
public_transport ptlines2flows night ( Last six runs Aug2019 )
public_transport ptlines2flows parking ( Last six runs Aug2019 )
public_transport ptlines2flows pt_routes_from_ptlines_file ( Last six runs Aug2019 )
public_transport ptlines2flows random_begin ( Last six runs Aug2019 )
public_transport ptlines2flows reverse_at_stop ( Last six runs Aug2019 )
public_transport ptlines2flows stop_duration ( Last six runs Aug2019 )
public_transport ptlines2flows types ( Last six runs Aug2019 )
route cut_routes big ( Last six runs Aug2019 )
route cut_routes exitTimes ( Last six runs Aug2019 )
route cut_routes keep_disconnected ( Last six runs Aug2019 )
route cut_routes keep_disconnected_with_original_net ( Last six runs Aug2019 )
route cut_routes minLength ( Last six runs Aug2019 )
route cut_routes origNet ( Last six runs Aug2019 )
route cut_routes origNet_speedFactor ( Last six runs Aug2019 )
route cut_routes taz ( Last six runs Aug2019 )
route cut_routes unfinished ( Last six runs Aug2019 )
route cut_routes with_stops ( Last six runs Aug2019 )
route cut_routes with_unknown_busstops ( Last six runs Aug2019 )
route cut_routes write_routes ( Last six runs Aug2019 )
route cut_routes write_trips ( Last six runs Aug2019 )
route departOffset offset10 ( Last six runs Aug2019 )
route departOffset offset10_arrivalEdges ( Last six runs Aug2019 )
route departOffset offset10_departEdges ( Last six runs Aug2019 )
route departOffset offset10_departEdges_file ( Last six runs Aug2019 )
route departOffset offset10_heterogeneous ( Last six runs Aug2019 )
route departOffset offset10_modify_ids ( Last six runs Aug2019 )
route departOffset offset_move_interval ( Last six runs Aug2019 )
route implausibleRoutes default ( Last six runs Aug2019 )
route implausibleRoutes min-air-dist ( Last six runs Aug2019 )
route implausibleRoutes min-dist ( Last six runs Aug2019 )
route implausibleRoutes restriction-output ( Last six runs Aug2019 )
route implausibleRoutes standalone ( Last six runs Aug2019 )
route route2poly basic ( Last six runs Aug2019 )
route route2poly filter ( Last six runs Aug2019 )
route route2poly internal ( Last six runs Aug2019 )
route route2poly scaleWidth ( Last six runs Aug2019 )
route route2sel ( Last six runs Aug2019 )
route routeStats basic ( Last six runs Aug2019 )
route routeStats depart ( Last six runs Aug2019 )
route routeStats diff ( Last six runs Aug2019 )
route routeStats numEdges ( Last six runs Aug2019 )
route route_1htoDay ( Last six runs Aug2019 )
route showDepartsAndArrivalsPerEdge basic ( Last six runs Aug2019 )
route showDepartsAndArrivalsPerEdge intermediate ( Last six runs Aug2019 )
route showDepartsAndArrivalsPerEdge subpart ( Last six runs Aug2019 )
route showDepartsAndArrivalsPerEdge subpart_file ( Last six runs Aug2019 )
route showDepartsAndArrivalsPerEdge taz ( Last six runs Aug2019 )
shapes poi_alongRoads cross3l_100m ( Last six runs Aug2019 )
shapes poi_alongRoads cross3l_200m ( Last six runs Aug2019 )
shapes poi_atTLS cross3ltl ( Last six runs Aug2019 )
sumolib getShortestRoute ( Last six runs Aug2019 )
sumolib net_roundabout ( Last six runs Aug2019 )
sumolib net_short_internal ( Last six runs Aug2019 )
tls check initial_ok ( Last six runs Aug2019 )
tls check initial_wrong_phase_size1 ( Last six runs Aug2019 )
tls check initial_wrong_phase_size2 ( Last six runs Aug2019 )
tls csv2sumo both_first_false ( Last six runs Aug2019 )
tls csv2sumo both_ok ( Last six runs Aug2019 )
tls csv2sumo both_second_false ( Last six runs Aug2019 )
tls csv2sumo cross3ltl_error_missinglink ( Last six runs Aug2019 )
tls csv2sumo cross3ltl_new ( Last six runs Aug2019 )
tls csv2sumo cross3ltl_no_key ( Last six runs Aug2019 )
tls csv2sumo cross3ltl_same ( Last six runs Aug2019 )
tls csv2sumo cross3ltl_siggrpphase ( Last six runs Aug2019 )
tls csv2sumo multiple_definitions ( Last six runs Aug2019 )
tls tlsAdaptation basic ( Last six runs Aug2019 )
tls tlsAdaptation unified_flows ( Last six runs Aug2019 )
tls tlsCoordinator 1flow ( Last six runs Aug2019 )
tls tlsCoordinator 2tls ( Last six runs Aug2019 )
tls tlsCoordinator 2tls_add ( Last six runs Aug2019 )
tls tlsCoordinator 2tls_intermediate_node ( Last six runs Aug2019 )
tls tlsCoordinator 3flows ( Last six runs Aug2019 )
tls tlsCoordinator 4flows ( Last six runs Aug2019 )
tls tlsCoordinator 4flows_b ( Last six runs Aug2019 )
tls tlsCoordinator basic ( Last six runs Aug2019 )
tls tls_csvSignalGroups 2green ( Last six runs Aug2019 )
tls tls_csvSignalGroups leftTurnPhase ( Last six runs Aug2019 )
tls tls_csvSignalGroups prio ( Last six runs Aug2019 )
trip randomTrips all_fringe_network ( Last six runs Aug2019 )
trip randomTrips angle ( Last six runs Aug2019 )
trip randomTrips binomial ( Last six runs Aug2019 )
trip randomTrips duarouter_options ( Last six runs Aug2019 )
trip randomTrips edge_param ( Last six runs Aug2019 )
trip randomTrips flows ( Last six runs Aug2019 )
trip randomTrips flows_binomial ( Last six runs Aug2019 )
trip randomTrips flows_jtrrouter ( Last six runs Aug2019 )
trip randomTrips fractional ( Last six runs Aug2019 )
trip randomTrips fringe_factor ( Last six runs Aug2019 )
trip randomTrips fringe_factor_turnarounds ( Last six runs Aug2019 )
trip randomTrips intermediate ( Last six runs Aug2019 )
trip randomTrips loaded_weights ( Last six runs Aug2019 )
trip randomTrips minimum_distance ( Last six runs Aug2019 )
trip randomTrips minimum_distance_exceeded ( Last six runs Aug2019 )
trip randomTrips no_valid_edges ( Last six runs Aug2019 )
trip randomTrips no_valid_intermediate_edges ( Last six runs Aug2019 )
trip randomTrips no_valid_intermediate_edges_fail ( Last six runs Aug2019 )
trip randomTrips pedestrians ( Last six runs Aug2019 )
trip randomTrips period_positive ( Last six runs Aug2019 )
trip randomTrips simple ( Last six runs Aug2019 )
trip randomTrips validate ( Last six runs Aug2019 )
trip randomTrips validate_intermediate ( Last six runs Aug2019 )
trip randomTrips vclass ( Last six runs Aug2019 )
trip randomTrips vclass_additional_file ( Last six runs Aug2019 )
trip randomTrips vehicle_class ( Last six runs Aug2019 )
trip randomTrips vehicle_class_persontrips ( Last six runs Aug2019 )
trip randomTrips vehicle_class_trip_attribute_vType ( Last six runs Aug2019 )
trip randomTrips vtype_additional_file_validate ( Last six runs Aug2019 )
trip randomTrips weights_output ( Last six runs Aug2019 )
trip route2trips plain ( Last six runs Aug2019 )
trip route2trips select_attrs ( Last six runs Aug2019 )
trip route2trips vtype_with_child_element ( Last six runs Aug2019 )
turndefs generateTurnDefs missing_connections_file ( Last six runs Aug2019 )
turndefs generateTurnDefs missing_turn-definitions_file ( Last six runs Aug2019 )
turndefs generateTurnDefs plain ( Last six runs Aug2019 )
turndefs generateTurnDefs uniform_distribution ( Last six runs Aug2019 )

TEST FAILED on ts-sim-winbuild-ba : build buildHTMLDocs fetchSingleSite ( Last six runs Aug2019 )

---------- Differences in errors ----------
0a1,45
> C:\Users\delphi\Code\sumoInternal\git\tools\sumolib\__init__.py:28: UserWarning: No module named 'matplotlib'
>   warnings.warn(str(e))
> Traceback (most recent call last):
>   File "C:\Python37\lib\urllib\request.py", line 1317, in do_open
>     encode_chunked=req.has_header('Transfer-encoding'))
>   File "C:\Python37\lib\http\client.py", line 1229, in request
>     self._send_request(method, url, body, headers, encode_chunked)
>   File "C:\Python37\lib\http\client.py", line 1275, in _send_request
>     self.endheaders(body, encode_chunked=encode_chunked)
>   File "C:\Python37\lib\http\client.py", line 1224, in endheaders
>     self._send_output(message_body, encode_chunked=encode_chunked)
>   File "C:\Python37\lib\http\client.py", line 1016, in _send_output
>     self.send(msg)
>   File "C:\Python37\lib\http\client.py", line 956, in send
>     self.connect()
>   File "C:\Python37\lib\http\client.py", line 1392, in connect
>     server_hostname=server_hostname)
>   File "C:\Python37\lib\ssl.py", line 412, in wrap_socket
>     session=session
>   File "C:\Python37\lib\ssl.py", line 853, in _create
>     self.do_handshake()
>   File "C:\Python37\lib\ssl.py", line 1117, in do_handshake
>     self._sslobj.do_handshake()
> ssl.SSLCertVerificationError: [SSL: CERTIFICATE_VERIFY_FAILED] certificate verify failed: self signed certificate in certificate chain (_ssl.c:1056)
> 
> During handling of the above exception, another exception occurred:
> 
> Traceback (most recent call last):
>   File "C:/Users/delphi/Code/sumoInternal/git/tests\..\tools/build/buildHTMLDocs.py", line 197, in <module>
<truncated after showing first 30 lines>

TEST FAILED on ts-sim-winbuild-ba : build checkStyle header ( Last six runs Aug2019 )

---------- Differences in output ----------
1,14d0
< src/foreign/eulerspiral/odrSpiral.cpp header does not start
< src/foreign/eulerspiral/odrSpiral.h header does not start
< src/foreign/fontstash/fontstash.h header does not start
< src/foreign/fontstash/glfontstash.h header does not start
< src/foreign/fontstash/stb_truetype.h header does not start
< src/foreign/rtree/RTree.h header does not start
< src/foreign/tcpip/socket.cpp header does not start
< src/foreign/tcpip/socket.h header does not start
< src/foreign/tcpip/storage.cpp header does not start
< src/foreign/tcpip/storage.h header does not start
< tools/webWizard/SimpleWebSocketServer.py different license:
< # Eclipse SUMO, Simulation of Urban MObility; see https://eclipse.org/sumo
< # The MIT License (MIT) Copyright (c) 2013 Dave P.
< 

TEST FAILED on ts-sim-winbuild-ba : build checkStyle tools ( Last six runs Aug2019 )

---------- Differences in output ----------
1,4d0
< webWizard/SimpleWebSocketServer.py different license:
< # Eclipse SUMO, Simulation of Urban MObility; see https://eclipse.org/sumo
< # The MIT License (MIT) Copyright (c) 2013 Dave P.
< 

TEST FAILED on ts-sim-winbuild-ba : detector flowFromEdgeData motorway_ramps restrict_inconsistent ( Last six runs Aug2019 )

---------- Differences in errors ----------
0a1,2
> C:\Users\delphi\Code\sumoInternal\git\tools\sumolib\__init__.py:28: UserWarning: No module named 'matplotlib'
>   warnings.warn(str(e))
---------- Differences in output ----------
10c10
< # 1140.8101405345824 1250.0 109.18985946541754 200.72790653387625 0.400858862201486
---
> # 1140.8101405345824 1250.0 109.18985946541754 200.72790653387625 0.4008588622014859

TEST FAILED on ts-sim-winbuild-ba : district districts2poly ( Last six runs Aug2019 )

---------- Differences in districts ----------
2,11c2,11
< <poly id="3/2to2/2_2/2to3/2" color="168,255,0" layer="100" type="taz_edge" shape="804.75,798.35 1195.25,798.35"/>
< <poly id="3/2to2/2_3/2to2/2" color="168,255,0" layer="100" type="taz_edge" shape="1195.25,801.65 804.75,801.65"/>
< <poly id="2/1to3/1_2/1to3/1" color="107,0,255" layer="100" type="taz_edge" shape="804.75,398.35 1195.25,398.35"/>
< <poly id="2/1to3/1_3/1to2/1" color="107,0,255" layer="100" type="taz_edge" shape="1195.25,401.65 804.75,401.65"/>
< <poly id="3/1to4/1_3/1to4/1" color="15,0,255" layer="100" type="taz_edge" shape="1204.75,398.35 1595.25,398.35"/>
< <poly id="3/1to4/1_4/1to3/1" color="15,0,255" layer="100" type="taz_edge" shape="1595.25,401.65 1204.75,401.65"/>
< <poly id="3/2to4/2_3/2to4/2" color="255,0,165" layer="100" type="taz_edge" shape="1204.75,798.35 1596.75,798.35"/>
< <poly id="3/2to4/2_4/2to3/2" color="255,0,165" layer="100" type="taz_edge" shape="1596.75,801.65 1204.75,801.65"/>
< <poly id="1/1to0/1_0/1to1/1" color="255,133,0" layer="100" type="taz_edge" shape="4.75,398.35 395.25,398.35"/>
< <poly id="1/1to0/1_1/1to0/1" color="255,133,0" layer="100" type="taz_edge" shape="395.25,401.65 4.75,401.65"/>
---
> <poly id="3/2to2/2_2/2to3/2" color="135,255,0" layer="100" type="taz_edge" shape="804.75,798.35 1195.25,798.35"/>
> <poly id="3/2to2/2_3/2to2/2" color="135,255,0" layer="100" type="taz_edge" shape="1195.25,801.65 804.75,801.65"/>
> <poly id="2/1to3/1_2/1to3/1" color="255,213,0" layer="100" type="taz_edge" shape="804.75,398.35 1195.25,398.35"/>
> <poly id="2/1to3/1_3/1to2/1" color="255,213,0" layer="100" type="taz_edge" shape="1195.25,401.65 804.75,401.65"/>
> <poly id="3/1to4/1_3/1to4/1" color="255,157,0" layer="100" type="taz_edge" shape="1204.75,398.35 1595.25,398.35"/>
> <poly id="3/1to4/1_4/1to3/1" color="255,157,0" layer="100" type="taz_edge" shape="1595.25,401.65 1204.75,401.65"/>
> <poly id="3/2to4/2_3/2to4/2" color="113,0,255" layer="100" type="taz_edge" shape="1204.75,798.35 1596.75,798.35"/>
> <poly id="3/2to4/2_4/2to3/2" color="113,0,255" layer="100" type="taz_edge" shape="1596.75,801.65 1204.75,801.65"/>
> <poly id="1/1to0/1_0/1to1/1" color="0,186,255" layer="100" type="taz_edge" shape="4.75,398.35 395.25,398.35"/>
> <poly id="1/1to0/1_1/1to0/1" color="0,186,255" layer="100" type="taz_edge" shape="395.25,401.65 4.75,401.65"/>
---------- Differences in errors ----------
0a1,2
> C:\Users\delphi\Code\sumoInternal\git\tools\sumolib\__init__.py:28: UserWarning: No module named 'matplotlib'
>   warnings.warn(str(e))

4 TESTS FAILED on ts-sim-winbuild-ba :

---------- Differences in errors ----------
0a1,3
> C:\Users\delphi\Code\sumoInternal\git\tools\sumolib\__init__.py:28: UserWarning: No module named 'matplotlib'
>   warnings.warn(str(e))
> Warning: Module 'rtree' not available. Using brute-force fallback
district generateBidiDistricts asym ( Last six runs Aug2019 )
district generateBidiDistricts plain ( Last six runs Aug2019 )
district generateBidiDistricts radius1000 ( Last six runs Aug2019 )
district generateBidiDistricts sym ( Last six runs Aug2019 )

TEST FAILED on ts-sim-winbuild-ba : import OSM build_passenger ( Last six runs Aug2019 )

---------- Differences in errors ----------
12a13,14
> C:\Users\delphi\Code\sumoInternal\git\tools\sumolib\__init__.py:28: UserWarning: No module named 'matplotlib'
>   warnings.warn(str(e))

TEST FAILED on ts-sim-winbuild-ba : import OSM webWizard ( Last six runs Aug2019 )

---------- Differences in errors ----------
427a428,429
> C:\Users\delphi\Code\sumoInternal\git\tools\sumolib\__init__.py:28: UserWarning: No module named 'matplotlib'
>   warnings.warn(str(e))
479,481c481,485
< Warning: Teleporting vehicle 'veh92'; waited too long (wrong lane), lane='202157002#3_3', time=767.00.
< Warning: Vehicle 'veh92' ends teleporting on edge '-534588621#1', time 767.00.
< Warning: Person 'ped99' aborted waiting for S9:0 at busStop '2603331695'.
---
> Warning: Teleporting vehicle 'veh92'; waited too long (wrong lane), lane='202157002#3_3', time=769.00.
> Warning: Vehicle 'veh92' ends teleporting on edge '-534588621#1', time 769.00.
> Warning: Person 'ped105' aborted waiting for S7:0 at busStop '2603331695'.
> Warning: Person 'ped69' aborted waiting for S7:0 at busStop '2603331695'.
> Warning: Person 'ped87' aborted waiting for S7:1 at busStop '27411240'.
483d486
< Warning: Person 'ped134' aborted waiting for N8:1 at busStop '-2915579613'.
---------- Differences in osmbatch ----------
5c5
< python /path/to/randomTrips.py -n osm.net.xml --seed 42 --fringe-factor 40 -p 201.591340 -o osm.ship.trips.xml -e 900 --vehicle-class ship --vclass ship --prefix ship --validate --fringe-start-attributes 'departSpeed="max"'
---
> python /path/to/randomTrips.py -n osm.net.xml --seed 42 --fringe-factor 40 -p 201.591340 -o osm.ship.trips.xml -e 900 --vehicle-class ship --vclass ship --prefix ship --validate --fringe-start-attributes "departSpeed=\"max\""
---------- Differences in osmimport ----------
113c113
<         <lane id=":1157325158_w0_0" index="0" allow="pedestrian" speed="1.00" length="2.16" width="2.00" shape="2225.34,2120.87 2226.58,2119.31 2225.45,2118.20 2223.85,2117.01 2223.17,2117.92 2224.78,2119.11 2225.08,2120.49 2224.99,2120.00 2224.99,2119.50 2225.01,2119.11 2224.96,2118.94"/>
---
>         <lane id=":1157325158_w0_0" index="0" allow="pedestrian" speed="1.00" length="2.64" width="2.00" shape="2225.34,2120.87 2226.58,2119.31 2225.45,2118.20 2223.85,2117.01 2222.45,2118.90 2224.05,2120.09 2225.07,2120.61 2224.84,2120.33 2224.64,2120.08 2224.45,2119.92 2224.26,2119.91"/>
810c810
<         <lane id=":1393236495_w0_0" index="0" allow="pedestrian" speed="1.00" length="3.59" width="2.00" shape="1446.60,1885.32 1448.57,1884.94 1450.06,1885.05 1450.23,1883.06 1445.18,1882.61 1445.00,1884.60 1446.49,1884.97 1446.31,1884.77 1446.07,1884.67 1445.77,1884.63 1445.41,1884.62"/>
---
>         <lane id=":1393236495_w0_0" index="0" allow="pedestrian" speed="1.00" length="3.62" width="2.00" shape="1446.62,1885.42 1448.59,1885.04 1450.06,1885.05 1450.23,1883.06 1445.18,1882.61 1445.00,1884.60 1446.51,1885.05 1446.33,1884.83 1446.09,1884.70 1445.78,1884.65 1445.42,1884.63"/>
1068c1068
<         <lane id=":1457124722_w0_0" index="0" allow="pedestrian" speed="1.00" length="3.44" width="2.00" shape="1557.88,2001.87 1558.13,1999.89 1556.82,1998.20 1554.84,1997.96 1554.26,1999.40 1554.01,2001.39"/>
---
>         <lane id=":1457124722_w0_0" index="0" allow="pedestrian" speed="1.00" length="3.49" width="2.00" shape="1557.88,2001.87 1558.13,1999.89 1556.82,1998.20 1554.84,1997.96 1554.16,1999.39 1553.92,2001.37"/>
2050c2050
<         <lane id=":1673526976_w1_0" index="0" allow="pedestrian" speed="1.00" length="1.07" width="4.00" shape="1450.29,2146.19 1447.23,2143.61 1447.97,2145.37 1449.57,2146.58"/>
---
>         <lane id=":1673526976_w1_0" index="0" allow="pedestrian" speed="1.00" length="0.78" width="4.00" shape="1450.29,2146.19 1447.23,2143.61 1448.73,2144.37 1450.33,2145.58"/>
2303c2303
<         <lane id=":1769589034_w0_0" index="0" allow="pedestrian" speed="1.00" length="5.14" width="4.00" shape="1065.91,2389.88 1068.90,2390.14 1072.68,2383.46 1069.69,2383.21 1069.32,2384.77 1068.64,2385.80 1067.80,2386.57 1066.96,2387.33 1066.28,2388.36"/>
---
>         <lane id=":1769589034_w0_0" index="0" allow="pedestrian" speed="1.00" length="5.17" width="4.00" shape="1065.90,2389.93 1068.89,2390.19 1072.68,2383.46 1069.69,2383.21 1069.32,2384.77 1068.64,2385.80 1067.80,2386.57 1066.96,2387.33 1066.28,2388.36"/>
2916c2916
<         <lane id=":1828018092_w0_0" index="0" allow="pedestrian" speed="1.00" length="3.39" width="2.00" shape="2682.45,2503.02 2682.08,2501.06 2679.96,2499.06 2678.54,2500.46 2678.69,2501.70 2679.06,2503.66"/>
---
>         <lane id=":1828018092_w0_0" index="0" allow="pedestrian" speed="1.00" length="3.36" width="2.00" shape="2682.41,2503.03 2682.03,2501.07 2679.96,2499.06 2678.54,2500.46 2678.69,2501.70 2679.06,2503.66"/>
3097c3097
<         <lane id=":1860777046_w0_0" index="0" allow="pedestrian" speed="1.00" length="2.99" width="2.00" shape="2621.19,2222.96 2622.38,2221.35 2623.51,2220.63 2621.98,2219.33 2619.89,2219.49 2618.68,2221.08"/>
---
>         <lane id=":1860777046_w0_0" index="0" allow="pedestrian" speed="1.00" length="2.94" width="2.00" shape="2621.19,2222.96 2622.38,2221.35 2623.44,2220.71 2621.92,2219.41 2619.89,2219.49 2618.68,2221.08"/>
3106c3106
<         <lane id=":1860777052_w0_0" index="0" allow="pedestrian" speed="1.00" length="4.33" width="2.00" shape="2061.22,2359.88 2063.05,2359.08 2064.29,2359.28 2065.03,2357.42 2059.67,2355.22 2058.87,2357.05 2060.90,2359.13 2060.65,2358.56 2060.40,2358.11 2060.06,2357.74 2059.57,2357.40"/>
<truncated after showing first 30 lines>
---------- Differences in osmstops ----------
86c86
<         <access lane="463829474#0_0" pos="0.10" length="3.62" friendlyPos="1"/>
---
>         <access lane="463829474#0_0" pos="0.20" length="1.74" friendlyPos="1"/>
89c89
<     <busStop id="1686199552" name="Berliner Rathaus" lane="156364566#1_2" startPos="18.00" endPos="33.00" friendlyPos="true" lines="N65 N8 N40"/>
---
>     <busStop id="1686199552" name="Berliner Rathaus" lane="156364566#1_2" startPos="17.60" endPos="32.60" friendlyPos="true" lines="N65 N8 N40"/>
107c107
<         <access lane="272810811_0" pos="0.00" length="2.32" friendlyPos="1"/>
---
>         <access lane="272810811_0" pos="0.00" length="2.27" friendlyPos="1"/>
130c130
<         <access lane="175499826_0" pos="0.10" length="11.92" friendlyPos="1"/>
---
>         <access lane="175499826_0" pos="0.20" length="11.92" friendlyPos="1"/>
284c284
<         <access lane="377110621#1_0" pos="0.00" length="13.23" friendlyPos="1"/>
---
>         <access lane="377110621#1_0" pos="0.00" length="13.28" friendlyPos="1"/>
298c298
<         <access lane="272757323#1_0" pos="0.20" length="8.44" friendlyPos="1"/>
---
>         <access lane="272757323#1_0" pos="0.20" length="8.39" friendlyPos="1"/>
379c379
<         <access lane="379904843#3_0" pos="0.00" length="18.37" friendlyPos="1"/>
---
>         <access lane="379904843#3_0" pos="0.00" length="18.35" friendlyPos="1"/>
433c433
<     <busStop id="3867910441" name="U Weinmeisterstraße/Gipsstraße" lane="36892597#2_1" startPos="5.42" endPos="20.42" friendlyPos="true" lines="N65 N2 N8 N40 N42"/>
<truncated after showing first 30 lines>
---------- Differences in osmtrips ----------
337c337
<     <person id="ped111" depart="485.63" type="ped_pedestrian">
---
>     <person id="ped111" depart="485.65" type="ped_pedestrian">
343c343
<     <person id="ped113" depart="494.38" type="ped_pedestrian">
---
>     <person id="ped113" depart="494.40" type="ped_pedestrian">
349c349
<     <person id="ped115" depart="503.13" type="ped_pedestrian">
---
>     <person id="ped115" depart="503.15" type="ped_pedestrian">
355c355
<     <person id="ped117" depart="511.88" type="ped_pedestrian">
---
>     <person id="ped117" depart="511.90" type="ped_pedestrian">
361c361
<     <person id="ped119" depart="520.63" type="ped_pedestrian">
---
>     <person id="ped119" depart="520.65" type="ped_pedestrian">
367c367
<     <person id="ped121" depart="529.38" type="ped_pedestrian">
---
>     <person id="ped121" depart="529.40" type="ped_pedestrian">
373c373
<     <person id="ped123" depart="538.13" type="ped_pedestrian">
---
>     <person id="ped123" depart="538.15" type="ped_pedestrian">
379c379
<     <person id="ped125" depart="546.88" type="ped_pedestrian">
<truncated after showing first 30 lines>
---------- Differences in output ----------
60c60
< Guessed 954 pedestrian crossings.
---
> Guessed 957 pedestrian crossings.
121c121
< Simulation ended at time: 2657.00
---
> Simulation ended at time: 2856.00
133,136c133,136
<  RouteLength: 1698.99
<  Duration: 320.75
<  WaitingTime: 46.49
<  TimeLoss: 97.48
---
>  RouteLength: 1696.61
>  Duration: 324.27
>  WaitingTime: 47.96
>  TimeLoss: 99.47
138,141c138,141
< Pedestrian Statistics (avg of 421 walks):
<  RouteLength: 283.85
<  Duration: 237.92
<  TimeLoss: 38.91
---
> Pedestrian Statistics (avg of 420 walks):
>  RouteLength: 285.57
>  Duration: 242.67
>  TimeLoss: 39.96
143,146c143,146
<  WaitingTime: 108.31
<truncated after showing first 30 lines>
---------- Differences in ptroutes ----------
40,41d39
<     <route id="pt_bus_M48:0" edges="23851917#1 23851917#2 11549897 23851922#0 23851922#1 60333313 82654055#0 82654055#1 82654055#2 24992428 606078065 156364553#0 156364553#1 606078066#0 606078066#1 72157172 61583424#0 61583424#1 61583424#2 534588621#0 534588621#1 72157174#1 171826984#0 171826984#1 171826984#2 171826984#3 171826984#4 171826984#5 24913524#0 24913524#1 195401006 195401017#0 195401017#1 195401017#3 405100405" >
<     </route>
47a46,47
>     <route id="pt_bus_M48:0" edges="23851917#1 23851917#2 11549897 23851922#0 23851922#1 60333313 82654055#0 82654055#1 82654055#2 24992428 606078065 156364553#0 156364553#1 606078066#0 606078066#1 72157172 61583424#0 61583424#1 61583424#2 534588621#0 534588621#1 72157174#1 171826984#0 171826984#1 171826984#2 171826984#3 171826984#4 171826984#5 24913524#0 24913524#1 195401006 195401017#0 195401017#1 195401017#3 405100405" >
>     </route>
63a64,65
>     <route id="pt_train_RE2:2" edges="32590440 72984396 32590489 32590490 32590491 32590492 32590643 32590644 24492833 32590637 32590650 32590651#0 32590651#1 32590891 32590892 32590899 32590900#0 32590900#1 29384709 25946664 25946665 25946666#0 25946666#1 25946666#2 25946667 25946668" >
>     </route>
68,69d69
<     <route id="pt_bus_200:1" edges="-326116285#2 -4402014#3 -4402014#2 -4402014#1 -4402014#0 -326116286#2 -326116286#1 -326116286#0 -24913267#3 -24913267#2 -24913267#1 -24913267#0 342968607#1 461526152 340498982#0 340498982#1 340498982#3 340498982#4 340498982#5 340498982#7 354528932 251884680 339201217 15971196#0 15971196#1 54048862#0 54048862#1 54048862#2 54048862#3 23013165#0 23013165#1 23013165#2 4611698#0 4611698#1 202156994#0 202156994#1 72157174#1 171826984#0 171826984#1 171826984#2 1718
26984#3 171826984#4 171826984#5 24913524#0 24913524#1 195401006 195401017#0 195401017#1 195401017#3 405100405" >
<     </route>
75a76,77
>     <route id="pt_bus_200:1" edges="-326116285#2 -4402014#3 -4402014#2 -4402014#1 -4402014#0 -326116286#2 -326116286#1 -326116286#0 -24913267#3 -24913267#2 -24913267#1 -24913267#0 342968607#1 461526152 340498982#0 340498982#1 340498982#3 340498982#4 340498982#5 340498982#7 354528932 251884680 339201217 15971196#0 15971196#1 54048862#0 54048862#1 54048862#2 54048862#3 23013165#0 23013165#1 23013165#2 4611698#0 4611698#1 202156994#0 202156994#1 72157174#1 171826984#0 171826984#1 171826984#2 1718
26984#3 171826984#4 171826984#5 24913524#0 24913524#1 195401006 195401017#0 195401017#1 195401017#3 405100405" >
>     </route>
84,85d85
<     <route id="pt_bus_N8:0" edges="36892597#2 36892597#3 84960597#0 84960597#1 84960597#3 83517332#0 83517332#1 83517332#2 83517332#3 84960595 316746323#0 316746323#1 316746323#2 370359204#0 370359204#2 478396988 275177453 387892378 77348147 156364570#0 156364570#1 156364570#2 156364570#3 156364556#1 202157002#0 202157002#1 202157002#2 202157002#3 -534588621#1 -534588621#0 606078071#0 606078071#1 606078071#2 606078071#3 61583423#0 61583423#1 -156364553#1 -156364553#0 -606078065 4612963 1563645
66#1" >
<     </route>
90,91d89
<     <route id="pt_tram_M5:0" edges="317013528#1 317013528#2 317013528#3 150394165 150394034#0 150394034#1 150394034#2 150394034#3 150394034#4 150394034#5 150394035#0 150394035#1 150394035#2 150394035#3 150394035#4 150394035#5 10597134#0 10597134#1 421641064 30721657#0 30721657#1 93630923 46140385 46140379#0 46140379#1 46140393 101699692#0 101699692#1 101699679#0 101699679#1 101699679#2 101699679#3 154321040#0 154321040#1 154321040#2" >
<     </route>
93a92,93
>     <route id="pt_tram_M5:0" edges="317013528#1 317013528#2 317013528#3 150394165 150394034#0 150394034#1 150394034#2 150394034#3 150394034#4 150394034#5 150394035#0 150394035#1 150394035#2 150394035#3 150394035#4 150394035#5 10597134#0 10597134#1 421641064 30721657#0 30721657#1 93630923 46140385 46140379#0 46140379#1 46140393 101699692#0 101699692#1 101699679#0 101699679#1 101699679#2 101699679#3 154321040#0 154321040#1 154321040#2" >
>     </route>
97a98,99
>     <route id="pt_train_RE7:1" edges="25946657 25946673#0 25946673#1 25946674#0 25946674#1 25946675 25946676 25946679 25946680 32590897 32590898#0 32590898#1 32590889 32590890#0 32590890#1 23809675 23809674 32590635 32590636#0 32590636#1 32590641 32590642 32590485 32590486 32590487 32590488 72984378" >
>     </route>
198,201d199
<     <flow id="pt_bus_M48:0" type="pt_bus" route="pt_bus_M48:0" begin="188.0" end="1088.0" period="600" line="M48:0" >
<         <param key="name" value="Buslinie M48: Busseallee => S+U Alexanderplatz/Memhardstraße"/>
<truncated after showing first 30 lines>

TEST FAILED on ts-sim-winbuild-ba : misc createVehTypeDistribution example ( Last six runs Aug2019 )

---------- Differences in additional ----------
3,12c3,12
<         <vType carFollowModel="Krauss" class="passenger" id="exampleDist0" length="4.801" sigma="0.751" tau="0.825"/>
<         <vType carFollowModel="Krauss" class="passenger" id="exampleDist1" length="4.705" sigma="0.613" tau="0.786"/>
<         <vType carFollowModel="Krauss" class="passenger" id="exampleDist2" length="5.248" sigma="0.435" tau="0.683"/>
<         <vType carFollowModel="Krauss" class="passenger" id="exampleDist3" length="5.201" sigma="0.890" tau="0.918"/>
<         <vType carFollowModel="Krauss" class="passenger" id="exampleDist4" length="4.807" sigma="0.796" tau="1.031"/>
<         <vType carFollowModel="Krauss" class="passenger" id="exampleDist5" length="4.974" sigma="0.369" tau="0.947"/>
<         <vType carFollowModel="Krauss" class="passenger" id="exampleDist6" length="4.710" sigma="0.573" tau="0.706"/>
<         <vType carFollowModel="Krauss" class="passenger" id="exampleDist7" length="5.030" sigma="0.083" tau="0.772"/>
<         <vType carFollowModel="Krauss" class="passenger" id="exampleDist8" length="4.962" sigma="0.414" tau="0.707"/>
<         <vType carFollowModel="Krauss" class="passenger" id="exampleDist9" length="4.988" sigma="0.763" tau="0.894"/>
---
>         <vType carFollowModel="Krauss" class="passenger" id="exampleDist0" length="5.151" sigma="0.401" tau="0.825"/>
>         <vType carFollowModel="Krauss" class="passenger" id="exampleDist1" length="5.013" sigma="0.305" tau="0.786"/>
>         <vType carFollowModel="Krauss" class="passenger" id="exampleDist2" length="4.835" sigma="0.848" tau="0.683"/>
>         <vType carFollowModel="Krauss" class="passenger" id="exampleDist3" length="5.290" sigma="0.801" tau="0.918"/>
>         <vType carFollowModel="Krauss" class="passenger" id="exampleDist4" length="5.196" sigma="0.407" tau="1.031"/>
>         <vType carFollowModel="Krauss" class="passenger" id="exampleDist5" length="4.769" sigma="0.574" tau="0.947"/>
>         <vType carFollowModel="Krauss" class="passenger" id="exampleDist6" length="4.973" sigma="0.310" tau="0.706"/>
>         <vType carFollowModel="Krauss" class="passenger" id="exampleDist7" length="4.483" sigma="0.630" tau="0.772"/>
>         <vType carFollowModel="Krauss" class="passenger" id="exampleDist8" length="4.814" sigma="0.562" tau="0.707"/>
>         <vType carFollowModel="Krauss" class="passenger" id="exampleDist9" length="5.163" sigma="0.588" tau="0.894"/>

TEST FAILED on ts-sim-winbuild-ba : misc generateParkingAreaRerouters example ( Last six runs Aug2019 )

---------- Differences in errors ----------
0a1,4
> Traceback (most recent call last):
>   File "C:/Users/delphi/Code/sumoInternal/git/tests\..\tools/generateParkingAreaRerouters.py", line 22, in <module>
>     import numpy
> ModuleNotFoundError: No module named 'numpy'
---------- Missing result in additional ----------
<?xml version="1.0" encoding="UTF-8"?>
<additional>

    <rerouter id="parking_b" edges="b">
        <interval begin="0.0" end="86400">
        </interval>
    </rerouter>

    <rerouter id="parking_c" edges="c">
        <interval begin="0.0" end="86400">
        </interval>
    </rerouter>

    <rerouter id="parking_d" edges="d">
        <interval begin="0.0" end="86400">
        </interval>
    </rerouter>

    <rerouter id="parking_e" edges="e">
        <interval begin="0.0" end="86400">
        </interval>
    </rerouter>
</additional>

TEST FAILED on ts-sim-winbuild-ba : net netmatch plain ( Last six runs Aug2019 )

---------- Differences in errors ----------
0a1,3
> C:/Users/delphi/Code/sumoInternal/git/tests\..\tools/net\..\sumolib\__init__.py:28: UserWarning: No module named 'matplotlib'
>   warnings.warn(str(e))
> Warning: Module 'rtree' not available. Using brute-force fallback

2 TESTS FAILED on ts-sim-winbuild-ba :

---------- Differences in errors ----------
0a1,2
> C:\Users\delphi\Code\sumoInternal\git\tools\sumolib\__init__.py:28: UserWarning: No module named 'matplotlib'
>   warnings.warn(str(e))
---------- Differences in pois ----------
2,12c2,12
<     <poi id="r1#1_10.0" type="r1#1" color="107,0,255" layer="100" lon="516.45" lat="498.35"/>
<     <poi id="r1#1_11.0" type="r1#1" color="107,0,255" layer="100" lon="527.56" lat="498.35"/>
<     <poi id="r1#1_12.0" type="r1#1" color="107,0,255" layer="100" lon="538.67" lat="498.35"/>
<     <poi id="r1#1_13.0" type="r1#1" color="107,0,255" layer="100" lon="549.78" lat="498.35"/>
<     <poi id="r1#1_14.0" type="r1#1" color="107,0,255" layer="100" lon="560.89" lat="498.35"/>
<     <poi id="r1#1_15.0" type="r1#1" color="107,0,255" layer="100" lon="572.0" lat="498.35"/>
<     <poi id="r1#1_16.0" type="r1#1" color="107,0,255" layer="100" lon="583.11" lat="498.35"/>
<     <poi id="r1#1_17.0" type="r1#1" color="107,0,255" layer="100" lon="594.22" lat="498.35"/>
<     <poi id="r1#1_18.0" type="r1#1" color="107,0,255" layer="100" lon="605.33" lat="498.35"/>
<     <poi id="r1#1_19.0" type="r1#1" color="107,0,255" layer="100" lon="616.44" lat="498.35"/>
<     <poi id="r1#1_20.0" type="r1#1" color="107,0,255" layer="100" lon="627.55" lat="498.35"/>
---
>     <poi id="r1#1_10.0" type="r1#1" color="168,255,0" layer="100" lon="516.45" lat="498.35"/>
>     <poi id="r1#1_11.0" type="r1#1" color="168,255,0" layer="100" lon="527.56" lat="498.35"/>
>     <poi id="r1#1_12.0" type="r1#1" color="168,255,0" layer="100" lon="538.67" lat="498.35"/>
>     <poi id="r1#1_13.0" type="r1#1" color="168,255,0" layer="100" lon="549.78" lat="498.35"/>
>     <poi id="r1#1_14.0" type="r1#1" color="168,255,0" layer="100" lon="560.89" lat="498.35"/>
>     <poi id="r1#1_15.0" type="r1#1" color="168,255,0" layer="100" lon="572.0" lat="498.35"/>
>     <poi id="r1#1_16.0" type="r1#1" color="168,255,0" layer="100" lon="583.11" lat="498.35"/>
>     <poi id="r1#1_17.0" type="r1#1" color="168,255,0" layer="100" lon="594.22" lat="498.35"/>
>     <poi id="r1#1_18.0" type="r1#1" color="168,255,0" layer="100" lon="605.33" lat="498.35"/>
>     <poi id="r1#1_19.0" type="r1#1" color="168,255,0" layer="100" lon="616.44" lat="498.35"/>
>     <poi id="r1#1_20.0" type="r1#1" color="168,255,0" layer="100" lon="627.55" lat="498.35"/>
14c14
<     <poi id="r1#1_21.0" type="r1#1" color="107,0,255" layer="100" lon="638.66" lat="498.35"/>
---
>     <poi id="r1#1_21.0" type="r1#1" color="168,255,0" layer="100" lon="638.66" lat="498.35"/>
16c16
<     <poi id="r1#1_22.0" type="r1#1" color="107,0,255" layer="100" lon="649.77" lat="498.35"/>
<truncated after showing first 30 lines>
output converter persons poi ( Last six runs Aug2019 )
output converter poi ( Last six runs Aug2019 )

TEST FAILED on ts-sim-winbuild-ba : output generateITetrisIntersectionMetrics cross1ltl_freq300 ( Last six runs Aug2019 )

---------- Differences in errors ----------
0a1,4
> Traceback (most recent call last):
>   File "C:/Users/delphi/Code/sumoInternal/git/tests\..\tools/output/generateITetrisIntersectionMetrics.py", line 22, in <module>
>     from numpy import mean, log
> ModuleNotFoundError: No module named 'numpy'
---------- Differences in output ----------
1d0
< The calculation is done!
---------- Missing result in summary ----------
Traffic Light 0
=================
mean queue length in front of the junction: 66.4162069444
mean waiting time in front of the junction: 12.8841666667
number of stops: 4443.0
total waiting time at junction: 185532.0

TEST FAILED on ts-sim-winbuild-ba : output generateITetrisIntersectionMetrics cross1ltl_freq3600 ( Last six runs Aug2019 )

---------- Differences in errors ----------
0a1,4
> Traceback (most recent call last):
>   File "C:/Users/delphi/Code/sumoInternal/git/tests\..\tools/output/generateITetrisIntersectionMetrics.py", line 22, in <module>
>     from numpy import mean, log
> ModuleNotFoundError: No module named 'numpy'
---------- Differences in output ----------
1d0
< The calculation is done!
---------- Missing result in summary ----------
Traffic Light 0
=================
mean queue length in front of the junction: 66.4162159722
mean waiting time in front of the junction: 12.8841666667
number of stops: 4443.0
total waiting time at junction: 185532.0

TEST FAILED on ts-sim-winbuild-ba : output generateITetrisIntersectionMetrics cross3ltl_freq300 ( Last six runs Aug2019 )

---------- Differences in errors ----------
0a1,4
> Traceback (most recent call last):
>   File "C:/Users/delphi/Code/sumoInternal/git/tests\..\tools/output/generateITetrisIntersectionMetrics.py", line 22, in <module>
>     from numpy import mean, log
> ModuleNotFoundError: No module named 'numpy'
---------- Differences in output ----------
1d0
< The calculation is done!
---------- Missing result in summary ----------
Traffic Light 0
=================
mean queue length in front of the junction: 2.86360393519
mean waiting time in front of the junction: 0.568796296296
number of stops: 1008.0
total waiting time at junction: 24572.0

TEST FAILED on ts-sim-winbuild-ba : output generateITetrisIntersectionMetrics cross3ltl_freq3600 ( Last six runs Aug2019 )

---------- Differences in errors ----------
0a1,4
> Traceback (most recent call last):
>   File "C:/Users/delphi/Code/sumoInternal/git/tests\..\tools/output/generateITetrisIntersectionMetrics.py", line 22, in <module>
>     from numpy import mean, log
> ModuleNotFoundError: No module named 'numpy'
---------- Differences in output ----------
1d0
< The calculation is done!
---------- Missing result in summary ----------
Traffic Light 0
=================
mean queue length in front of the junction: 2.86360486111
mean waiting time in front of the junction: 0.568796296296
number of stops: 1008.0
total waiting time at junction: 24572.0

TEST FAILED on ts-sim-winbuild-ba : output generateITetrisIntersectionMetrics plain ( Last six runs Aug2019 )

---------- Differences in errors ----------
0a1,4
> Traceback (most recent call last):
>   File "C:/Users/delphi/Code/sumoInternal/git/tests\..\tools/output/generateITetrisIntersectionMetrics.py", line 22, in <module>
>     from numpy import mean, log
> ModuleNotFoundError: No module named 'numpy'
---------- Differences in output ----------
1,15d0
< Missing arguments
< Usage: 
< -n inputs\pasubio\pasubio.net.xml -p inputs\pasubio\
< 
< Options:
<   -h, --help            show this help message and exit
<   -n <FILE>, --netfile=<FILE>
<                         name of the netfile (f.e.
<                         'inputs\pasubio\a_costa.net.xml')
<   -p <FOLDER>, --path=<FOLDER>
<                         name of folder to work with (f.e. 'inputs\a_costa\')
<   -o <FOLDER>, --harmonoiseFile=<FOLDER>
<                         name of the harmonoise file
<   -e <FOLDER>, --HBEFAFile=<FOLDER>
<                         name of the HBEFA file

2 TESTS FAILED on ts-sim-winbuild-ba :

---------- Differences in errors ----------
0a1,2
> C:\Users\delphi\Code\sumoInternal\git\tools\sumolib\__init__.py:28: UserWarning: No module named 'matplotlib'
>   warnings.warn(str(e))
2a5,6
> C:/Users/delphi/Code/sumoInternal/git/tests\..\tools/output/generateTLSE1Detectors.py:87: DeprecationWarning: The 'warn' function is deprecated, use 'warning' instead
>   (str(lane_id)))
output generateTLSE1Detectors cross1ltl ( Last six runs Aug2019 )
output generateTLSE1Detectors cross3ltl ( Last six runs Aug2019 )

2 TESTS FAILED on ts-sim-winbuild-ba :

---------- Differences in errors ----------
0a1,2
> C:\Users\delphi\Code\sumoInternal\git\tools\sumolib\__init__.py:28: UserWarning: No module named 'matplotlib'
>   warnings.warn(str(e))
2a5,6
> C:/Users/delphi/Code/sumoInternal/git/tests\..\tools/output/generateTLSE2Detectors.py:132: DeprecationWarning: The 'warn' function is deprecated, use 'warning' instead
>   (str(lane_id)))
output generateTLSE2Detectors cross1ltl ( Last six runs Aug2019 )
output generateTLSE2Detectors cross3ltl ( Last six runs Aug2019 )

TEST FAILED on ts-sim-winbuild-ba : output vehrouteDiff ( Last six runs Aug2019 )

---------- Differences in errors ----------
0a1,2
> C:/Users/delphi/Code/sumoInternal/git/tests\..\tools/output\..\sumolib\__init__.py:28: UserWarning: No module named 'matplotlib'
>   warnings.warn(str(e))

TEST FAILED on ts-sim-winbuild-ba : route cut_routes routeRef ( Last six runs Aug2019 )

---------- Differences in additional ----------
2,3d1
<     <busStop endPos="40" id="busstop1" lane="middle_0" lines="100 101 102" startPos="20"/>
< </additional>
---------- Differences in errors ----------
0a1,8
> C:\Users\delphi\Code\sumoInternal\git\tools\sumolib\__init__.py:28: UserWarning: No module named 'matplotlib'
>   warnings.warn(str(e))
> Traceback (most recent call last):
>   File "C:/Users/delphi/Code/sumoInternal/git/tests\..\tools/route/cutRoutes.py", line 422, in <module>
>     main(get_options())
>   File "C:/Users/delphi/Code/sumoInternal/git/tests\..\tools/route/cutRoutes.py", line 363, in main
>     busStops.write(busStop.toXML('    ').decode('utf8'))
> AttributeError: 'str' object has no attribute 'decode'
---------- Differences in output ----------
2,6d1
< Kept 1 of 2 busStops
< Parsing routes from input_routes.rou.xml
< Parsed 4 vehicles and kept 2 routes
< Number of disconnected routes: 0. Most frequent missing edges:
< Wrote 2 standalone-routes and 4 vehicles
---------- Missing result in routes ----------
<!-- generated with cutRoutes.py for input_net.net.xml from ['input_routes.rou.xml'] -->
<routes xmlns:xsi="http://www.w3.org/2001/XMLSchema-instance" xsi:noNamespaceSchemaLocation="http://sumo.dlr.de/xsd/routes_file.xsd">
    <route edges="middle end" id="r0"/>
    <route edges="middle end" id="r1">
        <stop busStop="busstop1" duration="10" until="172.185251799"/>
    </route>
    <vehicle depart="27.81" id="v1" route="r0">
        <stop busStop="busstop1" duration="10"/>
    </vehicle>
    <vehicle depart="47.81" id="v3" route="r1"/>
    <vehicle depart="37.81" id="v2" route="r0"/>
    <vehicle depart="57.81" id="v4" route="r1"/>
</routes>

TEST FAILED on ts-sim-winbuild-ba : route cut_routes with_access ( Last six runs Aug2019 )

---------- Differences in additional ----------
2,5d1
<     <trainStop endPos="40" id="busstop1" lane="middle_0" lines="100 101 102" startPos="20">
<         <access lane="end_0" pos="20"/>
<     </trainStop>
< </additional>
---------- Differences in errors ----------
0a1,8
> C:\Users\delphi\Code\sumoInternal\git\tools\sumolib\__init__.py:28: UserWarning: No module named 'matplotlib'
>   warnings.warn(str(e))
> Traceback (most recent call last):
>   File "C:/Users/delphi/Code/sumoInternal/git/tests\..\tools/route/cutRoutes.py", line 422, in <module>
>     main(get_options())
>   File "C:/Users/delphi/Code/sumoInternal/git/tests\..\tools/route/cutRoutes.py", line 363, in main
>     busStops.write(busStop.toXML('    ').decode('utf8'))
> AttributeError: 'str' object has no attribute 'decode'
---------- Differences in output ----------
2,8d1
< Kept 1 of 1 busStops
< Parsing routes from input_routes.rou.xml
< Could not reconstruct new departure time for vehicle 'straight'. Using old departure time.
< Skipping bus stop 'busstop0', which could not be located.
< Parsed 1 vehicles and kept 1 routes
< Number of disconnected routes: 0. Most frequent missing edges:
< Wrote 1 routes
---------- Missing result in routes ----------
<!-- generated with cutRoutes.py for input_net.net.xml from ['input_routes.rou.xml'] -->
<routes xmlns:xsi="http://www.w3.org/2001/XMLSchema-instance" xsi:noNamespaceSchemaLocation="http://sumo.dlr.de/xsd/routes_file.xsd">
    <vehicle depart="0.00" id="straight">
        <route edges="middle end"/>
        <stop busStop="busstop1" duration="10"/>
    </vehicle>
</routes>

TEST FAILED on ts-sim-winbuild-ba : route cut_routes with_busstops ( Last six runs Aug2019 )

---------- Differences in additional ----------
2,3d1
<     <busStop endPos="40" id="busstop1" lane="middle_0" lines="100 101 102" name="班霍夫大街" startPos="20"/>
< </additional>
---------- Differences in errors ----------
0a1,8
> C:\Users\delphi\Code\sumoInternal\git\tools\sumolib\__init__.py:28: UserWarning: No module named 'matplotlib'
>   warnings.warn(str(e))
> Traceback (most recent call last):
>   File "C:/Users/delphi/Code/sumoInternal/git/tests\..\tools/route/cutRoutes.py", line 422, in <module>
>     main(get_options())
>   File "C:/Users/delphi/Code/sumoInternal/git/tests\..\tools/route/cutRoutes.py", line 363, in main
>     busStops.write(busStop.toXML('    ').decode('utf8'))
> AttributeError: 'str' object has no attribute 'decode'
---------- Differences in output ----------
2,7d1
< Kept 1 of 2 busStops
< Parsing routes from input_routes.rou.xml
< Could not reconstruct new departure time for vehicle 'straight'. Using old departure time.
< Parsed 1 vehicles and kept 1 routes
< Number of disconnected routes: 0. Most frequent missing edges:
< Wrote 1 routes
---------- Missing result in routes ----------
<!-- generated with cutRoutes.py for input_net.net.xml from ['input_routes.rou.xml'] -->
<routes xmlns:xsi="http://www.w3.org/2001/XMLSchema-instance" xsi:noNamespaceSchemaLocation="http://sumo.dlr.de/xsd/routes_file.xsd">
    <vehicle depart="0.00" id="straight">
        <route edges="middle end"/>
        <stop busStop="busstop1" duration="10"/>
    </vehicle>
</routes>

TEST FAILED on ts-sim-winbuild-ba : route route2poly spread ( Last six runs Aug2019 )

---------- Differences in errors ----------
0a1,2
> C:\Users\delphi\Code\sumoInternal\git\tools\sumolib\__init__.py:28: UserWarning: No module named 'matplotlib'
>   warnings.warn(str(e))
---------- Differences in pois ----------
2,7c2,3
< <poly id="31" color="102,0,255" layer="100" type="route" shape="200.0,101.65 108.05,101.65 108.05,101.65 91.95,101.65 91.95,101.65 0.0,101.65" lineWidth="0.02">
<     <param key="count" value="2"/>
< </poly>
< <poly id="52" color="246,0,255" layer="100" type="route" shape="0.0,97.35 92.2537904885,97.35 94.7166853428,99.9973027081 93.9669299178,101.515100276 92.2507400911,102.65 0.0,102.65" lineWidth="0.01">
<     <param key="count" value="1"/>
<     <param key="spread" value="1"/>
---
> <poly id="0" color="24,255,0" layer="100" type="route" shape="101.65,0.0 101.65,91.95 101.65,91.95 101.65,108.05 101.65,108.05 101.65,200.0" lineWidth="0.61">
>     <param key="count" value="61"/>
9c5
< <poly id="5" color="255,0,120" layer="100" type="route" shape="200.0,104.95 108.05,104.95 108.05,104.95 106.69,105.14 105.72,105.72 105.14,106.69 104.95,108.05 104.95,108.05 104.95,200.0" lineWidth="0.03">
---
> <poly id="5" color="0,255,120" layer="100" type="route" shape="200.0,104.95 108.05,104.95 108.05,104.95 106.69,105.14 105.72,105.72 105.14,106.69 104.95,108.05 104.95,108.05 104.95,200.0" lineWidth="0.03">
12,16c8
< <poly id="12" color="255,24,0" layer="100" type="route" shape="100.65,0.0 100.65,91.8784344567 100.078635891,95.8498833441 99.0916785809,97.506885067 98.5013956394,98.4906899694 95.8487238066,100.078802711 91.8784344567,100.65 0.0,100.65" lineWidth="0.1">
<     <param key="count" value="10"/>
<     <param key="spread" value="-1"/>
< </poly>
< <poly id="9" color="255,168,0" layer="100" type="route" shape="0.0,98.35 91.95,98.35 91.95,98.35 96.19,98.96 98.02,100.05 98.02,100.05 99.22,100.77 101.04,103.81 101.65,108.05 101.65,108.05 101.65,200.0" lineWidth="0.08">
---
> <poly id="9" color="0,246,255" layer="100" type="route" shape="0.0,97.35 92.02156554334125,97.35 96.53011665590282,97.998635891194 98.53311493304078,99.19167858085541 99.94931003055412,100.0413956393634 102.00119728854722,103.46872380656066 102.65,107.97843445665875 102.65,200.0" lineWidth="0.08">
18,20d9
< </poly>
< <poly id="63" color="198,255,0" layer="100" type="route" shape="97.35,200.0 97.35,107.746209512 99.9973027081,105.283314657 101.515100276,106.033070082 102.65,107.749259909 102.65,200.0" lineWidth="0.05">
<     <param key="count" value="5"/>
23,25c12,14
< <poly id="0" color="54,255,0" layer="100" type="route" shape="103.65,0.0 103.65,91.95 103.65,108.05 103.65,200.0" lineWidth="0.61">
<     <param key="count" value="61"/>
<     <param key="spread" value="2"/>
<truncated after showing first 30 lines>

6 TESTS FAILED on ts-sim-winbuild-ba :

---------- Differences in errors ----------
0a1,3
> C:/Users/delphi/Code/sumoInternal/git/tests\..\tools/route\..\sumolib\__init__.py:28: UserWarning: No module named 'matplotlib'
>   warnings.warn(str(e))
> Warning: Module 'rtree' not available. Using brute-force fallback
route tracemapper basic ( Last six runs Aug2019 )
route tracemapper fillGaps basic ( Last six runs Aug2019 )
route tracemapper internal delta ( Last six runs Aug2019 )
route tracemapper internal fillGaps ( Last six runs Aug2019 )
route tracemapper internal plain ( Last six runs Aug2019 )
route tracemapper offset ( Last six runs Aug2019 )

TEST FAILED on ts-sim-winbuild-ba : route tracemapper fillGaps geo ( Last six runs Aug2019 )

---------- Differences in errors ----------
0a1,14
> C:/Users/delphi/Code/sumoInternal/git/tests\..\tools/route\..\sumolib\__init__.py:28: UserWarning: No module named 'matplotlib'
>   warnings.warn(str(e))
> Traceback (most recent call last):
>   File "C:/Users/delphi/Code/sumoInternal/git/tests\..\tools/route/tracemapper.py", line 141, in <module>
>     for tid, trace in traces:
>   File "C:/Users/delphi/Code/sumoInternal/git/tests\..\tools/route/tracemapper.py", line 59, in readLines
>     trace = [net.convertLonLat2XY(*pos) for pos in trace]
>   File "C:/Users/delphi/Code/sumoInternal/git/tests\..\tools/route/tracemapper.py", line 59, in <listcomp>
>     trace = [net.convertLonLat2XY(*pos) for pos in trace]
>   File "C:/Users/delphi/Code/sumoInternal/git/tests\..\tools/route\..\sumolib\net\__init__.py", line 458, in convertLonLat2XY
>     x, y = self.getGeoProj()(lon, lat)
>   File "C:/Users/delphi/Code/sumoInternal/git/tests\..\tools/route\..\sumolib\net\__init__.py", line 440, in getGeoProj
>     import pyproj
> ModuleNotFoundError: No module named 'pyproj'
---------- Differences in output ----------
3d2
< mapping trace with 2 points
---------- Differences in routes ----------
2,3d1
<     <route id="vehicle1" edges="beg middle end"/>
< </routes>

TEST FAILED on ts-sim-winbuild-ba : route tracemapper geo ( Last six runs Aug2019 )

---------- Differences in errors ----------
0a1,14
> C:/Users/delphi/Code/sumoInternal/git/tests\..\tools/route\..\sumolib\__init__.py:28: UserWarning: No module named 'matplotlib'
>   warnings.warn(str(e))
> Traceback (most recent call last):
>   File "C:/Users/delphi/Code/sumoInternal/git/tests\..\tools/route/tracemapper.py", line 141, in <module>
>     for tid, trace in traces:
>   File "C:/Users/delphi/Code/sumoInternal/git/tests\..\tools/route/tracemapper.py", line 59, in readLines
>     trace = [net.convertLonLat2XY(*pos) for pos in trace]
>   File "C:/Users/delphi/Code/sumoInternal/git/tests\..\tools/route/tracemapper.py", line 59, in <listcomp>
>     trace = [net.convertLonLat2XY(*pos) for pos in trace]
>   File "C:/Users/delphi/Code/sumoInternal/git/tests\..\tools/route\..\sumolib\net\__init__.py", line 458, in convertLonLat2XY
>     x, y = self.getGeoProj()(lon, lat)
>   File "C:/Users/delphi/Code/sumoInternal/git/tests\..\tools/route\..\sumolib\net\__init__.py", line 440, in getGeoProj
>     import pyproj
> ModuleNotFoundError: No module named 'pyproj'
---------- Differences in output ----------
3d2
< mapping trace with 2 points
---------- Differences in routes ----------
2,3d1
<     <route id="vehicle1" edges="beg end"/>
< </routes>

TEST FAILED on ts-sim-winbuild-ba : sumolib geomhelper ( Last six runs Aug2019 )

---------- Differences in errors ----------
0a1,2
> C:/Users/delphi/Code/sumoInternal/git/tests\..\tests/tools/sumolib/geomhelper\..\..\..\..\tools\sumolib\__init__.py:28: UserWarning: No module named 'matplotlib'
>   warnings.warn(str(e))

TEST FAILED on ts-sim-winbuild-ba : sumolib init ( Last six runs Aug2019 )

---------- Differences in errors ----------
0a1,2
> C:/Users/delphi/Code/sumoInternal/git/tests\..\tests/tools/sumolib/init\..\..\..\..\tools\sumolib\__init__.py:28: UserWarning: No module named 'matplotlib'
>   warnings.warn(str(e))

TEST FAILED on ts-sim-winbuild-ba : sumolib net ( Last six runs Aug2019 )

---------- Differences in errors ----------
0a1,3
> C:\Users\delphi\Code\sumoInternal\git\tools\sumolib\__init__.py:28: UserWarning: No module named 'matplotlib'
>   warnings.warn(str(e))
> Warning: Module 'rtree' not available. Using brute-force fallback
---------- Differences in output ----------
14,18c14,18
< getNeighboringEdges [u':S_0', u'CS', u'SC']
< getNeighboringLanes [u':S_0_0', u'CS_0', u'CS_1', u'SC_0', u'SC_1']
< getNeighboringNodes only for incoming edges [u'C']
< getNeighboringNodes only for outgoing edges [u'C']
< getNeighboringNodes [u'E', u'N', u'S', u'W']
---
> getNeighboringEdges [':S_0', 'CS', 'SC']
> getNeighboringLanes [':S_0_0', 'CS_0', 'CS_1', 'SC_0', 'SC_1']
> getNeighboringNodes only for incoming edges ['C']
> getNeighboringNodes only for outgoing edges ['C']
> getNeighboringNodes ['E', 'N', 'S', 'W']

TEST FAILED on ts-sim-winbuild-ba : sumolib patch_network ( Last six runs Aug2019 )

---------- Differences in errors ----------
1a2,3
> C:\Users\delphi\Code\sumoInternal\git\tools\sumolib\__init__.py:28: UserWarning: No module named 'matplotlib'
>   warnings.warn(str(e))
---------- Differences in net ----------
6c6
<     <location netOffset="100.00,100.00" convBoundary="-3.00,-17.00,191.00,207.00" origBoundary="-10000000000.00,-10000000000.00,10000000000.00,10000000000.00" projParameter="!"/>
---
>     <location netOffset="100.00,100.00" convBoundary="14.00,-14.00,181.00,194.00" origBoundary="-10000000000.00,-10000000000.00,10000000000.00,10000000000.00" projParameter="!"/>
9c9
<         <lane id=":C_0_0" index="0" speed="13.89" length="9.90" shape="101.56,92.41 101.12,89.52 100.01,87.45 98.24,86.21 95.80,85.80"/>
---
>         <lane id=":C_0_0" index="0" speed="13.89" length="10.65" shape="129.08,93.35 126.60,93.41 124.59,94.49 123.04,96.59 121.96,99.69"/>
12,13c12
<         <lane id=":C_1_0" index="0" speed="13.89" length="22.11" shape="101.56,92.41 101.40,86.11 101.42,81.24 101.70,76.39 102.29,70.12"/>
<         <lane id=":C_1_1" index="1" speed="13.89" length="22.11" shape="104.76,92.30 104.59,86.07 104.61,81.36 104.89,76.65 105.47,70.44"/>
---
>         <lane id=":C_1_0" index="0" speed="13.89" length="22.64" shape="129.59,90.19 123.32,89.25 118.37,88.74 113.41,88.50 107.06,88.36"/>
15,16c14,15
<     <edge id=":C_3" function="internal">
<         <lane id=":C_3_0" index="0" speed="13.89" length="7.23" shape="104.76,92.30 105.39,86.66 106.19,85.33"/>
---
>     <edge id=":C_2" function="internal">
>         <lane id=":C_2_0" index="0" speed="13.89" length="6.85" shape="129.59,90.19 124.60,88.59 123.30,87.65"/>
18,19c17,18
<     <edge id=":C_4" function="internal">
<         <lane id=":C_4_0" index="0" speed="13.89" length="2.34" shape="104.76,92.30 105.52,91.08 106.31,90.65"/>
---
>     <edge id=":C_3" function="internal">
>         <lane id=":C_3_0" index="0" speed="13.89" length="2.34" shape="129.59,90.19 128.54,89.21 128.27,88.36"/>
22c21
<         <lane id=":C_18_0" index="0" speed="13.89" length="13.10" shape="106.19,85.33 107.70,82.81 111.69,80.74 117.36,80.46"/>
---
>         <lane id=":C_18_0" index="0" speed="13.89" length="15.56" shape="123.30,87.65 120.43,85.55 117.09,81.08 114.57,75.17"/>
25c24
<truncated after showing first 30 lines>
---------- Differences in nodes ----------
3c3
<     <node id="C" x="106.0" y="81.0">
---
>     <node id="C" x="120.0" y="87.0">
7,10c7,10
<     <node id="E" x="191.0" y="89.0"/>
<     <node id="N" x="110.0" y="207.0"/>
<     <node id="S" x="116.0" y="-17.0"/>
<     <node id="W" x="-3.0" y="81.0"/>
---
>     <node id="E" x="181.0" y="97.0"/>
>     <node id="N" x="95.0" y="194.0"/>
>     <node id="S" x="88.0" y="-14.0"/>
>     <node id="W" x="14.0" y="85.0"/>

TEST FAILED on ts-sim-winbuild-ba : sumolib sumolib3d ( Last six runs Aug2019 )

---------- Differences in errors ----------
0a1,2
> C:/Users/delphi/Code/sumoInternal/git/tests\..\tests/tools/sumolib/sumolib3d\..\..\..\..\tools\sumolib\__init__.py:28: UserWarning: No module named 'matplotlib'
>   warnings.warn(str(e))

TEST FAILED on ts-sim-winbuild-ba : sumolib tls ( Last six runs Aug2019 )

---------- Differences in errors ----------
0a1,8
> C:\Users\delphi\Code\sumoInternal\git\tools\sumolib\__init__.py:28: UserWarning: No module named 'matplotlib'
>   warnings.warn(str(e))
> Traceback (most recent call last):
>   File "C:/Users/delphi/Code/sumoInternal/git/tests\..\tests/tools/sumolib/tls/runner.py", line 32, in <module>
>     print(program.toXML(tls.getID()))
>   File "C:\Users\delphi\Code\sumoInternal\git\tools\sumolib\net\__init__.py", line 126, in toXML
>     next = '' if len(p.next) == 0 else ' next="%s"' % ' '.join(map(str, p.next))
> TypeError: object of type 'map' has no len()
---------- Differences in output ----------
1,12d0
<   <tlLogic id="C" type="actuated" programID="0" offset="0.0">
<     <phase duration="31" state="GGGggrrrrGGGggrrrr" minDur="5" maxDur="45"/>
<     <phase duration="4" state="yyyggrrrryyyggrrrr"/>
<     <phase duration="6" state="rrrGGrrrrrrrGGrrrr" name="leftTurnPhase2"/>
<     <phase duration="4" state="rrryyrrrrrrryyrrrr"/>
<     <phase duration="31" state="rrrrrGGggrrrrrGGgg" minDur="5" maxDur="45"/>
<     <phase duration="4" state="rrrrryyggrrrrryygg"/>
<     <phase duration="6" state="rrrrrrrGGrrrrrrrGG" name="leftTurnPhase4"/>
<     <phase duration="4" state="rrrrrrryyrrrrrrryy" next="0"/>
<     <param key="show-detectors" value="true"/>
<   </tlLogic>
< 

TEST FAILED on ts-sim-winbuild-ba : tls tls_csvSignalGroups template ( Last six runs Aug2019 )

---------- Differences in csv ----------
1,32d0
< [general]
< cycle time
< key;1
< subkey;0
< offset;0
< [links]
< SG_6;-468_0;--472_0
< SG_7;-468_0;--474_0
< SG_8;-468_1;--470_0
< SG_9;-470_0;--468_0
< SG_10;-470_0;--472_0
< SG_11;-470_0;--474_0
< SG_3;-472_0;--474_0
< SG_4;-472_0;--470_0
< SG_5;-472_0;--468_0
< SG_0;-474_0;--470_0
< SG_1;-474_0;--468_0
< SG_2;-474_1;--472_0
< [signal groups]
< id;on1;off1;on2;off2;transOn;transOff
< SG_6
< SG_7
< SG_8
< SG_9
< SG_10
< SG_11
< SG_3
< SG_4
< SG_5
<truncated after showing first 30 lines>
---------- Differences in errors ----------
0a1,8
> C:\Users\delphi\Code\sumoInternal\git\tools\sumolib\__init__.py:28: UserWarning: No module named 'matplotlib'
>   warnings.warn(str(e))
> Traceback (most recent call last):
>   File "C:/Users/delphi/Code/sumoInternal/git/tests\..\tools/tls/tls_csvSignalGroups.py", line 395, in <module>
>     writeInputTemplates(net, options.make_input_dir, options.delimiter)
>   File "C:/Users/delphi/Code/sumoInternal/git/tests\..\tools/tls/tls_csvSignalGroups.py", line 355, in writeInputTemplates
>     csvWriter.writerows(data)
> TypeError: a bytes-like object is required, not 'str'

TEST FAILED on ts-sim-winbuild-ba : trip randomTrips persontrips ( Last six runs Aug2019 )

---------- Differences in errors ----------
0a1,2
> C:\Users\delphi\Code\sumoInternal\git\tools\sumolib\__init__.py:28: UserWarning: No module named 'matplotlib'
>   warnings.warn(str(e))
---------- Differences in routes ----------
6c6
<         <walk edges="NC CS"/>
---
>         <walk edges="NC CS" departPos="0.00"/>
9c9
<         <walk edges="NC CS"/>
---
>         <walk edges="NC CS" departPos="0.00"/>
12c12
<         <walk edges="CS NC"/>
---
>         <walk edges="CS NC" departPos="0.00"/>
15c15
<         <walk edges="CS NC"/>
---
>         <walk edges="CS NC" departPos="0.00"/>
18c18
<         <walk edges="NC CS"/>
---
>         <walk edges="NC CS" departPos="0.00"/>
21c21
<         <walk edges="NC CS"/>
---
>         <walk edges="NC CS" departPos="0.00"/>
24c24
<         <walk edges="CS NC"/>
---
>         <walk edges="CS NC" departPos="0.00"/>
27c27
<         <walk edges="NC CS"/>
<truncated after showing first 30 lines>

TEST FAILED on ts-sim-winbuild-ba : turndefs generateTurnDefs unit_tests ( Last six runs Aug2019 )

---------- Differences in errors ----------
1c1,7
< .......................
---
> C:\Users\delphi\Code\sumoInternal\git\tools\sumolib\__init__.py:28: UserWarning: No module named 'matplotlib'
>   warnings.warn(str(e))
> ....C:/Users/delphi/Code/sumoInternal/git/tests\..\tests/tools/turndefs/generateTurnDefs/unit_tests\..\..\..\..\..\tools\turn-defs\connections.py:148: DeprecationWarning: The 'warn' method is deprecated, use 'warning' instead
>   % (str(source), str(source_lane), str(destination)))
> ...............C:/Users/delphi/Code/sumoInternal/git/tests\..\tests/tools/turndefs/generateTurnDefs/unit_tests\..\..\..\..\..\tools\turn-defs\turndefinitions.py:63: DeprecationWarning: The 'warn' method is deprecated, use 'warning' instead
>   (self.turn_definitions[source][destination]))
> ....

TEST FAILED on ts-sim-winbuild-ba : visualisation plot_csv_bars plain ( Last six runs Aug2019 )

---------- Differences in errors ----------
0a1,10
> C:\Users\delphi\Code\sumoInternal\git\tools\sumolib\__init__.py:28: UserWarning: No module named 'matplotlib'
>   warnings.warn(str(e))
> Traceback (most recent call last):
>   File "C:/Users/delphi/Code/sumoInternal/git/tests\..\tools/visualization/plot_csv_bars.py", line 30, in <module>
>     from sumolib.visualization import helpers  # noqa
>   File "C:\Users\delphi\Code\sumoInternal\git\tools\sumolib\visualization\__init__.py", line 17, in <module>
>     from . import helpers   # noqa
>   File "C:\Users\delphi\Code\sumoInternal\git\tools\sumolib\visualization\helpers.py", line 22, in <module>
>     import matplotlib
> ModuleNotFoundError: No module named 'matplotlib'
---------- Missing result in image ----------
<?xml version="1.0" encoding="utf-8" standalone="no"?>
<!DOCTYPE svg PUBLIC "-//W3C//DTD SVG 1.1//EN"
  "http://www.w3.org/Graphics/SVG/1.1/DTD/svg11.dtd">
<!-- Created with matplotlib (http://matplotlib.org/) -->
<svg height="345pt" version="1.1" viewBox="0 0 460 345" width="460pt" xmlns="http://www.w3.org/2000/svg" xmlns:xlink="http://www.w3.org/1999/xlink">
 <defs>
  <style type="text/css">
*{stroke-linecap:butt;stroke-linejoin:round;}
  </style>
 </defs>
 <g id="ReplacedTransientID">
  <g id="ReplacedTransientID">
   <path d="M 0 345.6 
L 460.8 345.6 
L 460.8 0 
L 0 0 
z
" style="fill:#ffffff;"/>
  </g>
  <g id="ReplacedTransientID">
   <g id="ReplacedTransientID">
    <path d="M 57.6 307.584 
L 414.72 307.584 
L 414.72 41.472 
L 57.6 41.472 
z
" style="fill:#ffffff;"/>
   </g>
   <g id="ReplacedTransientID">
    <path clip-path="url(ReplacedTransientURL)" d="M 57.6 318.828169 
<truncated after showing first 30 lines>

TEST FAILED on ts-sim-winbuild-ba : visualisation plot_csv_bars pm10effects ( Last six runs Aug2019 )

---------- Differences in errors ----------
0a1,10
> C:\Users\delphi\Code\sumoInternal\git\tools\sumolib\__init__.py:28: UserWarning: No module named 'matplotlib'
>   warnings.warn(str(e))
> Traceback (most recent call last):
>   File "C:/Users/delphi/Code/sumoInternal/git/tests\..\tools/visualization/plot_csv_bars.py", line 30, in <module>
>     from sumolib.visualization import helpers  # noqa
>   File "C:\Users\delphi\Code\sumoInternal\git\tools\sumolib\visualization\__init__.py", line 17, in <module>
>     from . import helpers   # noqa
>   File "C:\Users\delphi\Code\sumoInternal\git\tools\sumolib\visualization\helpers.py", line 22, in <module>
>     import matplotlib
> ModuleNotFoundError: No module named 'matplotlib'
---------- Missing result in image ----------
<?xml version="1.0" encoding="utf-8" standalone="no"?>
<!DOCTYPE svg PUBLIC "-//W3C//DTD SVG 1.1//EN"
  "http://www.w3.org/Graphics/SVG/1.1/DTD/svg11.dtd">
<!-- Created with matplotlib (http://matplotlib.org/) -->
<svg height="288pt" version="1.1" viewBox="0 0 576 288" width="576pt" xmlns="http://www.w3.org/2000/svg" xmlns:xlink="http://www.w3.org/1999/xlink">
 <defs>
  <style type="text/css">
*{stroke-linecap:butt;stroke-linejoin:round;}
  </style>
 </defs>
 <g id="ReplacedTransientID">
  <g id="ReplacedTransientID">
   <path d="M 0 288 
L 576 288 
L 576 0 
L 0 0 
z
" style="fill:#ffffff;"/>
  </g>
  <g id="ReplacedTransientID">
   <g id="ReplacedTransientID">
    <path d="M 161.28 259.2 
L 547.2 259.2 
L 547.2 28.8 
L 161.28 28.8 
z
" style="fill:#ffffff;"/>
   </g>
   <g id="ReplacedTransientID">
    <path clip-path="url(ReplacedTransientURL)" d="M 161.28 262.638806 
<truncated after showing first 30 lines>

TEST FAILED on ts-sim-winbuild-ba : visualisation plot_csv_bars vertical ( Last six runs Aug2019 )

---------- Differences in errors ----------
0a1,10
> C:\Users\delphi\Code\sumoInternal\git\tools\sumolib\__init__.py:28: UserWarning: No module named 'matplotlib'
>   warnings.warn(str(e))
> Traceback (most recent call last):
>   File "C:/Users/delphi/Code/sumoInternal/git/tests\..\tools/visualization/plot_csv_bars.py", line 30, in <module>
>     from sumolib.visualization import helpers  # noqa
>   File "C:\Users\delphi\Code\sumoInternal\git\tools\sumolib\visualization\__init__.py", line 17, in <module>
>     from . import helpers   # noqa
>   File "C:\Users\delphi\Code\sumoInternal\git\tools\sumolib\visualization\helpers.py", line 22, in <module>
>     import matplotlib
> ModuleNotFoundError: No module named 'matplotlib'
---------- Missing result in image ----------
<?xml version="1.0" encoding="utf-8" standalone="no"?>
<!DOCTYPE svg PUBLIC "-//W3C//DTD SVG 1.1//EN"
  "http://www.w3.org/Graphics/SVG/1.1/DTD/svg11.dtd">
<!-- Created with matplotlib (http://matplotlib.org/) -->
<svg height="576pt" version="1.1" viewBox="0 0 288 576" width="288pt" xmlns="http://www.w3.org/2000/svg" xmlns:xlink="http://www.w3.org/1999/xlink">
 <defs>
  <style type="text/css">
*{stroke-linecap:butt;stroke-linejoin:round;}
  </style>
 </defs>
 <g id="ReplacedTransientID">
  <g id="ReplacedTransientID">
   <path d="M 0 576 
L 288 576 
L 288 0 
L 0 0 
z
" style="fill:#ffffff;"/>
  </g>
  <g id="ReplacedTransientID">
   <g id="ReplacedTransientID">
    <path d="M 36 512.64 
L 259.2 512.64 
L 259.2 69.12 
L 36 69.12 
z
" style="fill:#ffffff;"/>
   </g>
   <g id="ReplacedTransientID">
    <path clip-path="url(ReplacedTransientURL)" d="M 32.668657 512.64 
<truncated after showing first 30 lines>

TEST FAILED on ts-sim-winbuild-ba : visualisation plot_csv_pie paradigm ( Last six runs Aug2019 )

---------- Differences in errors ----------
0a1,10
> C:\Users\delphi\Code\sumoInternal\git\tools\sumolib\__init__.py:28: UserWarning: No module named 'matplotlib'
>   warnings.warn(str(e))
> Traceback (most recent call last):
>   File "C:/Users/delphi/Code/sumoInternal/git/tests\..\tools/visualization/plot_csv_pie.py", line 31, in <module>
>     from sumolib.visualization import helpers  # noqa
>   File "C:\Users\delphi\Code\sumoInternal\git\tools\sumolib\visualization\__init__.py", line 17, in <module>
>     from . import helpers   # noqa
>   File "C:\Users\delphi\Code\sumoInternal\git\tools\sumolib\visualization\helpers.py", line 22, in <module>
>     import matplotlib
> ModuleNotFoundError: No module named 'matplotlib'
---------- Missing result in image ----------
<?xml version="1.0" encoding="utf-8" standalone="no"?>
<!DOCTYPE svg PUBLIC "-//W3C//DTD SVG 1.1//EN"
  "http://www.w3.org/Graphics/SVG/1.1/DTD/svg11.dtd">
<!-- Created with matplotlib (http://matplotlib.org/) -->
<svg height="432pt" version="1.1" viewBox="0 0 432 432" width="432pt" xmlns="http://www.w3.org/2000/svg" xmlns:xlink="http://www.w3.org/1999/xlink">
 <defs>
  <style type="text/css">
*{stroke-linecap:butt;stroke-linejoin:round;}
  </style>
 </defs>
 <g id="ReplacedTransientID">
  <g id="ReplacedTransientID">
   <path d="M 0 432 
L 432 432 
L 432 0 
L 0 0 
z
" style="fill:#ffffff;"/>
  </g>
  <g id="ReplacedTransientID">
   <g id="ReplacedTransientID">
    <path d="M 355.32 218.16 
C 355.32 211.359802 354.7953 204.5696 353.750514 197.849098 
C 352.705729 191.128595 351.143928 184.497549 349.078845 178.014265 
L 221.4 218.16 
L 355.32 218.16 
z
" style="fill:#7fc97f;"/>
   </g>
   <g id="ReplacedTransientID">
<truncated after showing first 30 lines>

TEST FAILED on ts-sim-winbuild-ba : visualisation plot_csv_pie plain ( Last six runs Aug2019 )

---------- Differences in errors ----------
0a1,10
> C:\Users\delphi\Code\sumoInternal\git\tools\sumolib\__init__.py:28: UserWarning: No module named 'matplotlib'
>   warnings.warn(str(e))
> Traceback (most recent call last):
>   File "C:/Users/delphi/Code/sumoInternal/git/tests\..\tools/visualization/plot_csv_pie.py", line 31, in <module>
>     from sumolib.visualization import helpers  # noqa
>   File "C:\Users\delphi\Code\sumoInternal\git\tools\sumolib\visualization\__init__.py", line 17, in <module>
>     from . import helpers   # noqa
>   File "C:\Users\delphi\Code\sumoInternal\git\tools\sumolib\visualization\helpers.py", line 22, in <module>
>     import matplotlib
> ModuleNotFoundError: No module named 'matplotlib'
---------- Missing result in image ----------
<?xml version="1.0" encoding="utf-8" standalone="no"?>
<!DOCTYPE svg PUBLIC "-//W3C//DTD SVG 1.1//EN"
  "http://www.w3.org/Graphics/SVG/1.1/DTD/svg11.dtd">
<!-- Created with matplotlib (http://matplotlib.org/) -->
<svg height="345pt" version="1.1" viewBox="0 0 460 345" width="460pt" xmlns="http://www.w3.org/2000/svg" xmlns:xlink="http://www.w3.org/1999/xlink">
 <defs>
  <style type="text/css">
*{stroke-linecap:butt;stroke-linejoin:round;}
  </style>
 </defs>
 <g id="ReplacedTransientID">
  <g id="ReplacedTransientID">
   <path d="M 0 345.6 
L 460.8 345.6 
L 460.8 0 
L 0 0 
z
" style="fill:#ffffff;"/>
  </g>
  <g id="ReplacedTransientID">
   <g id="ReplacedTransientID">
    <path d="M 379.008 174.528 
C 379.008 169.087842 378.44832 163.65568 377.333882 158.279278 
C 376.219444 152.902876 374.553523 147.598039 372.350768 142.411412 
L 236.16 174.528 
L 379.008 174.528 
z
"/>
   </g>
   <g id="ReplacedTransientID">
<truncated after showing first 30 lines>

TEST FAILED on ts-sim-winbuild-ba : visualisation plot_csv_pie pm10effects ( Last six runs Aug2019 )

---------- Differences in errors ----------
0a1,10
> C:\Users\delphi\Code\sumoInternal\git\tools\sumolib\__init__.py:28: UserWarning: No module named 'matplotlib'
>   warnings.warn(str(e))
> Traceback (most recent call last):
>   File "C:/Users/delphi/Code/sumoInternal/git/tests\..\tools/visualization/plot_csv_pie.py", line 31, in <module>
>     from sumolib.visualization import helpers  # noqa
>   File "C:\Users\delphi\Code\sumoInternal\git\tools\sumolib\visualization\__init__.py", line 17, in <module>
>     from . import helpers   # noqa
>   File "C:\Users\delphi\Code\sumoInternal\git\tools\sumolib\visualization\helpers.py", line 22, in <module>
>     import matplotlib
> ModuleNotFoundError: No module named 'matplotlib'
---------- Missing result in image ----------
<?xml version="1.0" encoding="utf-8" standalone="no"?>
<!DOCTYPE svg PUBLIC "-//W3C//DTD SVG 1.1//EN"
  "http://www.w3.org/Graphics/SVG/1.1/DTD/svg11.dtd">
<!-- Created with matplotlib (http://matplotlib.org/) -->
<svg height="432pt" version="1.1" viewBox="0 0 432 432" width="432pt" xmlns="http://www.w3.org/2000/svg" xmlns:xlink="http://www.w3.org/1999/xlink">
 <defs>
  <style type="text/css">
*{stroke-linecap:butt;stroke-linejoin:round;}
  </style>
 </defs>
 <g id="ReplacedTransientID">
  <g id="ReplacedTransientID">
   <path d="M 0 432 
L 432 432 
L 432 0 
L 0 0 
z
" style="fill:#ffffff;"/>
  </g>
  <g id="ReplacedTransientID">
   <g id="ReplacedTransientID">
    <path d="M 221.4 85.104 
C 221.4 85.104 221.4 85.104 221.4 85.104 
L 221.4 218.16 
L 221.4 85.104 
z
" style="fill:#a50026;"/>
   </g>
   <g id="ReplacedTransientID">
    <path d="M 221.4 85.104 
<truncated after showing first 30 lines>

2 TESTS FAILED on ts-sim-winbuild-ba :

---------- Differences in errors ----------
0a1,10
> C:\Users\delphi\Code\sumoInternal\git\tools\sumolib\__init__.py:28: UserWarning: No module named 'matplotlib'
>   warnings.warn(str(e))
> Traceback (most recent call last):
>   File "C:/Users/delphi/Code/sumoInternal/git/tests\..\tools/visualization/plot_net_dump.py", line 30, in <module>
>     from sumolib.visualization import helpers  # noqa
>   File "C:\Users\delphi\Code\sumoInternal\git\tools\sumolib\visualization\__init__.py", line 17, in <module>
>     from . import helpers   # noqa
>   File "C:\Users\delphi\Code\sumoInternal\git\tools\sumolib\visualization\helpers.py", line 22, in <module>
>     import matplotlib
> ModuleNotFoundError: No module named 'matplotlib'
---------- Missing result in image ----------
<?xml version="1.0" encoding="utf-8" standalone="no"?>
<!DOCTYPE svg PUBLIC "-//W3C//DTD SVG 1.1//EN"
  "http://www.w3.org/Graphics/SVG/1.1/DTD/svg11.dtd">
<!-- Created with matplotlib (http://matplotlib.org/) -->
<svg height="345pt" version="1.1" viewBox="0 0 460 345" width="460pt" xmlns="http://www.w3.org/2000/svg" xmlns:xlink="http://www.w3.org/1999/xlink">
 <defs>
  <style type="text/css">
*{stroke-linecap:butt;stroke-linejoin:round;}
  </style>
 </defs>
 <g id="ReplacedTransientID">
  <g id="ReplacedTransientID">
   <path d="M 0 345.6 
L 460.8 345.6 
L 460.8 0 
L 0 0 
z
" style="fill:#ffffff;"/>
  </g>
  <g id="ReplacedTransientID">
   <g id="ReplacedTransientID">
    <path d="M 57.6 246.099009 
L 343.296 246.099009 
L 343.296 102.956991 
L 57.6 102.956991 
z
" style="fill:#ffffff;"/>
   </g>
   <g id="ReplacedTransientID">
    <g id="ReplacedTransientID">
<truncated after showing first 30 lines>
visualisation plot_net_dump logColors ( Last six runs Aug2019 )
visualisation plot_net_dump plain ( Last six runs Aug2019 )

TEST FAILED on ts-sim-winbuild-ba : visualisation plot_net_dump multiple_intervals ( Last six runs Aug2019 )

---------- Differences in errors ----------
0a1,10
> C:\Users\delphi\Code\sumoInternal\git\tools\sumolib\__init__.py:28: UserWarning: No module named 'matplotlib'
>   warnings.warn(str(e))
> Traceback (most recent call last):
>   File "C:/Users/delphi/Code/sumoInternal/git/tests\..\tools/visualization/plot_net_dump.py", line 30, in <module>
>     from sumolib.visualization import helpers  # noqa
>   File "C:\Users\delphi\Code\sumoInternal\git\tools\sumolib\visualization\__init__.py", line 17, in <module>
>     from . import helpers   # noqa
>   File "C:\Users\delphi\Code\sumoInternal\git\tools\sumolib\visualization\helpers.py", line 22, in <module>
>     import matplotlib
> ModuleNotFoundError: No module named 'matplotlib'
---------- Differences in output ----------
1d0
< Warning: multiple time intervals detected, but the output filename(s) do not contain a '%s' placeholder. Continuing by using a default placeholder.
---------- Missing result in image-600 ----------
<?xml version="1.0" encoding="utf-8" standalone="no"?>
<!DOCTYPE svg PUBLIC "-//W3C//DTD SVG 1.1//EN"
  "http://www.w3.org/Graphics/SVG/1.1/DTD/svg11.dtd">
<!-- Created with matplotlib (http://matplotlib.org/) -->
<svg height="345pt" version="1.1" viewBox="0 0 460 345" width="460pt" xmlns="http://www.w3.org/2000/svg" xmlns:xlink="http://www.w3.org/1999/xlink">
 <defs>
  <style type="text/css">
*{stroke-linecap:butt;stroke-linejoin:round;}
  </style>
 </defs>
 <g id="ReplacedTransientID">
  <g id="ReplacedTransientID">
   <path d="M 0 345.6 
L 460.8 345.6 
L 460.8 0 
L 0 0 
z
" style="fill:#ffffff;"/>
  </g>
  <g id="ReplacedTransientID">
   <g id="ReplacedTransientID">
    <path d="M 57.6 246.099009 
L 343.296 246.099009 
L 343.296 102.956991 
L 57.6 102.956991 
z
" style="fill:#ffffff;"/>
   </g>
   <g id="ReplacedTransientID">
    <g id="ReplacedTransientID">
<truncated after showing first 30 lines>
---------- Missing result in image-800 ----------
<?xml version="1.0" encoding="utf-8" standalone="no"?>
<!DOCTYPE svg PUBLIC "-//W3C//DTD SVG 1.1//EN"
  "http://www.w3.org/Graphics/SVG/1.1/DTD/svg11.dtd">
<!-- Created with matplotlib (http://matplotlib.org/) -->
<svg height="345pt" version="1.1" viewBox="0 0 460 345" width="460pt" xmlns="http://www.w3.org/2000/svg" xmlns:xlink="http://www.w3.org/1999/xlink">
 <defs>
  <style type="text/css">
*{stroke-linecap:butt;stroke-linejoin:round;}
  </style>
 </defs>
 <g id="ReplacedTransientID">
  <g id="ReplacedTransientID">
   <path d="M 0 345.6 
L 460.8 345.6 
L 460.8 0 
L 0 0 
z
" style="fill:#ffffff;"/>
  </g>
  <g id="ReplacedTransientID">
   <g id="ReplacedTransientID">
    <path d="M 57.6 246.099009 
L 343.296 246.099009 
L 343.296 102.956991 
L 57.6 102.956991 
z
" style="fill:#ffffff;"/>
   </g>
   <g id="ReplacedTransientID">
    <g id="ReplacedTransientID">
<truncated after showing first 30 lines>

TEST FAILED on ts-sim-winbuild-ba : visualisation plot_net_speeds plain ( Last six runs Aug2019 )

---------- Differences in errors ----------
0a1,10
> C:\Users\delphi\Code\sumoInternal\git\tools\sumolib\__init__.py:28: UserWarning: No module named 'matplotlib'
>   warnings.warn(str(e))
> Traceback (most recent call last):
>   File "C:/Users/delphi/Code/sumoInternal/git/tests\..\tools/visualization/plot_net_speeds.py", line 27, in <module>
>     from sumolib.visualization import helpers  # noqa
>   File "C:\Users\delphi\Code\sumoInternal\git\tools\sumolib\visualization\__init__.py", line 17, in <module>
>     from . import helpers   # noqa
>   File "C:\Users\delphi\Code\sumoInternal\git\tools\sumolib\visualization\helpers.py", line 22, in <module>
>     import matplotlib
> ModuleNotFoundError: No module named 'matplotlib'
---------- Differences in output ----------
1d0
< 5.0 -> 40.0
---------- Missing result in image ----------
<?xml version="1.0" encoding="utf-8" standalone="no"?>
<!DOCTYPE svg PUBLIC "-//W3C//DTD SVG 1.1//EN"
  "http://www.w3.org/Graphics/SVG/1.1/DTD/svg11.dtd">
<!-- Created with matplotlib (http://matplotlib.org/) -->
<svg height="345pt" version="1.1" viewBox="0 0 460 345" width="460pt" xmlns="http://www.w3.org/2000/svg" xmlns:xlink="http://www.w3.org/1999/xlink">
 <defs>
  <style type="text/css">
*{stroke-linecap:butt;stroke-linejoin:round;}
  </style>
 </defs>
 <g id="ReplacedTransientID">
  <g id="ReplacedTransientID">
   <path d="M 0 345.6 
L 460.8 345.6 
L 460.8 0 
L 0 0 
z
" style="fill:#ffffff;"/>
  </g>
  <g id="ReplacedTransientID">
   <g id="ReplacedTransientID">
    <path d="M 57.6 246.099009 
L 343.296 246.099009 
L 343.296 102.956991 
L 57.6 102.956991 
z
" style="fill:#ffffff;"/>
   </g>
   <g id="ReplacedTransientID">
    <g id="ReplacedTransientID">
<truncated after showing first 30 lines>

TEST FAILED on ts-sim-winbuild-ba : visualisation plot_summary plain ( Last six runs Aug2019 )

---------- Differences in errors ----------
0a1,10
> C:\Users\delphi\Code\sumoInternal\git\tools\sumolib\__init__.py:28: UserWarning: No module named 'matplotlib'
>   warnings.warn(str(e))
> Traceback (most recent call last):
>   File "C:/Users/delphi/Code/sumoInternal/git/tests\..\tools/visualization/plot_summary.py", line 30, in <module>
>     from sumolib.visualization import helpers  # noqa
>   File "C:\Users\delphi\Code\sumoInternal\git\tools\sumolib\visualization\__init__.py", line 17, in <module>
>     from . import helpers   # noqa
>   File "C:\Users\delphi\Code\sumoInternal\git\tools\sumolib\visualization\helpers.py", line 22, in <module>
>     import matplotlib
> ModuleNotFoundError: No module named 'matplotlib'
---------- Missing result in image ----------
<?xml version="1.0" encoding="utf-8" standalone="no"?>
<!DOCTYPE svg PUBLIC "-//W3C//DTD SVG 1.1//EN"
  "http://www.w3.org/Graphics/SVG/1.1/DTD/svg11.dtd">
<!-- Created with matplotlib (http://matplotlib.org/) -->
<svg height="345pt" version="1.1" viewBox="0 0 460 345" width="460pt" xmlns="http://www.w3.org/2000/svg" xmlns:xlink="http://www.w3.org/1999/xlink">
 <defs>
  <style type="text/css">
*{stroke-linecap:butt;stroke-linejoin:round;}
  </style>
 </defs>
 <g id="ReplacedTransientID">
  <g id="ReplacedTransientID">
   <path d="M 0 345.6 
L 460.8 345.6 
L 460.8 0 
L 0 0 
z
" style="fill:#ffffff;"/>
  </g>
  <g id="ReplacedTransientID">
   <g id="ReplacedTransientID">
    <path d="M 57.6 307.584 
L 414.72 307.584 
L 414.72 41.472 
L 57.6 41.472 
z
" style="fill:#ffffff;"/>
   </g>
   <g id="ReplacedTransientID">
    <g id="ReplacedTransientID">
<truncated after showing first 30 lines>

TEST FAILED on ts-sim-winbuild-ba : xml csv2xml plain_edges ( Last six runs Aug2019 )

---------- Differences in xml ----------
2,9c2,9
<     <edge to="E" speed="13.89" id="CE" from="C" numLanes="2" priority="2" _version="1.1"/>
<     <edge to="N" speed="13.89" id="CN" from="C" numLanes="2" priority="2" _version="1.1"/>
<     <edge to="S" speed="13.89" id="CS" from="C" numLanes="2" priority="2" _version="1.1"/>
<     <edge to="W" speed="13.89" id="CW" from="C" numLanes="2" priority="2" _version="1.1"/>
<     <edge to="C" speed="13.89" id="EC" from="E" numLanes="2" priority="2" _version="1.1"/>
<     <edge to="C" speed="13.89" id="NC" from="N" numLanes="2" priority="2" _version="1.1"/>
<     <edge to="C" speed="13.89" id="SC" from="S" numLanes="2" priority="2" _version="1.1"/>
<     <edge to="C" speed="13.89" id="WC" from="W" numLanes="2" priority="2" _version="1.1"/>
---
>     <edge _version="1.1" from="C" id="CE" numLanes="2" priority="2" speed="13.89" to="E"/>
>     <edge _version="1.1" from="C" id="CN" numLanes="2" priority="2" speed="13.89" to="N"/>
>     <edge _version="1.1" from="C" id="CS" numLanes="2" priority="2" speed="13.89" to="S"/>
>     <edge _version="1.1" from="C" id="CW" numLanes="2" priority="2" speed="13.89" to="W"/>
>     <edge _version="1.1" from="E" id="EC" numLanes="2" priority="2" speed="13.89" to="C"/>
>     <edge _version="1.1" from="N" id="NC" numLanes="2" priority="2" speed="13.89" to="C"/>
>     <edge _version="1.1" from="S" id="SC" numLanes="2" priority="2" speed="13.89" to="C"/>
>     <edge _version="1.1" from="W" id="WC" numLanes="2" priority="2" speed="13.89" to="C"/>

TEST FAILED on ts-sim-winbuild-ba : xml schemaCheck tests additional ( Last six runs Aug2019 )

---------- Differences in errors ----------
1d0
< Error on parsing 'sumo/extended/calibrator/errors/invalid_flow/input_additional.add.xml'!
3,629c2,12
< XMLSyntaxError: Opening and ending tag mismatch: additional line 1 and calibrator, line 5, column 18
< -- Unordered text as found by filter 'ERROR:SCHEMA' --
< netedit/additionalElements/access/load/friendlypos/input_additionals.add.xml:8:0:ERROR:SCHEMASV:SCHEMAV_CVC_DATATYPE_VALID_1_2_1: Element 'access', attribute 'friendlyPos': 'dummyFriendlyPos' is not a valid value of the atomic type 'boolType'.
< netedit/additionalElements/access/load/friendlypos/input_additionals.add.xml:8:0:ERROR:SCHEMASV:SCHEMAV_CVC_ENUMERATION_VALID: Element 'access', attribute 'friendlyPos': [facet 'enumeration'] The value 'dummyFriendlyPos' is not an element of the set {'true', 'false', 'True', 'False', 'yes', 'no', 'on', 'off', '1', '0', 'x', '-'}.
< netedit/additionalElements/access/load/genericparameters/input_additionals.add.xml:18:0:ERROR:SCHEMASV:SCHEMAV_CVC_COMPLEX_TYPE_4: Element 'param': The attribute 'value' is required but missing.
< netedit/additionalElements/access/load/genericparameters/input_additionals.add.xml:27:0:ERROR:SCHEMASV:SCHEMAV_CVC_COMPLEX_TYPE_4: Element 'param': The attribute 'key' is required but missing.
< netedit/additionalElements/access/load/genericparameters/input_additionals.add.xml:27:0:ERROR:SCHEMASV:SCHEMAV_CVC_COMPLEX_TYPE_4: Element 'param': The attribute 'value' is required but missing.
< netedit/additionalElements/access/load/genericparameters/input_additionals.add.xml:9:0:ERROR:SCHEMASV:SCHEMAV_CVC_COMPLEX_TYPE_4: Element 'param': The attribute 'key' is required but missing.
< netedit/additionalElements/access/load/invalid_parent/input_additionals.add.xml:3:0:ERROR:SCHEMASV:SCHEMAV_CVC_COMPLEX_TYPE_4: Element 'busStop': The attribute 'id' is required but missing.
< netedit/additionalElements/access/load/lane/input_additionals.add.xml:5:0:ERROR:SCHEMASV:SCHEMAV_CVC_COMPLEX_TYPE_4: Element 'access': The attribute 'lane' is required but missing.
< netedit/additionalElements/access/load/length/input_additionals.add.xml:11:0:ERROR:SCHEMASV:SCHEMAV_CVC_DATATYPE_VALID_1_2_1: Element 'access', attribute 'length': '-30' is not a valid value of the atomic type 'nonNegativeFloatType'.
< netedit/additionalElements/access/load/length/input_additionals.add.xml:11:0:ERROR:SCHEMASV:SCHEMAV_CVC_MININCLUSIVE_VALID: Element 'access', attribute 'length': [facet 'minInclusive'] The value '-30' is less than the minimum value allowed ('0').
< netedit/additionalElements/access/load/length/input_additionals.add.xml:8:0:ERROR:SCHEMASV:SCHEMAV_CVC_DATATYPE_VALID_1_2_1: Element 'access', attribute 'length': 'dummyLenght' is not a valid value of the atomic type 'nonNegativeFloatType'.
< netedit/additionalElements/access/load/no_parent/input_additionals.add.xml:3:0:ERROR:SCHEMASV:SCHEMAV_ELEMENT_CONTENT: Element 'access': This element is not expected.
< netedit/additionalElements/access/load/pos/input_additionals.add.xml:5:0:ERROR:SCHEMASV:SCHEMAV_CVC_DATATYPE_VALID_1_2_1: Element 'access', attribute 'pos': 'dummyPosition' is not a valid value of the atomic type 'xs:float'.
< netedit/additionalElements/access/load/pos/input_additionals.add.xml:8:0:ERROR:SCHEMASV:SCHEMAV_CVC_DATATYPE_VALID_1_2_1: Element 'access', attribute 'pos': '' is not a valid value of the atomic type 'xs:float'.
< netedit/additionalElements/basic/relative_positions/input_additionals.add.xml:13:0:ERROR:SCHEMASV:SCHEMAV_CVC_COMPLEX_TYPE_3_2_1: Element 'instantInductionLoop', attribute 'freq': The attribute 'freq' is not allowed.
< netedit/additionalElements/basic/relative_positions/input_additionals.add.xml:14:0:ERROR:SCHEMASV:SCHEMAV_CVC_COMPLEX_TYPE_3_2_1: Element 'rerouter', attribute 'off': The attribute 'off' is not allowed.
< netedit/additionalElements/basic/relative_positions/input_additionals.add.xml:16:0:ERROR:SCHEMASV:SCHEMAV_CVC_COMPLEX_TYPE_3_2_1: Element 'vaporizer', attribute 'edge': The attribute 'edge' is not allowed.
< netedit/additionalElements/basic/relative_positions/input_additionals.add.xml:16:0:ERROR:SCHEMASV:SCHEMAV_CVC_COMPLEX_TYPE_4: Element 'vaporizer': The attribute 'id' is required but missing.
< netedit/additionalElements/busstop/load/endpos/input_additionals.add.xml:7:0:ERROR:SCHEMASV:SCHEMAV_CVC_DATATYPE_VALID_1_2_1: Element 'busStop', attribute 'endPos': 'dummyEndPos' is not a valid value of the atomic type 'xs:float'.
< netedit/additionalElements/busstop/load/genericparameters/input_additionals.add.xml:17:0:ERROR:SCHEMASV:SCHEMAV_CVC_COMPLEX_TYPE_4: Element 'param': The attribute 'value' is required but missing.
< netedit/additionalElements/busstop/load/genericparameters/input_additionals.add.xml:26:0:ERROR:SCHEMASV:SCHEMAV_CVC_COMPLEX_TYPE_4: Element 'param': The attribute 'key' is required but missing.
< netedit/additionalElements/busstop/load/genericparameters/input_additionals.add.xml:26:0:ERROR:SCHEMASV:SCHEMAV_CVC_COMPLEX_TYPE_4: Element 'param': The attribute 'value' is required but missing.
< netedit/additionalElements/busstop/load/genericparameters/input_additionals.add.xml:2:0:ERROR:SCHEMASV:SCHEMAV_CVC_COMPLEX_TYPE_3_2_1: Element 'busStop', attribute 'file': The attribute 'file' is not allowed.
< netedit/additionalElements/busstop/load/genericparameters/input_additionals.add.xml:8:0:ERROR:SCHEMASV:SCHEMAV_CVC_COMPLEX_TYPE_4: Element 'param': The attribute 'key' is required but missing.
< netedit/additionalElements/busstop/load/id/input_additionals.add.xml:10:0:ERROR:SCHEMASV:SCHEMAV_CVC_DATATYPE_VALID_1_2_1: Element 'busStop', attribute 'id': 'ID with spaces' is not a valid value of the atomic type 'idType'.
<truncated after showing first 30 lines>
---------- Differences in output ----------
1d0
< <number> files checked

TEST FAILED on ts-sim-winbuild-ba : xml schemaCheck tests cfgs ( Last six runs Aug2019 )

---------- Differences in errors ----------
1d0
< Error on parsing 'sumo/meta/umlaut/sumo.sumocfg'!
3,7c2,12
< XMLSyntaxError: Input is not proper UTF-8, indicate encoding !
< Bytes: 0xF6 0x74 0x2E 0x6E, line 3, column 26
< -- Unordered text as found by filter 'ERROR:SCHEMA' --
< sumo/meta/deprecated_option/sumo.sumocfg:11:0:ERROR:SCHEMASV:SCHEMAV_ELEMENT_CONTENT: Element 'abs-rand': This element is not expected.
< 
---
>   File "C:/Users/delphi/Code/sumoInternal/git/tests\..\tools/xml/schemaCheck.py", line 132, in <module>
>     sys.exit(main(srcRoot, toCheck, sys.stderr))
>   File "C:/Users/delphi/Code/sumoInternal/git/tests\..\tools/xml/schemaCheck.py", line 95, in main
>     subprocess.call(sax2count + " " + name, stdout=open(os.devnull), stderr=err)
>   File "C:\Python37\lib\subprocess.py", line 323, in call
>     with Popen(*popenargs, **kwargs) as p:
>   File "C:\Python37\lib\subprocess.py", line 775, in __init__
>     restore_signals, start_new_session)
>   File "C:\Python37\lib\subprocess.py", line 1178, in _execute_child
>     startupinfo)
> FileNotFoundError: [WinError 2] Das System kann die angegebene Datei nicht finden
---------- Differences in output ----------
1d0
< <number> files checked

3 TESTS FAILED on ts-sim-winbuild-ba :

---------- Differences in errors ----------
0a1,12
> Traceback (most recent call last):
>   File "C:/Users/delphi/Code/sumoInternal/git/tests\..\tools/xml/schemaCheck.py", line 132, in <module>
>     sys.exit(main(srcRoot, toCheck, sys.stderr))
>   File "C:/Users/delphi/Code/sumoInternal/git/tests\..\tools/xml/schemaCheck.py", line 95, in main
>     subprocess.call(sax2count + " " + name, stdout=open(os.devnull), stderr=err)
>   File "C:\Python37\lib\subprocess.py", line 323, in call
>     with Popen(*popenargs, **kwargs) as p:
>   File "C:\Python37\lib\subprocess.py", line 775, in __init__
>     restore_signals, start_new_session)
>   File "C:\Python37\lib\subprocess.py", line 1178, in _execute_child
>     startupinfo)
> FileNotFoundError: [WinError 2] Das System kann die angegebene Datei nicht finden
---------- Differences in output ----------
1d0
< <number> files checked
xml schemaCheck tests jtrrouter ( Last six runs Aug2019 )
xml schemaCheck tests ticket3917 ( Last six runs Aug2019 )
xml schemaCheck tools ( Last six runs Aug2019 )

TEST FAILED on ts-sim-winbuild-ba : xml schemaCheck tests netconvert ( Last six runs Aug2019 )

---------- Differences in errors ----------
1,59c1,12
< -- Unordered text as found by filter 'ERROR:SCHEMA' --
< netconvert/import/XML/errors/broken_edge/edge#fromnode__missing1/input_edges.edg.xml:3:0:ERROR:SCHEMASV:SCHEMAV_CVC_COMPLEX_TYPE_4: Element 'edge': The attribute 'from' is required but missing.
< netconvert/import/XML/errors/broken_edge/edge#fromnode__missing4/input_edges.edg.xml:7:0:ERROR:SCHEMASV:SCHEMAV_CVC_COMPLEX_TYPE_4: Element 'edge': The attribute 'from' is required but missing.
< netconvert/import/XML/errors/broken_edge/edge#id__empty1/input_edges.edg.xml:3:0:ERROR:SCHEMASV:SCHEMAV_CVC_DATATYPE_VALID_1_2_1: Element 'edge', attribute 'id': '' is not a valid value of the atomic type 'idType'.
< netconvert/import/XML/errors/broken_edge/edge#id__empty1/input_edges.edg.xml:3:0:ERROR:SCHEMASV:SCHEMAV_CVC_IDC: Element 'edge', attribute 'id': Warning: No precomputed value available, the value was either invalid or something strange happend.
< netconvert/import/XML/errors/broken_edge/edge#id__empty1/input_edges.edg.xml:3:0:ERROR:SCHEMASV:SCHEMAV_CVC_IDC: Element 'edge': Not all fields of key identity-constraint 'edgeKey' evaluate to a node.
< netconvert/import/XML/errors/broken_edge/edge#id__empty1/input_edges.edg.xml:3:0:ERROR:SCHEMASV:SCHEMAV_CVC_PATTERN_VALID: Element 'edge', attribute 'id': [facet 'pattern'] The value '' is not accepted by the pattern '[^ \t\n\r|\\;,']+'.
< netconvert/import/XML/errors/broken_edge/edge#id__empty4/input_edges.edg.xml:7:0:ERROR:SCHEMASV:SCHEMAV_CVC_DATATYPE_VALID_1_2_1: Element 'edge', attribute 'id': '' is not a valid value of the atomic type 'idType'.
< netconvert/import/XML/errors/broken_edge/edge#id__empty4/input_edges.edg.xml:7:0:ERROR:SCHEMASV:SCHEMAV_CVC_IDC: Element 'edge', attribute 'id': Warning: No precomputed value available, the value was either invalid or something strange happend.
< netconvert/import/XML/errors/broken_edge/edge#id__empty4/input_edges.edg.xml:7:0:ERROR:SCHEMASV:SCHEMAV_CVC_IDC: Element 'edge': Not all fields of key identity-constraint 'edgeKey' evaluate to a node.
< netconvert/import/XML/errors/broken_edge/edge#id__empty4/input_edges.edg.xml:7:0:ERROR:SCHEMASV:SCHEMAV_CVC_PATTERN_VALID: Element 'edge', attribute 'id': [facet 'pattern'] The value '' is not accepted by the pattern '[^ \t\n\r|\\;,']+'.
< netconvert/import/XML/errors/broken_edge/edge#id__invalid4/input_edges.edg.xml:7:0:ERROR:SCHEMASV:SCHEMAV_CVC_DATATYPE_VALID_1_2_1: Element 'edge', attribute 'id': '4 5' is not a valid value of the atomic type 'idType'.
< netconvert/import/XML/errors/broken_edge/edge#id__invalid4/input_edges.edg.xml:7:0:ERROR:SCHEMASV:SCHEMAV_CVC_IDC: Element 'edge', attribute 'id': Warning: No precomputed value available, the value was either invalid or something strange happend.
< netconvert/import/XML/errors/broken_edge/edge#id__invalid4/input_edges.edg.xml:7:0:ERROR:SCHEMASV:SCHEMAV_CVC_IDC: Element 'edge': Not all fields of key identity-constraint 'edgeKey' evaluate to a node.
< netconvert/import/XML/errors/broken_edge/edge#id__invalid4/input_edges.edg.xml:7:0:ERROR:SCHEMASV:SCHEMAV_CVC_PATTERN_VALID: Element 'edge', attribute 'id': [facet 'pattern'] The value '4 5' is not accepted by the pattern '[^ \t\n\r|\\;,']+'.
< netconvert/import/XML/errors/broken_edge/edge#id__missing1/input_edges.edg.xml:3:0:ERROR:SCHEMASV:SCHEMAV_CVC_COMPLEX_TYPE_4: Element 'edge': The attribute 'id' is required but missing.
< netconvert/import/XML/errors/broken_edge/edge#id__missing1/input_edges.edg.xml:3:0:ERROR:SCHEMASV:SCHEMAV_CVC_IDC: Element 'edge': Not all fields of key identity-constraint 'edgeKey' evaluate to a node.
< netconvert/import/XML/errors/broken_edge/edge#id__missing4/input_edges.edg.xml:7:0:ERROR:SCHEMASV:SCHEMAV_CVC_COMPLEX_TYPE_4: Element 'edge': The attribute 'id' is required but missing.
< netconvert/import/XML/errors/broken_edge/edge#id__missing4/input_edges.edg.xml:7:0:ERROR:SCHEMASV:SCHEMAV_CVC_IDC: Element 'edge': Not all fields of key identity-constraint 'edgeKey' evaluate to a node.
< netconvert/import/XML/errors/broken_edge/edge#length__empty1/input_edges.edg.xml:3:0:ERROR:SCHEMASV:SCHEMAV_CVC_DATATYPE_VALID_1_2_1: Element 'edge', attribute 'length': '' is not a valid value of the atomic type 'positiveFloatType'.
< netconvert/import/XML/errors/broken_edge/edge#length__empty4/input_edges.edg.xml:7:0:ERROR:SCHEMASV:SCHEMAV_CVC_DATATYPE_VALID_1_2_1: Element 'edge', attribute 'length': '' is not a valid value of the atomic type 'positiveFloatType'.
< netconvert/import/XML/errors/broken_edge/edge#length__false1/input_edges.edg.xml:3:0:ERROR:SCHEMASV:SCHEMAV_CVC_DATATYPE_VALID_1_2_1: Element 'edge', attribute 'length': 'a' is not a valid value of the atomic type 'positiveFloatType'.
< netconvert/import/XML/errors/broken_edge/edge#length__false4/input_edges.edg.xml:7:0:ERROR:SCHEMASV:SCHEMAV_CVC_DATATYPE_VALID_1_2_1: Element 'edge', attribute 'length': 'a' is not a valid value of the atomic type 'positiveFloatType'.
< netconvert/import/XML/errors/broken_edge/edge#nolanes__empty1/input_edges.edg.xml:3:0:ERROR:SCHEMASV:SCHEMAV_CVC_DATATYPE_VALID_1_2_1: Element 'edge', attribute 'numLanes': '' is not a valid value of the atomic type 'xs:positiveInteger'.
< netconvert/import/XML/errors/broken_edge/edge#nolanes__empty4/input_edges.edg.xml:7:0:ERROR:SCHEMASV:SCHEMAV_CVC_DATATYPE_VALID_1_2_1: Element 'edge', attribute 'numLanes': '' is not a valid value of the atomic type 'xs:positiveInteger'.
< netconvert/import/XML/errors/broken_edge/edge#nolanes__false1/input_edges.edg.xml:3:0:ERROR:SCHEMASV:SCHEMAV_CVC_DATATYPE_VALID_1_2_1: Element 'edge', attribute 'numLanes': 'a' is not a valid value of the atomic type 'xs:positiveInteger'.
< netconvert/import/XML/errors/broken_edge/edge#nolanes__false4/input_edges.edg.xml:7:0:ERROR:SCHEMASV:SCHEMAV_CVC_DATATYPE_VALID_1_2_1: Element 'edge', attribute 'numLanes': 'a' is not a valid value of the atomic type 'xs:positiveInteger'.
< netconvert/import/XML/errors/broken_edge/edge#priority__false1/input_edges.edg.xml:3:0:ERROR:SCHEMASV:SCHEMAV_CVC_DATATYPE_VALID_1_2_1: Element 'edge', attribute 'priority': 'a' is not a valid value of the atomic type 'xs:int'.
< netconvert/import/XML/errors/broken_edge/edge#priority__false4/input_edges.edg.xml:7:0:ERROR:SCHEMASV:SCHEMAV_CVC_DATATYPE_VALID_1_2_1: Element 'edge', attribute 'priority': 'a' is not a valid value of the atomic type 'xs:int'.
<truncated after showing first 30 lines>
---------- Differences in output ----------
1d0
< <number> files checked

TEST FAILED on ts-sim-winbuild-ba : xml schemaCheck tests nets ( Last six runs Aug2019 )

---------- Differences in errors ----------
1,8c1,12
< -- Unordered text as found by filter 'ERROR:SCHEMA' --
< netconvert/function/railway/bidi_endOffset_invalid/net.netconvert:55:0:ERROR:SCHEMASV:SCHEMAV_CVC_COMPLEX_TYPE_4: Element 'lane': The attribute 'shape' is required but missing.
< netconvert/import/SUMO/stopOffsets/incomplete_specification/input_net.net.xml:169:0:ERROR:SCHEMASV:SCHEMAV_CVC_COMPLEX_TYPE_4: Element 'stopOffset': The attribute 'value' is required but missing.
< netconvert/import/SUMO/stopOffsets/warnings/input_net.net.xml:139:0:ERROR:SCHEMASV:SCHEMAV_CVC_DATATYPE_VALID_1_2_1: Element 'stopOffset', attribute 'value': '-1' is not a valid value of the atomic type 'nonNegativeFloatType'.
< netconvert/import/SUMO/stopOffsets/warnings/input_net.net.xml:139:0:ERROR:SCHEMASV:SCHEMAV_CVC_MININCLUSIVE_VALID: Element 'stopOffset', attribute 'value': [facet 'minInclusive'] The value '-1' is less than the minimum value allowed ('0').
< netconvert/import/SUMO/stopOffsets/warnings/input_net.net.xml:154:0:ERROR:SCHEMASV:SCHEMAV_CVC_DATATYPE_VALID_1_2_1: Element 'stopOffset', attribute 'value': '-1' is not a valid value of the atomic type 'nonNegativeFloatType'.
< netconvert/import/SUMO/stopOffsets/warnings/input_net.net.xml:154:0:ERROR:SCHEMASV:SCHEMAV_CVC_MININCLUSIVE_VALID: Element 'stopOffset', attribute 'value': [facet 'minInclusive'] The value '-1' is less than the minimum value allowed ('0').
< 
---
> Traceback (most recent call last):
>   File "C:/Users/delphi/Code/sumoInternal/git/tests\..\tools/xml/schemaCheck.py", line 132, in <module>
>     sys.exit(main(srcRoot, toCheck, sys.stderr))
>   File "C:/Users/delphi/Code/sumoInternal/git/tests\..\tools/xml/schemaCheck.py", line 95, in main
>     subprocess.call(sax2count + " " + name, stdout=open(os.devnull), stderr=err)
>   File "C:\Python37\lib\subprocess.py", line 323, in call
>     with Popen(*popenargs, **kwargs) as p:
>   File "C:\Python37\lib\subprocess.py", line 775, in __init__
>     restore_signals, start_new_session)
>   File "C:\Python37\lib\subprocess.py", line 1178, in _execute_child
>     startupinfo)
> FileNotFoundError: [WinError 2] Das System kann die angegebene Datei nicht finden
---------- Differences in output ----------
1d0
< <number> files checked

TEST FAILED on ts-sim-winbuild-ba : xml schemaCheck tests routes ( Last six runs Aug2019 )

---------- Differences in errors ----------
1d0
< Error on parsing 'sumo/meta/xml_invalid_schema/input_routes.rou.xml'!
3,458c2,12
< IOError: Error reading file 'http://sumo.dlr.de/xsd/blub_file.xsd': failed to load external entity "http://sumo.dlr.de/xsd/blub_file.xsd"
< -- Unordered text as found by filter 'ERROR:SCHEMA' --
< duarouter/routes/style1_input/errors/vehicle_empty_arrivallane/input_routes.rou.xml:5:0:ERROR:SCHEMASV:SCHEMAV_CVC_DATATYPE_VALID_1_2_3: Element 'vehicle', attribute 'arrivalLane': '' is not a valid value of the union type 'arrivalLaneType'.
< duarouter/routes/style1_input/errors/vehicle_empty_arrivalpos/input_routes.rou.xml:5:0:ERROR:SCHEMASV:SCHEMAV_CVC_DATATYPE_VALID_1_2_3: Element 'vehicle', attribute 'arrivalPos': '' is not a valid value of the union type 'arrivalPosType'.
< duarouter/routes/style1_input/errors/vehicle_empty_arrivalspeed/input_routes.rou.xml:5:0:ERROR:SCHEMASV:SCHEMAV_CVC_DATATYPE_VALID_1_2_3: Element 'vehicle', attribute 'arrivalSpeed': '' is not a valid value of the union type 'arrivalSpeedType'.
< duarouter/routes/style1_input/errors/vehicle_empty_departlane/input_routes.rou.xml:5:0:ERROR:SCHEMASV:SCHEMAV_CVC_DATATYPE_VALID_1_2_3: Element 'vehicle', attribute 'departLane': '' is not a valid value of the union type 'departLaneType'.
< duarouter/routes/style1_input/errors/vehicle_empty_departpos/input_routes.rou.xml:5:0:ERROR:SCHEMASV:SCHEMAV_CVC_DATATYPE_VALID_1_2_3: Element 'vehicle', attribute 'departPos': '' is not a valid value of the union type 'departPosType'.
< duarouter/routes/style1_input/errors/vehicle_empty_departspeed/input_routes.rou.xml:5:0:ERROR:SCHEMASV:SCHEMAV_CVC_DATATYPE_VALID_1_2_3: Element 'vehicle', attribute 'departSpeed': '' is not a valid value of the union type 'departSpeedType'.
< duarouter/routes/style1_input/errors/vehicle_false_arrivallane/input_routes.rou.xml:5:0:ERROR:SCHEMASV:SCHEMAV_CVC_DATATYPE_VALID_1_2_3: Element 'vehicle', attribute 'arrivalLane': 'xxx' is not a valid value of the union type 'arrivalLaneType'.
< duarouter/routes/style1_input/errors/vehicle_false_arrivalpos/input_routes.rou.xml:5:0:ERROR:SCHEMASV:SCHEMAV_CVC_DATATYPE_VALID_1_2_3: Element 'vehicle', attribute 'arrivalPos': 'xxx' is not a valid value of the union type 'arrivalPosType'.
< duarouter/routes/style1_input/errors/vehicle_false_arrivalspeed/input_routes.rou.xml:5:0:ERROR:SCHEMASV:SCHEMAV_CVC_DATATYPE_VALID_1_2_3: Element 'vehicle', attribute 'arrivalSpeed': 'xxx' is not a valid value of the union type 'arrivalSpeedType'.
< duarouter/routes/style1_input/errors/vehicle_false_departlane/input_routes.rou.xml:5:0:ERROR:SCHEMASV:SCHEMAV_CVC_DATATYPE_VALID_1_2_3: Element 'vehicle', attribute 'departLane': 'xxx' is not a valid value of the union type 'departLaneType'.
< duarouter/routes/style1_input/errors/vehicle_false_departpos/input_routes.rou.xml:5:0:ERROR:SCHEMASV:SCHEMAV_CVC_DATATYPE_VALID_1_2_3: Element 'vehicle', attribute 'departPos': 'xxx' is not a valid value of the union type 'departPosType'.
< duarouter/routes/style1_input/errors/vehicle_false_departspeed/input_routes.rou.xml:5:0:ERROR:SCHEMASV:SCHEMAV_CVC_DATATYPE_VALID_1_2_3: Element 'vehicle', attribute 'departSpeed': 'xxx' is not a valid value of the union type 'departSpeedType'.
< duarouter/routes/style2_input/errors/vehicle_empty_arrivallane/input_routes.rou.xml:4:0:ERROR:SCHEMASV:SCHEMAV_CVC_DATATYPE_VALID_1_2_3: Element 'vehicle', attribute 'arrivalLane': '' is not a valid value of the union type 'arrivalLaneType'.
< duarouter/routes/style2_input/errors/vehicle_empty_arrivalpos/input_routes.rou.xml:4:0:ERROR:SCHEMASV:SCHEMAV_CVC_DATATYPE_VALID_1_2_3: Element 'vehicle', attribute 'arrivalPos': '' is not a valid value of the union type 'arrivalPosType'.
< duarouter/routes/style2_input/errors/vehicle_empty_arrivalspeed/input_routes.rou.xml:4:0:ERROR:SCHEMASV:SCHEMAV_CVC_DATATYPE_VALID_1_2_3: Element 'vehicle', attribute 'arrivalSpeed': '' is not a valid value of the union type 'arrivalSpeedType'.
< duarouter/routes/style2_input/errors/vehicle_empty_departlane/input_routes.rou.xml:4:0:ERROR:SCHEMASV:SCHEMAV_CVC_DATATYPE_VALID_1_2_3: Element 'vehicle', attribute 'departLane': '' is not a valid value of the union type 'departLaneType'.
< duarouter/routes/style2_input/errors/vehicle_empty_departpos/input_routes.rou.xml:4:0:ERROR:SCHEMASV:SCHEMAV_CVC_DATATYPE_VALID_1_2_3: Element 'vehicle', attribute 'departPos': '' is not a valid value of the union type 'departPosType'.
< duarouter/routes/style2_input/errors/vehicle_empty_departspeed/input_routes.rou.xml:4:0:ERROR:SCHEMASV:SCHEMAV_CVC_DATATYPE_VALID_1_2_3: Element 'vehicle', attribute 'departSpeed': '' is not a valid value of the union type 'departSpeedType'.
< duarouter/routes/style2_input/errors/vehicle_false_arrivallane/input_routes.rou.xml:4:0:ERROR:SCHEMASV:SCHEMAV_CVC_DATATYPE_VALID_1_2_3: Element 'vehicle', attribute 'arrivalLane': 'xxx' is not a valid value of the union type 'arrivalLaneType'.
< duarouter/routes/style2_input/errors/vehicle_false_arrivalpos/input_routes.rou.xml:4:0:ERROR:SCHEMASV:SCHEMAV_CVC_DATATYPE_VALID_1_2_3: Element 'vehicle', attribute 'arrivalPos': 'xxx' is not a valid value of the union type 'arrivalPosType'.
< duarouter/routes/style2_input/errors/vehicle_false_arrivalspeed/input_routes.rou.xml:4:0:ERROR:SCHEMASV:SCHEMAV_CVC_DATATYPE_VALID_1_2_3: Element 'vehicle', attribute 'arrivalSpeed': 'xxx' is not a valid value of the union type 'arrivalSpeedType'.
< duarouter/routes/style2_input/errors/vehicle_false_departlane/input_routes.rou.xml:4:0:ERROR:SCHEMASV:SCHEMAV_CVC_DATATYPE_VALID_1_2_3: Element 'vehicle', attribute 'departLane': 'xxx' is not a valid value of the union type 'departLaneType'.
< duarouter/routes/style2_input/errors/vehicle_false_departpos/input_routes.rou.xml:4:0:ERROR:SCHEMASV:SCHEMAV_CVC_DATATYPE_VALID_1_2_3: Element 'vehicle', attribute 'departPos': 'xxx' is not a valid value of the union type 'departPosType'.
< duarouter/routes/style2_input/errors/vehicle_false_departspeed/input_routes.rou.xml:4:0:ERROR:SCHEMASV:SCHEMAV_CVC_DATATYPE_VALID_1_2_3: Element 'vehicle', attribute 'departSpeed': 'xxx' is not a valid value of the union type 'departSpeedType'.
< netedit/demandElements/flow/load/arrivalLane/input_routes.rou.xml:56:0:ERROR:SCHEMASV:SCHEMAV_CVC_DATATYPE_VALID_1_2_3: Element 'flow', attribute 'arrivalLane': 'dummyDepart' is not a valid value of the union type 'arrivalLaneType'.
<truncated after showing first 30 lines>
---------- Differences in output ----------
1d0
< <number> files checked

TEST FAILED on ts-sim-winbuild-ba : xml schemaCheck tests sim_outputs ( Last six runs Aug2019 )

---------- Differences in errors ----------
1,52c1,12
< -- Unordered text as found by filter 'ERROR:SCHEMA' --
< sumo/cf_model/IDM/insert_with_speedLimit_speedFactor0.8/tripinfos.sumo:35:0:ERROR:SCHEMASV:SCHEMAV_CVC_DATATYPE_VALID_1_2_1: Element 'tripinfo', attribute 'timeLoss': '-0.06' is not a valid value of the atomic type 'nonNegativeFloatType'.
< sumo/cf_model/IDM/insert_with_speedLimit_speedFactor0.8/tripinfos.sumo:35:0:ERROR:SCHEMASV:SCHEMAV_CVC_MININCLUSIVE_VALID: Element 'tripinfo', attribute 'timeLoss': [facet 'minInclusive'] The value '-0.06' is less than the minimum value allowed ('0').
< sumo/extended/state/load_shifted/tripinfos.sumo.meso:47:0:ERROR:SCHEMASV:SCHEMAV_CVC_DATATYPE_VALID_1_2_1: Element 'tripinfo', attribute 'depart': '-10.00' is not a valid value of the atomic type 'nonNegativeFloatType'.
< sumo/extended/state/load_shifted/tripinfos.sumo.meso:47:0:ERROR:SCHEMASV:SCHEMAV_CVC_MININCLUSIVE_VALID: Element 'tripinfo', attribute 'depart': [facet 'minInclusive'] The value '-10.00' is less than the minimum value allowed ('0').
< sumo/extended/state/load_shifted/tripinfos.sumo:38:0:ERROR:SCHEMASV:SCHEMAV_CVC_DATATYPE_VALID_1_2_1: Element 'tripinfo', attribute 'depart': '-10.00' is not a valid value of the atomic type 'nonNegativeFloatType'.
< sumo/extended/state/load_shifted/tripinfos.sumo:38:0:ERROR:SCHEMASV:SCHEMAV_CVC_MININCLUSIVE_VALID: Element 'tripinfo', attribute 'depart': [facet 'minInclusive'] The value '-10.00' is less than the minimum value allowed ('0').
< sumo/sublane_model/buridan_1lane/tripinfos.sumo:33:0:ERROR:SCHEMASV:SCHEMAV_CVC_COMPLEX_TYPE_3_2_1: Element 'tripinfo', attribute 'waitSteps': The attribute 'waitSteps' is not allowed.
< sumo/sublane_model/buridan_1lane/tripinfos.sumo:33:0:ERROR:SCHEMASV:SCHEMAV_CVC_COMPLEX_TYPE_4: Element 'tripinfo': The attribute 'stopTime' is required but missing.
< sumo/sublane_model/buridan_1lane/tripinfos.sumo:33:0:ERROR:SCHEMASV:SCHEMAV_CVC_COMPLEX_TYPE_4: Element 'tripinfo': The attribute 'waitingCount' is required but missing.
< sumo/sublane_model/buridan_1lane/tripinfos.sumo:33:0:ERROR:SCHEMASV:SCHEMAV_CVC_COMPLEX_TYPE_4: Element 'tripinfo': The attribute 'waitingTime' is required but missing.
< sumo/sublane_model/buridan_1lane/tripinfos.sumo:34:0:ERROR:SCHEMASV:SCHEMAV_CVC_COMPLEX_TYPE_3_2_1: Element 'tripinfo', attribute 'waitSteps': The attribute 'waitSteps' is not allowed.
< sumo/sublane_model/buridan_1lane/tripinfos.sumo:34:0:ERROR:SCHEMASV:SCHEMAV_CVC_COMPLEX_TYPE_4: Element 'tripinfo': The attribute 'stopTime' is required but missing.
< sumo/sublane_model/buridan_1lane/tripinfos.sumo:34:0:ERROR:SCHEMASV:SCHEMAV_CVC_COMPLEX_TYPE_4: Element 'tripinfo': The attribute 'waitingCount' is required but missing.
< sumo/sublane_model/buridan_1lane/tripinfos.sumo:34:0:ERROR:SCHEMASV:SCHEMAV_CVC_COMPLEX_TYPE_4: Element 'tripinfo': The attribute 'waitingTime' is required but missing.
< sumo/sublane_model/buridan_1lane/tripinfos.sumo:35:0:ERROR:SCHEMASV:SCHEMAV_CVC_COMPLEX_TYPE_3_2_1: Element 'tripinfo', attribute 'waitSteps': The attribute 'waitSteps' is not allowed.
< sumo/sublane_model/buridan_1lane/tripinfos.sumo:35:0:ERROR:SCHEMASV:SCHEMAV_CVC_COMPLEX_TYPE_4: Element 'tripinfo': The attribute 'stopTime' is required but missing.
< sumo/sublane_model/buridan_1lane/tripinfos.sumo:35:0:ERROR:SCHEMASV:SCHEMAV_CVC_COMPLEX_TYPE_4: Element 'tripinfo': The attribute 'waitingCount' is required but missing.
< sumo/sublane_model/buridan_1lane/tripinfos.sumo:35:0:ERROR:SCHEMASV:SCHEMAV_CVC_COMPLEX_TYPE_4: Element 'tripinfo': The attribute 'waitingTime' is required but missing.
< sumo/sublane_model/buridan_1lane/tripinfos.sumo:36:0:ERROR:SCHEMASV:SCHEMAV_CVC_COMPLEX_TYPE_3_2_1: Element 'tripinfo', attribute 'waitSteps': The attribute 'waitSteps' is not allowed.
< sumo/sublane_model/buridan_1lane/tripinfos.sumo:36:0:ERROR:SCHEMASV:SCHEMAV_CVC_COMPLEX_TYPE_4: Element 'tripinfo': The attribute 'stopTime' is required but missing.
< sumo/sublane_model/buridan_1lane/tripinfos.sumo:36:0:ERROR:SCHEMASV:SCHEMAV_CVC_COMPLEX_TYPE_4: Element 'tripinfo': The attribute 'waitingCount' is required but missing.
< sumo/sublane_model/buridan_1lane/tripinfos.sumo:36:0:ERROR:SCHEMASV:SCHEMAV_CVC_COMPLEX_TYPE_4: Element 'tripinfo': The attribute 'waitingTime' is required but missing.
< sumo/sublane_model/buridan_1lane/tripinfos.sumo:37:0:ERROR:SCHEMASV:SCHEMAV_CVC_COMPLEX_TYPE_3_2_1: Element 'tripinfo', attribute 'waitSteps': The attribute 'waitSteps' is not allowed.
< sumo/sublane_model/buridan_1lane/tripinfos.sumo:37:0:ERROR:SCHEMASV:SCHEMAV_CVC_COMPLEX_TYPE_4: Element 'tripinfo': The attribute 'stopTime' is required but missing.
< sumo/sublane_model/buridan_1lane/tripinfos.sumo:37:0:ERROR:SCHEMASV:SCHEMAV_CVC_COMPLEX_TYPE_4: Element 'tripinfo': The attribute 'waitingCount' is required but missing.
< sumo/sublane_model/buridan_1lane/tripinfos.sumo:37:0:ERROR:SCHEMASV:SCHEMAV_CVC_COMPLEX_TYPE_4: Element 'tripinfo': The attribute 'waitingTime' is required but missing.
< sumo/sublane_model/buridan_1lane/tripinfos.sumo:38:0:ERROR:SCHEMASV:SCHEMAV_CVC_COMPLEX_TYPE_3_2_1: Element 'tripinfo', attribute 'waitSteps': The attribute 'waitSteps' is not allowed.
< sumo/sublane_model/buridan_1lane/tripinfos.sumo:38:0:ERROR:SCHEMASV:SCHEMAV_CVC_COMPLEX_TYPE_4: Element 'tripinfo': The attribute 'stopTime' is required but missing.
<truncated after showing first 30 lines>
---------- Differences in output ----------
1d0
< <number> files checked

TEST FAILED on ts-sim-winbuild-ba : xml xml2csv amitran_trajectories_schema ( Last six runs Aug2019 )

---------- Differences in errors ----------
0a1
> lxml not available, skipping validation

Detailed information for the tests that had known bugs:

TEST had known bugs (see #5409) on ts-sim-winbuild-ba : detector flowrouter motorway_ramps lane_based ( Last six runs Aug2019 )

option lane-based does not work
(This bug was triggered by text found in file 'routes' matching 'on3 3 off3')
---------- Differences in errors ----------
0a1,2
> C:\Users\delphi\Code\sumoInternal\git\tools\sumolib\__init__.py:28: UserWarning: No module named 'matplotlib'
>   warnings.warn(str(e))
---------- Differences in flows ----------
2c2,3
<     <flow id="1_off3.qPKW" departSpeed="max" departPos="last" departLane="best" route="1_off3.qPKW" number="450" begin="0" end="3600"/>
---
>     <flow id="1_0_9_0.qPKW" departSpeed="max" departPos="last" departLane="best" route="1_0_9_0.qPKW" number="450" begin="0" end="3600"/>
>     <flow id="on3_0_off3_0.qPKW" departSpeed="max" departPos="last" departLane="best" route="on3_0_off3_0.qPKW" number="450" begin="0" end="3600"/>
---------- Differences in routes ----------
2c2,3
<     <route id="1_off3.qPKW" edges="1 2 3 off3"/>
---
>     <route id="1_0_9_0.qPKW" edges="1 2 3 4 5 6 7 8 9"/>
>     <route id="on3_0_off3_0.qPKW" edges="on3 3 off3"/>

TEST had known bugs (see #2620) on ts-sim-winbuild-ba : projects evacuation plain ( Last six runs Aug2019 )

unstable inputs
(This bug was triggered by text found in the full difference report matching 'Warning')
---------- Differences in errors ----------
1,6925c1
< Warning: Discarding unusable type 'waterway.canal' (first occurence for edge '4041237#0').
< Warning: Discarding unknown compound 'cycleway.track' in type 'cycleway.track|highway.primary' (first occurence for edge '4045243#0').
< Warning: Discarding unknown compound 'cycleway.lane' in type 'cycleway.lane|highway.residential' (first occurence for edge '4068019#0').
< Warning: Discarding unknown compound 'cycleway.lane' in type 'cycleway.lane|highway.primary' (first occurence for edge '4068043#0').
< Warning: Discarding unknown compound 'cycleway.track' in type 'cycleway.track|highway.secondary' (first occurence for edge '4068192').
< Warning: Discarding unknown compound 'cycleway.track' in type 'cycleway.track|highway.tertiary' (first occurence for edge '4377008#0').
< Warning: Discarding unknown compound 'cycleway.lane' in type 'cycleway.lane|highway.tertiary' (first occurence for edge '4377122#0').
< Warning: Discarding unknown compound 'cycleway.share_busway' in type 'cycleway.share_busway|highway.secondary' (first occurence for edge '4377785#0').
< Warning: Discarding unknown compound 'cycleway.lane' in type 'cycleway.lane|highway.secondary' (first occurence for edge '4383334').
< Warning: Discarding unusable type 'highway.construction' (first occurence for edge '4391568').
< Warning: Discarding unknown compound 'cycleway.track' in type 'cycleway.track|highway.residential' (first occurence for edge '4395586#0').
< Warning: Discarding unknown compound 'cycleway.share_busway' in type 'cycleway.share_busway|highway.primary' (first occurence for edge '4395950#0').
< Warning: Discarding unknown compound 'cycleway.opposite' in type 'cycleway.opposite|highway.residential' (first occurence for edge '4396234').
< Warning: Discarding unknown compound 'cycleway.track' in type 'cycleway.track|highway.living_street' (first occurence for edge '4410583').
< Warning: Discarding unknown compound 'cycleway.lane' in type 'cycleway.lane|highway.secondary_link' (first occurence for edge '4484071').
< Warning: Discarding unknown compound 'cycleway.track' in type 'cycleway.track|highway.cycleway' (first occurence for edge '4492364#0').
< Warning: Discarding unusable type 'railway.disused' (first occurence for edge '4525886').
< Warning: Discarding unusable type 'highway.proposed' (first occurence for edge '4611776#0').
< Warning: Discarding unknown compound 'cycleway.none' in type 'cycleway.none|highway.tertiary' (first occurence for edge '4612758#0').
< Warning: Discarding unknown compound 'cycleway.track' in type 'cycleway.track|cycleway.track|highway.primary' (first occurence for edge '4615457#0').
< Warning: Discarding unknown compound 'cycleway.track' in type 'cycleway.track|cycleway.track|highway.primary' (first occurence for edge '4615457#0').
< Warning: Discarding unknown compound 'cycleway.shared' in type 'cycleway.shared|highway.secondary' (first occurence for edge '4615594#0').
< Warning: Discarding unknown compound 'cycleway.opposite' in type 'cycleway.opposite|highway.living_street' (first occurence for edge '4639037#0').
< Warning: Discarding unknown compound 'cycleway.opposite_track' in type 'cycleway.opposite_track|cycleway.track|cycleway.track|highway.residential' (first occurence for edge '4686018#0').
< Warning: Discarding unknown compound 'cycleway.track' in type 'cycleway.opposite_track|cycleway.track|cycleway.track|highway.residential' (first occurence for edge '4686018#0').
< Warning: Discarding unknown compound 'cycleway.track' in type 'cycleway.opposite_track|cycleway.track|cycleway.track|highway.residential' (first occurence for edge '4686018#0').
< Warning: Discarding unusable type 'waterway.riverbank' (first occurence for edge '4686373#0').
< Warning: Discarding unknown compound 'cycleway.shared_lane' in type 'cycleway.shared_lane|highway.primary' (first occurence for edge '4790833#0').
< Warning: Discarding unusable type 'railway.abandoned' (first occurence for edge '4790904').
<truncated after showing first 30 lines>
---------- Differences in output ----------
1,97d0
< Parsing types from <DIR>/osmNetconvert.typ.xml'... done.
< Parsing nodes from osm-file 'osm_bbox.osm.xml'... 
< Found duplicate nodes. Substituting 3215103784 with 288002013
< Found duplicate nodes. Substituting 3987794203 with 3987794202
< Found duplicate nodes. Substituting 3997661445 with 3517810193
< Found duplicate nodes. Substituting 4016273048 with 26992494
< Found duplicate nodes. Substituting 4016273049 with 2306772973
< done.
< Parsing edges from osm-file 'osm_bbox.osm.xml'... done.
< Removing duplicate edges... 
< Found duplicate edges. Removing 310058575
< Found duplicate edges. Removing 310058576
< Found duplicate edges. Removing 310058577
< Found duplicate edges. Removing 335703516
< Found duplicate edges. Removing 335703519
< Found duplicate edges. Removing 335703532
< Found duplicate edges. Removing 377118659
< Found duplicate edges. Removing 377494320
< Found duplicate edges. Removing 391385403
< done.
< Adding new type 'highway.service|railway.tram' (first occurence for edge '167272531#0').
< Parsing relations from osm-file 'osm_bbox.osm.xml'... 
< done.
<  Removed 1494 traffic lights before loading plain-XML
<  Import done:
<    37203 nodes loaded.
<    34 types loaded.
<    36921 edges loaded.
< Proj projection parameters used: '+proj=utm +zone=33 +ellps=WGS84 +datum=WGS84 +units=m +no_defs'.
<truncated after showing first 30 lines>
---------- New result in catalogue ----------
No files or directories were created, edited or deleted.

TEST had known bugs (bug 1190 (NONEXISTENT)) on ts-sim-winbuild-ba : xml csv2xml cross3ltl_full_schema ( Last six runs Aug2019 )

Failed to open URL 'https://sumo.dlr.de/trac.wsgi/ticket/1190?format=tab': <urlopen error [SSL: CERTIFICATE_VERIFY_FAILED] certificate verify failed (_ssl.c:590)>.

Please make sure that bug 1190 exists
and that the configuration entry 'bug_system_location' points to the correct trac instance.
The current value is 'https://sumo.dlr.de/trac.wsgi/'.
(This bug was triggered by FAILING to find text in file 'xml' matching 'vehicles')
---------- Differences in xml ----------
1,32d0
< <?xml version="1.0" encoding="UTF-8"?>
< 
< <!-- generated on Tue Dec  3 16:33:35 2013 by SUMO sumo Version dev-SVN-r15233
< This data file and the accompanying materials
< are made available under the terms of the Eclipse Public License v2.0
< which accompanies this distribution, and is available at
< http://www.eclipse.org/legal/epl-v20.html
< SPDX-License-Identifier: EPL-2.0
< <configuration xmlns:xsi="http://www.w3.org/2001/XMLSchema-instance" xsi:noNamespaceSchemaLocation="http://sumo.dlr.de/xsd/sumoConfiguration.xsd">
< 
<     <input>
<         <net-file value="net.net.xml"/>
<         <route-files value="input_routes.rou.xml"/>
<     </input>
< 
<     <output>
<         <full-output value="full.xml"/>
<     </output>
< 
<     <time>
<         <begin value="0"/>
<         <end value="120"/>
<     </time>
< 
<     <report>
<         <no-duration-log value="true"/>
<         <no-step-log value="true"/>
<     </report>
< 
<truncated after showing first 30 lines>