22Oct19rv1_3_1+0659-dc494f3eeb - detailed test results for COMPLEX

To reconnect the TextTest GUI to these results, run:

texttestc.py -a complex -d C:/Users/delphi/Code/sumo/git/tests -reconnect C:/Users/delphi/Code/sumo/msvc12x64Dtexttesttmp/msvc12x64D.31Oct032441.22296 -g

To start TextTest for these tests, run:

texttestc.py -a complex -d C:/Users/delphi/Code/sumo/git/tests


default: 298 tests: 272 succeeded 15 known bugs 8 FAILED 3 killed

Detailed information for the tests that FAILED:

TEST FAILED on ts-sim-winbuild-ba : netconvert osm_roundtrip ( Last six runs Oct2019 )

---------- Differences in net ----------
22c22
<     <type id="highway.secondary" priority="11" numLanes="2" speed="27.78" disallow="tram rail_urban rail rail_electric rail_fast ship" oneway="0"/>
---
>     <type id="highway.secondary" priority="11" numLanes="1" speed="27.78" disallow="tram rail_urban rail rail_electric rail_fast ship" oneway="0"/>

TEST FAILED on ts-sim-winbuild-ba : sumo ToCDevice ToC_with_sampled_responseTime ( Last six runs Oct2019 )

---------- Differences in fcd ----------
648c648
<         <vehicle id="ToC_veh" x="54.37" y="1327.89" angle="162.00" type="automated@ToC_veh" speed="19.60" pos="191.19" lane="6/1to7/1_0" slope="0.00"/>
---
>         <vehicle id="ToC_veh" x="54.13" y="1328.63" angle="162.00" type="manual" speed="18.82" pos="190.41" lane="6/1to7/1_0" slope="0.00"/>
651c651
<         <vehicle id="ToC_veh" x="60.32" y="1309.59" angle="162.00" type="manual" speed="19.24" pos="210.43" lane="6/1to7/1_0" slope="0.00"/>
---
>         <vehicle id="ToC_veh" x="60.07" y="1310.33" angle="162.00" type="manual" speed="19.24" pos="209.65" lane="6/1to7/1_0" slope="0.00"/>
654c654
<         <vehicle id="ToC_veh" x="66.14" y="1291.68" angle="162.00" type="manual" speed="18.84" pos="229.26" lane="6/1to7/1_0" slope="0.00"/>
---
>         <vehicle id="ToC_veh" x="65.89" y="1292.42" angle="162.00" type="manual" speed="18.84" pos="228.48" lane="6/1to7/1_0" slope="0.00"/>
657c657
<         <vehicle id="ToC_veh" x="72.16" y="1273.12" angle="162.00" type="manual" speed="19.51" pos="248.77" lane="6/1to7/1_0" slope="0.00"/>
---
>         <vehicle id="ToC_veh" x="71.92" y="1273.87" angle="162.00" type="manual" speed="19.51" pos="247.99" lane="6/1to7/1_0" slope="0.00"/>
660c660
<         <vehicle id="ToC_veh" x="78.09" y="1254.88" angle="162.00" type="manual" speed="19.19" pos="267.96" lane="6/1to7/1_0" slope="0.00"/>
---
>         <vehicle id="ToC_veh" x="77.85" y="1255.62" angle="162.00" type="manual" speed="19.19" pos="267.17" lane="6/1to7/1_0" slope="0.00"/>
663c663
<         <vehicle id="ToC_veh" x="84.05" y="1236.55" angle="162.00" type="manual" speed="19.27" pos="287.23" lane="6/1to7/1_0" slope="0.00"/>
---
>         <vehicle id="ToC_veh" x="83.81" y="1237.29" angle="162.00" type="manual" speed="19.27" pos="286.45" lane="6/1to7/1_0" slope="0.00"/>
666c666
<         <vehicle id="ToC_veh" x="90.02" y="1218.16" angle="162.00" type="manual" speed="19.33" pos="306.56" lane="6/1to7/1_0" slope="0.00"/>
---
>         <vehicle id="ToC_veh" x="89.78" y="1218.90" angle="162.00" type="manual" speed="19.33" pos="305.78" lane="6/1to7/1_0" slope="0.00"/>
669c669
<         <vehicle id="ToC_veh" x="95.76" y="1200.50" angle="162.00" type="manual" speed="18.56" pos="325.13" lane="6/1to7/1_0" slope="0.00"/>
<truncated after showing first 30 lines>
---------- Differences in output ----------
1088,1090c1088,1090
<   currentAwareness = 1.00
<   currentSpeed = 19.6
<   state = PREPARING_TOC
---
>   currentAwareness = 0.25
>   currentSpeed = 18.8176383486
>   state = RECOVERING
1093c1093
<   currentAwareness = 0.25
---
>   currentAwareness = 0.35
1098c1098
<   currentAwareness = 0.35
---
>   currentAwareness = 0.45
1103c1103
<   currentAwareness = 0.45
---
>   currentAwareness = 0.55
1108c1108
<   currentAwareness = 0.55
---
>   currentAwareness = 0.65
1113c1113
<   currentAwareness = 0.65
---
>   currentAwareness = 0.75
1118c1118
<   currentAwareness = 0.75
<truncated after showing first 30 lines>
---------- Differences in tocs ----------
6c6
<     <ToCdown id="ToC_veh" t="215.00" lane="6/1to7/1_0" lanePos="0.19"/>
---
>     <ToCdown id="ToC_veh" t="214.00" lane="6/1to7/1_0" lanePos="0.17"/>

TEST FAILED on ts-sim-winbuild-ba : sumo ToCDevice dynamic_ToC ( Last six runs Oct2019 )

---------- Differences in output ----------
348,351c348,352
<   currentAwareness = 1.00
<   currentSpeed = 13.89
<   state = PREPARING_TOC
< Time 54.0: Current lane of veh 'ToC_veh': WE_1
---
>   currentAwareness = 0.25
>   currentSpeed = 13.60330855
>   state = RECOVERING
> Switched to manual mode: Allowing LCs!
> Time 54.0: Current lane of veh 'ToC_veh': WE_0
354c355
<   currentAwareness = 0.25
---
>   currentAwareness = 0.35
361,362c362,363
<   currentAwareness = 0.35
<   currentSpeed = 13.5805231258
---
>   currentAwareness = 0.45
>   currentSpeed = 13.3196243835
368,369c369,370
<   currentAwareness = 0.45
<   currentSpeed = 13.3196243835
---
>   currentAwareness = 0.55
>   currentSpeed = 13.244425754
375,376c376,377
<   currentAwareness = 0.55
<   currentSpeed = 13.244425754
<truncated after showing first 30 lines>
---------- Differences in tocs ----------
7c7
<     <ToCdown id="ToC_veh" t="53.00" lane="WE_1" lanePos="0.69"/>
---
>     <ToCdown id="ToC_veh" t="52.00" lane="WE_1" lanePos="0.68"/>

TEST FAILED on ts-sim-winbuild-ba : sumo ToCDevice dynamic_ToC_stop ( Last six runs Oct2019 )

---------- Differences in output ----------
556,561d555
<   currentAwareness = 1.00
<   currentSpeed = 0.0
<   state = PREPARING_TOC
< Time 90.0: Current lane of veh 'ToC_veh': WE_1
< time 90.0
< ToC device infos for vehicle 'ToC_veh'
566,567c560,561
< Time 91.0: Current lane of veh 'ToC_veh': WE_0
< time 91.0
---
> Time 90.0: Current lane of veh 'ToC_veh': WE_0
> time 90.0
573,574c567,568
< Time 92.0: Current lane of veh 'ToC_veh': :gneJ1_0_0
< time 92.0
---
> Time 91.0: Current lane of veh 'ToC_veh': :gneJ1_0_0
> time 91.0
580,581c574,575
< Time 93.0: Current lane of veh 'ToC_veh': :gneJ1_0_0
< time 93.0
---
> Time 92.0: Current lane of veh 'ToC_veh': :gneJ1_0_0
> time 92.0
587,588c581,582
< Time 94.0: Current lane of veh 'ToC_veh': NS_0
< time 94.0
---
> Time 93.0: Current lane of veh 'ToC_veh': NS_0
<truncated after showing first 30 lines>
---------- Differences in tocs ----------
7c7
<     <ToCdown id="ToC_veh" t="89.00" lane="WE_1" lanePos="0.99"/>
---
>     <ToCdown id="ToC_veh" t="88.00" lane="WE_1" lanePos="0.99"/>

TEST FAILED on ts-sim-winbuild-ba : traas api ( Last six runs Oct2019 )

---------- Differences in errors ----------
2a3
> Received null repsonse for command 203 149. (Maybe you need to use do_job_set?)

TEST FAILED on ts-sim-winbuild-ba : traas webservice ( Last six runs Oct2019 )

---------- Differences in errors ----------
0a1,49
> Okt 22, 2019 4:12:54 AM com.sun.xml.ws.server.sei.TieHandler createResponse
> SCHWERWIEGEND: null
> java.lang.NullPointerException
> 	at de.tudresden.sumo.util.Sumo.start_ws(Sumo.java:140)
> 	at de.tudresden.ws.ServiceImpl.start(ServiceImpl.java:66)
> 	at sun.reflect.NativeMethodAccessorImpl.invoke0(Native Method)
> 	at sun.reflect.NativeMethodAccessorImpl.invoke(Unknown Source)
> 	at sun.reflect.DelegatingMethodAccessorImpl.invoke(Unknown Source)
> 	at java.lang.reflect.Method.invoke(Unknown Source)
> 	at com.sun.xml.ws.util.Trampoline.invoke(MethodUtil.java:82)
> 	at sun.reflect.NativeMethodAccessorImpl.invoke0(Native Method)
> 	at sun.reflect.NativeMethodAccessorImpl.invoke(Unknown Source)
> 	at sun.reflect.DelegatingMethodAccessorImpl.invoke(Unknown Source)
> 	at java.lang.reflect.Method.invoke(Unknown Source)
> 	at com.sun.xml.ws.util.MethodUtil.invoke(MethodUtil.java:107)
> 	at com.sun.xml.ws.api.server.MethodUtil.invoke(MethodUtil.java:64)
> 	at com.sun.xml.ws.api.server.InstanceResolver$1.invoke(InstanceResolver.java:250)
> 	at com.sun.xml.ws.server.InvokerTube$2.invoke(InvokerTube.java:149)
> 	at com.sun.xml.ws.server.sei.SEIInvokerTube.processRequest(SEIInvokerTube.java:88)
> 	at com.sun.xml.ws.api.pipe.Fiber.__doRun(Fiber.java:1136)
> 	at com.sun.xml.ws.api.pipe.Fiber._doRun(Fiber.java:1050)
> 	at com.sun.xml.ws.api.pipe.Fiber.doRun(Fiber.java:1019)
> 	at com.sun.xml.ws.api.pipe.Fiber.runSync(Fiber.java:877)
> 	at com.sun.xml.ws.server.WSEndpointImpl$2.process(WSEndpointImpl.java:419)
> 	at com.sun.xml.ws.transport.http.HttpAdapter$HttpToolkit.handle(HttpAdapter.java:868)
> 	at com.sun.xml.ws.transport.http.HttpAdapter.handle(HttpAdapter.java:422)
> 	at com.sun.xml.ws.transport.http.server.WSHttpHandler.handleExchange(WSHttpHandler.java:113)
> 	at com.sun.xml.ws.transport.http.server.WSHttpHandler.handle(WSHttpHandler.java:97)
> 	at com.sun.net.httpserver.Filter$Chain.doFilter(Unknown Source)
<truncated after showing first 30 lines>

TEST FAILED on ts-sim-winbuild-ba : traci pythonApi gui ( Last six runs Oct2019 )

---------- Differences in png ----------
Binary files C:/Users/delphi/Code/sumo/msvc12x64Dtexttesttmp/msvc12x64D.22Oct035941.4660/complex/traci/pythonApi/gui/framework_tmp/png.complexorigcmp and C:/Users/delphi/Code/sumo/msvc12x64Dtexttesttmp/msvc12x64D.22Oct035941.4660/complex/traci/pythonApi/gui/framework_tmp/png.complexcmp differ

TEST FAILED on ts-sim-winbuild-ba : tutorial city_mobil ( Last six runs Oct2019 )

---------- Differences in output ----------
4c4
< waiting time (max, mean, dev): True True True
---
> waiting time (max, mean, dev): False True False
17c17
< ('footmainout', 'footmain4to5') True True True
---
> ('footmainout', 'footmain4to5') True True False
19,20c19,20
< ('footmainout', 'footmain6to7') True True True
< ('footmainout', 'footmain7to8') True True True
---
> ('footmainout', 'footmain6to7') True True False
> ('footmainout', 'footmain7to8') True True False
22c22
< waiting time (max, mean, dev): True True True
---
> waiting time (max, mean, dev): False True False
35c35
< ('footmainout', 'footmain4to5') True True True
---
> ('footmainout', 'footmain4to5') True True False
37,38c37,38
< ('footmainout', 'footmain6to7') True True True
< ('footmainout', 'footmain7to8') True True True
---
> ('footmainout', 'footmain6to7') True True False
> ('footmainout', 'footmain7to8') True True False

Detailed information for the tests that had known bugs:

TEST had known bugs (bug 1691 (NONEXISTENT)) on ts-sim-winbuild-ba : netconvert dlr-navteq_roundtrip ( Last six runs Oct2019 )

Failed to open URL 'https://sumo.dlr.de/trac.wsgi/ticket/1691?format=tab': <urlopen error [SSL: CERTIFICATE_VERIFY_FAILED] certificate verify failed (_ssl.c:590)>.

Please make sure that bug 1691 exists
and that the configuration entry 'bug_system_location' points to the correct trac instance.
The current value is 'https://sumo.dlr.de/trac.wsgi/'.
(This bug was triggered by text found in file 'net' matching '.*')
---------- Differences in net ----------
4c4
< <net version="1.1" junctionCornerDetail="5" limitTurnSpeed="5.50" xmlns:xsi="http://www.w3.org/2001/XMLSchema-instance" xsi:noNamespaceSchemaLocation="http://sumo.dlr.de/xsd/net_file.xsd">
---
> <net version="1.3" junctionCornerDetail="5" limitTurnSpeed="5.50" xmlns:xsi="http://www.w3.org/2001/XMLSchema-instance" xsi:noNamespaceSchemaLocation="http://sumo.dlr.de/xsd/net_file.xsd">
2768c2768
<     <connection from="-26816553" to="26816541" fromLane="0" toLane="0" via=":294168098_5_0" dir="L" state="="/>
---
>     <connection from="-26816553" to="26816541" fromLane="0" toLane="0" via=":294168098_5_0" dir="l" state="="/>
2975c2975
<     <connection from="27445116" to="27445117" fromLane="0" toLane="0" via=":294169338_0_0" dir="s" state="="/>
---
>     <connection from="27445116" to="27445117" fromLane="0" toLane="0" via=":294169338_0_0" dir="R" state="="/>
3216c3216
<     <connection from=":294168098_5" to="26816541" fromLane="0" toLane="0" dir="L" state="M"/>
---
>     <connection from=":294168098_5" to="26816541" fromLane="0" toLane="0" dir="l" state="M"/>
3241c3241
<     <connection from=":294169338_0" to="27445117" fromLane="0" toLane="0" dir="s" state="M"/>
---
>     <connection from=":294169338_0" to="27445117" fromLane="0" toLane="0" dir="R" state="M"/>

TEST had known bugs (bug 1691 (NONEXISTENT)) on ts-sim-winbuild-ba : netconvert matsim_roundtrip ( Last six runs Oct2019 )

Failed to open URL 'https://sumo.dlr.de/trac.wsgi/ticket/1691?format=tab': <urlopen error [SSL: CERTIFICATE_VERIFY_FAILED] certificate verify failed (_ssl.c:590)>.

Please make sure that bug 1691 exists
and that the configuration entry 'bug_system_location' points to the correct trac instance.
The current value is 'https://sumo.dlr.de/trac.wsgi/'.
(This bug was triggered by text found in file 'net' matching '.*')
---------- Differences in net ----------
4c4
< <net version="1.1" junctionCornerDetail="5" limitTurnSpeed="5.50" xmlns:xsi="http://www.w3.org/2001/XMLSchema-instance" xsi:noNamespaceSchemaLocation="http://sumo.dlr.de/xsd/net_file.xsd">
---
> <net version="1.3" junctionCornerDetail="5" limitTurnSpeed="5.50" xmlns:xsi="http://www.w3.org/2001/XMLSchema-instance" xsi:noNamespaceSchemaLocation="http://sumo.dlr.de/xsd/net_file.xsd">
880c880
<         <lane id=":294830184_7_0" index="0" speed="5.56" length="14.38" shape="915.07,462.77 918.06,460.17 921.14,459.20 924.29,459.87 927.52,462.17"/>
---
>         <lane id=":294830184_7_0" index="0" speed="5.56" length="13.52" shape="915.07,462.77 917.74,460.95 921.19,460.22 924.69,460.61 927.52,462.17"/>
3708c3708
<     <connection from="-26004787#2" to="26004966#2" fromLane="0" toLane="0" via=":283722837_12_0" dir="s" state="="/>
---
>     <connection from="-26004787#2" to="26004966#2" fromLane="0" toLane="0" via=":283722837_12_0" dir="R" state="="/>
3724c3724
<     <connection from="-26004868#0" to="-5198585#7" fromLane="0" toLane="0" via=":283719736_13_0" dir="R" state="m"/>
---
>     <connection from="-26004868#0" to="-5198585#7" fromLane="0" toLane="0" via=":283719736_13_0" dir="r" state="m"/>
3747c3747
<     <connection from="-26816553" to="-26816413#1" fromLane="0" toLane="0" via=":294168098_4_0" dir="R" state="="/>
---
>     <connection from="-26816553" to="-26816413#1" fromLane="0" toLane="0" via=":294168098_4_0" dir="r" state="="/>
4015c4015
<     <connection from="26816413#1" to="26816553" fromLane="0" toLane="0" via=":294168098_1_0" dir="L" state="="/>
---
>     <connection from="26816413#1" to="26816553" fromLane="0" toLane="0" via=":294168098_1_0" dir="l" state="="/>
4023c4023
<     <connection from="26816590#0" to="26816590#1" fromLane="0" toLane="0" via=":294169338_0_0" dir="s" state="="/>
---
>     <connection from="26816590#0" to="26816590#1" fromLane="0" toLane="0" via=":294169338_0_0" dir="R" state="="/>
4037c4037
<     <connection from="26843038#0" to="26843038#1" fromLane="0" toLane="0" via=":294830184_7_0" dir="L" state="="/>
<truncated after showing first 30 lines>

TEST had known bugs (see #254) on ts-sim-winbuild-ba : sumo output one_vehicle ( Last six runs Oct2019 )

different outputs from detectors which should detect the same
(This bug was triggered by text found in file 'output' matching 'failed')
---------- Differences in output ----------
10c10
< success 0.1 ['--step-length', '.1', '--end', '100'] ['3/1to2/1_0']
---
> failed 0.1 ['--step-length', '.1', '--end', '100'] 3/1to2/1_0 (71.3, 71.4) [('e2', 10.0), ('e3', -1.0), ('edge', -1.0), ('lane', -1.0)]
12c12
< success 1 ['--step-length', '.1', '--end', '100'] ['3/1to2/1_0']
---
> failed 1 ['--step-length', '.1', '--end', '100'] 3/1to2/1_0 (72.0, 73.0) [('e2', 10.0), ('e3', -1.0), ('edge', -1.0), ('lane', -1.0)]
14c14
< success 10 ['--step-length', '.1', '--end', '100'] ['3/1to2/1_0']
---
> failed 10 ['--step-length', '.1', '--end', '100'] 3/1to2/1_0 (80.0, 90.0) [('e2', 10.0), ('e3', -1.0), ('edge', -1.0), ('lane', -1.0)]
18c18
< success 0.1 ['--step-length', '.1', '--end', '1000'] ['3/1to2/1_0']
---
> failed 0.1 ['--step-length', '.1', '--end', '1000'] 3/1to2/1_0 (71.3, 71.4) [('e2', 10.0), ('e3', -1.0), ('edge', -1.0), ('lane', -1.0)]
20c20
< success 1 ['--step-length', '.1', '--end', '1000'] ['3/1to2/1_0']
---
> failed 1 ['--step-length', '.1', '--end', '1000'] 3/1to2/1_0 (72.0, 73.0) [('e2', 10.0), ('e3', -1.0), ('edge', -1.0), ('lane', -1.0)]
22c22
< success 10 ['--step-length', '.1', '--end', '1000'] ['3/1to2/1_0']
---
> failed 10 ['--step-length', '.1', '--end', '1000'] 3/1to2/1_0 (80.0, 90.0) [('e2', 10.0), ('e3', -1.0), ('edge', -1.0), ('lane', -1.0)]
24c24
< success 100 ['--step-length', '.1', '--end', '1000'] ['3/1to2/1_0']
---
> failed 100 ['--step-length', '.1', '--end', '1000'] 3/1to2/1_0 (100.0, 200.0) [('e1', -1.0), ('e2', 10.0), ('e3', -1.0), ('edge', -1.0), ('lane', -1.0)]
34c34
< success 0.1 ['--step-length', '1', '--end', '100'] ['3/1to2/1_0']
<truncated after showing first 30 lines>

TEST had known bugs (see #254) on ts-sim-winbuild-ba : sumo output teleport ( Last six runs Oct2019 )

different outputs from detectors which should detect the same
(This bug was triggered by text found in file 'output' matching 'failed')
---------- Differences in output ----------
2c2
< success ['--step-length', '.1', '--end', '51'] ['2/1to1/1_0']
---
> success 0.1 ['--step-length', '.1', '--end', '51'] ['2/1to1/1_0']
4c4
< success ['--step-length', '.1', '--end', '51'] ['2/1to1/1_0', '1/1to0/1_0']
---
> success 0.1 ['--step-length', '.1', '--end', '51'] ['2/1to1/1_0', '1/1to0/1_0']
6c6
< success ['--step-length', '.1', '--end', '51'] ['2/1to1/1_0']
---
> success 1 ['--step-length', '.1', '--end', '51'] ['2/1to1/1_0']
8c8
< success ['--step-length', '.1', '--end', '51'] ['2/1to1/1_0', '1/1to0/1_0']
---
> success 1 ['--step-length', '.1', '--end', '51'] ['2/1to1/1_0', '1/1to0/1_0']
10c10
< success ['--step-length', '.1', '--end', '51'] ['2/1to1/1_0']
---
> success 10 ['--step-length', '.1', '--end', '51'] ['2/1to1/1_0']
12c12
< success ['--step-length', '.1', '--end', '51'] ['2/1to1/1_0', '1/1to0/1_0']
---
> success 10 ['--step-length', '.1', '--end', '51'] ['2/1to1/1_0', '1/1to0/1_0']
14c14
< success ['--step-length', '.1', '--end', '51'] ['2/1to1/1_0']
---
> success 100 ['--step-length', '.1', '--end', '51'] ['2/1to1/1_0']
16c16
< success ['--step-length', '.1', '--end', '51'] ['2/1to1/1_0', '1/1to0/1_0']
<truncated after showing first 30 lines>

TEST had known bugs (see #254) on ts-sim-winbuild-ba : sumo output teleport_multihop ( Last six runs Oct2019 )

different outputs from detectors which should detect the same
(This bug was triggered by text found in file 'output' matching 'failed')
---------- Differences in output ----------
34c34
< success 0.1 ['--step-length', '.1', '--end', '1000'] 2/1to1/1_0 (230.0, 230.1) [('e2', 9.99), ('e3', 10.0), ('edge', 9.99), ('lane', 9.99)]
---
> failed 0.1 ['--step-length', '.1', '--end', '1000'] 2/1to1/1_0 (149.0, 149.1) [('e2', 9.99), ('e3', 10.0), ('edge', 10.0), ('lane', 10.0)]
36c36
< success 0.1 ['--step-length', '.1', '--end', '1000'] 1/1to0/1_0 (148.1, 148.2) [('e2', 9.99), ('e3', 10.0), ('edge', 9.99), ('lane', 9.99)]
---
> failed 0.1 ['--step-length', '.1', '--end', '1000'] 2/1to1/1_0 (149.0, 149.1) [('e2', 9.99), ('e3', 10.0), ('edge', 10.0), ('lane', 10.0)]
38c38
< success 1 ['--step-length', '.1', '--end', '1000'] 2/1to1/1_0 (230.0, 231.0) [('e2', 9.99), ('e3', 10.0), ('edge', 9.99), ('lane', 9.99)]
---
> failed 1 ['--step-length', '.1', '--end', '1000'] 2/1to1/1_0 (149.0, 150.0) [('e2', 9.93), ('e3', 10.0), ('edge', 10.0), ('lane', 10.0)]
40c40
< success 1 ['--step-length', '.1', '--end', '1000'] 1/1to0/1_0 (148.0, 149.0) [('e2', 9.91), ('e3', 10.0), ('edge', 9.91), ('lane', 9.91)]
---
> failed 1 ['--step-length', '.1', '--end', '1000'] 2/1to1/1_0 (149.0, 150.0) [('e2', 9.93), ('e3', 10.0), ('edge', 10.0), ('lane', 10.0)]
42c42
< success 10 ['--step-length', '.1', '--end', '1000'] 2/1to1/1_0 (230.0, 240.0) [('e2', 9.42), ('e3', 9.9), ('edge', 9.42), ('lane', 9.42)]
---
> failed 10 ['--step-length', '.1', '--end', '1000'] 2/1to1/1_0 (140.0, 150.0) [('e2', 9.99), ('e3', 10.0), ('edge', 10.0), ('lane', 10.0)]
44c44
< success 10 ['--step-length', '.1', '--end', '1000'] 1/1to0/1_0 (140.0, 150.0) [('e2', 9.96), ('e3', 9.99), ('edge', 9.96), ('lane', 9.96)]
---
> failed 10 ['--step-length', '.1', '--end', '1000'] 2/1to1/1_0 (140.0, 150.0) [('e2', 9.99), ('e3', 10.0), ('edge', 10.0), ('lane', 10.0)]
46c46
< success 100 ['--step-length', '.1', '--end', '1000'] 2/1to1/1_0 (200.0, 300.0) [('e1', 10.0), ('e2', 9.22), ('e3', 5.71), ('edge', 9.22), ('lane', 9.22)]
---
> failed 100 ['--step-length', '.1', '--end', '1000'] 2/1to1/1_0 (100.0, 200.0) [('e1', 10.0), ('e2', 7.95), ('e3', 10.0), ('edge', 10.0), ('lane', 10.0)]
48c48
< success 100 ['--step-length', '.1', '--end', '1000'] 1/1to0/1_0 (100.0, 200.0) [('e1', 9.53), ('e2', 5.82), ('e3', 6.93), ('edge', 5.82), ('lane', 5.82)]
<truncated after showing first 30 lines>

TEST had known bugs (see #254) on ts-sim-winbuild-ba : sumo output teleport_multihop_newDefaults ( Last six runs Oct2019 )

different outputs from detectors which should detect the same
(This bug was triggered by text found in file 'output' matching 'failed')
---------- Differences in output ----------
18c18
< success 0.1 ['--step-length', '.1', '--end', '100'] ['2/1to1/1_0']
---
> failed 0.1 ['--step-length', '.1', '--end', '100'] 2/1to1/1_0 (76.2, 76.3) [('e2', 10.49), ('e3', 10.35), ('edge', 10.49), ('lane', 10.49)]
20c20
< success 0.1 ['--step-length', '.1', '--end', '100'] ['2/1to1/1_0', '1/1to0/1_0']
---
> failed 0.1 ['--step-length', '.1', '--end', '100'] 2/1to1/1_0 (76.2, 76.3) [('e2', 10.49), ('e3', 10.35), ('edge', 10.49), ('lane', 10.49)]
22c22
< success 1 ['--step-length', '.1', '--end', '100'] ['2/1to1/1_0']
---
> failed 1 ['--step-length', '.1', '--end', '100'] 2/1to1/1_0 (76.0, 77.0) [('e2', 10.39), ('e3', 10.35), ('edge', 10.39), ('lane', 10.39)]
24c24
< success 1 ['--step-length', '.1', '--end', '100'] ['2/1to1/1_0', '1/1to0/1_0']
---
> failed 1 ['--step-length', '.1', '--end', '100'] 2/1to1/1_0 (76.0, 77.0) [('e2', 10.39), ('e3', 10.35), ('edge', 10.39), ('lane', 10.39)]
26c26
< success 10 ['--step-length', '.1', '--end', '100'] ['2/1to1/1_0']
---
> failed 10 ['--step-length', '.1', '--end', '100'] 2/1to1/1_0 (70.0, 80.0) [('e2', 10.42), ('e3', 10.25), ('edge', 10.42), ('lane', 10.42)]
28c28
< success 10 ['--step-length', '.1', '--end', '100'] ['2/1to1/1_0', '1/1to0/1_0']
---
> failed 10 ['--step-length', '.1', '--end', '100'] 2/1to1/1_0 (70.0, 80.0) [('e2', 10.42), ('e3', 10.25), ('edge', 10.42), ('lane', 10.42)]
30c30
< success 100 ['--step-length', '.1', '--end', '100'] ['2/1to1/1_0']
---
> failed 100 ['--step-length', '.1', '--end', '100'] 2/1to1/1_0 (0.0, 100.0) [('e1', 10.27), ('e2', 10.24), ('e3', 9.59), ('edge', 10.24), ('lane', 10.24)]
32c32
< success 100 ['--step-length', '.1', '--end', '100'] ['2/1to1/1_0', '1/1to0/1_0']
<truncated after showing first 30 lines>

TEST had known bugs (see #254) on ts-sim-winbuild-ba : sumo output two_same_vehicles ( Last six runs Oct2019 )

different outputs from detectors which should detect the same
(This bug was triggered by text found in file 'output' matching 'failed')
---------- Differences in output ----------
10c10
< success 0.1 ['--step-length', '.1', '--end', '100'] ['3/1to2/1_0']
---
> failed 0.1 ['--step-length', '.1', '--end', '100'] 3/1to2/1_0 (75.4, 75.5) [('e2', 10.0), ('e3', -1.0), ('edge', -1.0), ('lane', -1.0)]
12c12
< success 1 ['--step-length', '.1', '--end', '100'] ['3/1to2/1_0']
---
> failed 1 ['--step-length', '.1', '--end', '100'] 3/1to2/1_0 (76.0, 77.0) [('e2', 10.0), ('e3', -1.0), ('edge', -1.0), ('lane', -1.0)]
14c14
< success 10 ['--step-length', '.1', '--end', '100'] ['3/1to2/1_0']
---
> failed 10 ['--step-length', '.1', '--end', '100'] 3/1to2/1_0 (80.0, 90.0) [('e2', 10.0), ('e3', -1.0), ('edge', -1.0), ('lane', -1.0)]
18c18
< success 0.1 ['--step-length', '.1', '--end', '1000'] ['3/1to2/1_0']
---
> failed 0.1 ['--step-length', '.1', '--end', '1000'] 3/1to2/1_0 (75.4, 75.5) [('e2', 10.0), ('e3', -1.0), ('edge', -1.0), ('lane', -1.0)]
20c20
< success 1 ['--step-length', '.1', '--end', '1000'] ['3/1to2/1_0']
---
> failed 1 ['--step-length', '.1', '--end', '1000'] 3/1to2/1_0 (76.0, 77.0) [('e2', 10.0), ('e3', -1.0), ('edge', -1.0), ('lane', -1.0)]
22c22
< success 10 ['--step-length', '.1', '--end', '1000'] ['3/1to2/1_0']
---
> failed 10 ['--step-length', '.1', '--end', '1000'] 3/1to2/1_0 (80.0, 90.0) [('e2', 10.0), ('e3', -1.0), ('edge', -1.0), ('lane', -1.0)]
24c24
< success 100 ['--step-length', '.1', '--end', '1000'] ['3/1to2/1_0']
---
> failed 100 ['--step-length', '.1', '--end', '1000'] 3/1to2/1_0 (100.0, 200.0) [('e1', -1.0), ('e2', 10.0), ('e3', -1.0), ('edge', -1.0), ('lane', -1.0)]
34c34
< success 0.1 ['--step-length', '1', '--end', '100'] ['3/1to2/1_0']
<truncated after showing first 30 lines>

TEST had known bugs (see #254) on ts-sim-winbuild-ba : sumo output two_vehicles_diff_length ( Last six runs Oct2019 )

different outputs from detectors which should detect the same
(This bug was triggered by text found in file 'output' matching 'failed')
---------- Differences in output ----------
10c10
< success 0.1 ['--step-length', '.1', '--end', '100'] ['3/1to2/1_0']
---
> failed 0.1 ['--step-length', '.1', '--end', '100'] 3/1to2/1_0 (76.4, 76.5) [('e2', 10.0), ('e3', -1.0), ('edge', -1.0), ('lane', -1.0)]
12c12
< success 1 ['--step-length', '.1', '--end', '100'] ['3/1to2/1_0']
---
> failed 1 ['--step-length', '.1', '--end', '100'] 3/1to2/1_0 (77.0, 78.0) [('e2', 10.0), ('e3', -1.0), ('edge', -1.0), ('lane', -1.0)]
14c14
< success 10 ['--step-length', '.1', '--end', '100'] ['3/1to2/1_0']
---
> failed 10 ['--step-length', '.1', '--end', '100'] 3/1to2/1_0 (80.0, 90.0) [('e2', 10.0), ('e3', -1.0), ('edge', -1.0), ('lane', -1.0)]
18c18
< success 0.1 ['--step-length', '.1', '--end', '1000'] ['3/1to2/1_0']
---
> failed 0.1 ['--step-length', '.1', '--end', '1000'] 3/1to2/1_0 (76.4, 76.5) [('e2', 10.0), ('e3', -1.0), ('edge', -1.0), ('lane', -1.0)]
20c20
< success 1 ['--step-length', '.1', '--end', '1000'] ['3/1to2/1_0']
---
> failed 1 ['--step-length', '.1', '--end', '1000'] 3/1to2/1_0 (77.0, 78.0) [('e2', 10.0), ('e3', -1.0), ('edge', -1.0), ('lane', -1.0)]
22c22
< success 10 ['--step-length', '.1', '--end', '1000'] ['3/1to2/1_0']
---
> failed 10 ['--step-length', '.1', '--end', '1000'] 3/1to2/1_0 (80.0, 90.0) [('e2', 10.0), ('e3', -1.0), ('edge', -1.0), ('lane', -1.0)]
24c24
< success 100 ['--step-length', '.1', '--end', '1000'] ['3/1to2/1_0']
---
> failed 100 ['--step-length', '.1', '--end', '1000'] 3/1to2/1_0 (100.0, 200.0) [('e1', -1.0), ('e2', 10.0), ('e3', -1.0), ('edge', -1.0), ('lane', -1.0)]
34c34
< success 0.1 ['--step-length', '1', '--end', '100'] ['3/1to2/1_0']
<truncated after showing first 30 lines>

TEST had known bugs (see #254) on ts-sim-winbuild-ba : sumo output two_vehicles_diff_speed ( Last six runs Oct2019 )

different outputs from detectors which should detect the same
(This bug was triggered by text found in file 'output' matching 'failed')
---------- Differences in output ----------
0a1,48
> Loading configuration... done.
> failed 0.1 ['--step-length', '.1', '--end', '51'] 3/1to2/1_0 (38.4, 38.5) [('e2', 9.6), ('e3', 9.5), ('edge', 9.6), ('lane', 9.6)]
> Loading configuration... done.
> failed 1 ['--step-length', '.1', '--end', '51'] 3/1to2/1_0 (38.0, 39.0) [('e2', 9.64), ('e3', 9.5), ('edge', 9.64), ('lane', 9.64)]
> Loading configuration... done.
> failed 10 ['--step-length', '.1', '--end', '51'] 3/1to2/1_0 (30.0, 40.0) [('e2', 9.86), ('e3', 9.5), ('edge', 9.86), ('lane', 9.86)]
> Loading configuration... done.
> failed 100 ['--step-length', '.1', '--end', '51'] 3/1to2/1_0 (0.0, 51.0) [('e2', 9.62), ('e3', 9.5), ('edge', 9.62), ('lane', 9.62)]
> Loading configuration... done.
> failed 0.1 ['--step-length', '.1', '--end', '100'] 3/1to2/1_0 (38.4, 38.5) [('e2', 9.6), ('e3', 9.5), ('edge', 9.6), ('lane', 9.6)]
> Loading configuration... done.
> failed 1 ['--step-length', '.1', '--end', '100'] 3/1to2/1_0 (38.0, 39.0) [('e2', 9.64), ('e3', 9.5), ('edge', 9.64), ('lane', 9.64)]
> Loading configuration... done.
> failed 10 ['--step-length', '.1', '--end', '100'] 3/1to2/1_0 (30.0, 40.0) [('e2', 9.86), ('e3', 9.5), ('edge', 9.86), ('lane', 9.86)]
> Loading configuration... done.
> failed 100 ['--step-length', '.1', '--end', '100'] 3/1to2/1_0 (0.0, 100.0) [('e1', 9.5), ('e2', 9.53), ('e3', 9.5), ('edge', 9.47), ('lane', 9.47)]
> Loading configuration... done.
> failed 0.1 ['--step-length', '.1', '--end', '1000'] 3/1to2/1_0 (38.4, 38.5) [('e2', 9.6), ('e3', 9.5), ('edge', 9.6), ('lane', 9.6)]
> Loading configuration... done.
> failed 1 ['--step-length', '.1', '--end', '1000'] 3/1to2/1_0 (38.0, 39.0) [('e2', 9.64), ('e3', 9.5), ('edge', 9.64), ('lane', 9.64)]
> Loading configuration... done.
> failed 10 ['--step-length', '.1', '--end', '1000'] 3/1to2/1_0 (30.0, 40.0) [('e2', 9.86), ('e3', 9.5), ('edge', 9.86), ('lane', 9.86)]
> Loading configuration... done.
> failed 100 ['--step-length', '.1', '--end', '1000'] 3/1to2/1_0 (0.0, 100.0) [('e1', 9.5), ('e2', 9.53), ('e3', 9.5), ('edge', 9.47), ('lane', 9.47)]
> Loading configuration... done.
> failed 0.1 ['--step-length', '1', '--end', '51'] 3/1to2/1_0 (39.0, 40.0) [('e2', 9.6), ('e3', 9.5), ('edge', 9.6), ('lane', 9.6)]
> Loading configuration... done.
> failed 1 ['--step-length', '1', '--end', '51'] 3/1to2/1_0 (39.0, 40.0) [('e2', 9.6), ('e3', 9.5), ('edge', 9.6), ('lane', 9.6)]
> Loading configuration... done.
<truncated after showing first 30 lines>

TEST had known bugs (#4727) on ts-sim-winbuild-ba : traci ContextSubscriptionFilters leadFollow carFollowing ( Last six runs Oct2019 )

#4727
(This bug was triggered by text found in file 'output' matching '.')
---------- Differences in output ----------
4d3
< lead_straight
6d4
< [002] Context results for vehicle 'ego':
7a6
> [002] Context results for vehicle 'ego':
9d7
< [003] Context results for vehicle 'ego':
10a9
> [003] Context results for vehicle 'ego':
12d10
< [004] Context results for vehicle 'ego':
13a12
> [004] Context results for vehicle 'ego':
15d13
< [005] Context results for vehicle 'ego':
16a15
> [005] Context results for vehicle 'ego':
18d16
< [006] Context results for vehicle 'ego':
19a18
> [006] Context results for vehicle 'ego':
21d19
< [007] Context results for vehicle 'ego':
22a21
> [007] Context results for vehicle 'ego':
24d22
< [008] Context results for vehicle 'ego':
25a24
> [008] Context results for vehicle 'ego':
<truncated after showing first 30 lines>

2 TESTS had known bugs (#4727) on ts-sim-winbuild-ba :

#4727
(This bug was triggered by text found in file 'output' matching '.')
---------- Differences in output ----------
4a5
> follow_straight
7d7
< follow_straight
9a10
> follow_straight
12d12
< follow_straight
14a15
> follow_straight
17d17
< follow_straight
19a20
> follow_straight
22d22
< follow_straight
24a25
> follow_straight
27d27
< follow_straight
29a30
> follow_straight
32d32
< follow_straight
34a35
> follow_straight
37d37
< follow_straight
39a40
> follow_straight
<truncated after showing first 30 lines>
traci ContextSubscriptionFilters leadFollow laneChangeLeft ( Last six runs Oct2019 )
traci ContextSubscriptionFilters leadFollow laneChangeRight ( Last six runs Oct2019 )

TEST had known bugs (#4727) on ts-sim-winbuild-ba : traci ContextSubscriptionFilters leadFollow laneChangeNeighbors ( Last six runs Oct2019 )

#4727
(This bug was triggered by text found in file 'output' matching '.')
---------- Differences in output ----------
4,5d3
< follow_straight
< follow_right
6a5,7
> follow_right
> follow_straight
> lead_left
9d9
< lead_left
11,12d10
< follow_straight
< follow_right
13a12,14
> follow_right
> follow_straight
> lead_left
16d16
< lead_left
18,19d17
< follow_straight
< follow_right
20a19,21
> follow_right
> follow_straight
> lead_left
23d23
< lead_left
25,26d24
< follow_straight
< follow_right
<truncated after showing first 30 lines>

TEST had known bugs (see #3263) on ts-sim-winbuild-ba : traci pythonApi moveToXY keepRoute2 ( Last six runs Oct2019 )

mapping failure
(This bug was triggered by text found in file 'output' matching 'failed')
---------- Differences in output ----------
0a1,2
> internal corner (inside, segment2) failed: x=198, x2=198.0,   y=1.9, y2=1.9,   lane=middle_0, lane2=middle_0, pos=102, pos2=98.0   posLat=2.0 posLat2=1.9
> internal corner (outside, far) failed: x=203, x2=203.0,   y=-4, y2=-4.0,   lane=, lane2=middle_0, pos=-1073741824.0, pos2=100.0   posLat=-1073741824.0 posLat2=-1.41421356237

TEST had known bugs (see #5383) on ts-sim-winbuild-ba : traci pythonApi moveToXY permissions ( Last six runs Oct2019 )

mapping failure
(This bug was triggered by text found in file 'output' matching 'failed')
---------- Differences in output ----------
0a1,2
> shifted to left lane (permissions) failed: mode=2 x=40, x2=40.0,   y=-1.5, y2=-1.5,   lane=beg_1, lane2=, pos=40, pos2=-1073741824.0   posLat=0.0 posLat2=-1073741824.0
> right lane (ignore permissions) failed: mode=6 x=40, x2=40.0,   y=-1.6, y2=-1.6,   lane=beg_0, lane2=, pos=40, pos2=-1073741824.0   posLat=0.0 posLat2=-1073741824.0

Detailed information for the tests that were terminated before completion:

TEST were terminated before completion (TIMEOUT) on ts-sim-winbuild-ba : traci pythonApi polygon_dynamics_gui ( Last six runs Oct2019 )

Test exceeded wallclock time limit of 900.0 seconds
---------- Differences in output ----------
2,257d1
< step 0
< step 1
< step 2
< adding poly0
< polygons ('poly0',)
< polygon count 1
< # examining poly0
< shape ((960.0, 510.0), (960.0, 550.0), (1000.0, 550.0), (1000.0, 510.0))
< type test
< color (100, 200, 0, 255)
< filled True
< step 3
< step 4
< step 5
< # (1) Adding underspecified dynamics...
< Caught TraCIException
< # (2) Adding malformed dynamics 1 ...
< Caught TraCIException
< # (3) Adding malformed dynamics 2 ...
< Caught TraCIException
< # (4) Adding malformed dynamics 3 ...
< Caught TraCIException
< # (5) Adding malformed dynamics 4 ...
< Caught TraCIException
< # (6) Adding malformed dynamics 5 ...
< Caught TraCIException
< # examining poly0
< shape ((960.0, 510.0), (960.0, 550.0), (1000.0, 550.0), (1000.0, 510.0))
< type test
<truncated after showing first 30 lines>

TEST were terminated before completion (TIMEOUT) on ts-sim-winbuild-ba : traci pythonApi rerouting findIntermodalRoute car_public_speedFactor ( Last six runs Oct2019 )

Test exceeded wallclock time limit of 900.0 seconds
---------- Differences in errors ----------
0a1
> Assertion failed: effort >= minimumInfo->effort, file C:\Users\delphi\Code\sumo\git\src\utils/router/DijkstraRouter.h, line 200
---------- Differences in output ----------
1,99d0
< findIntermodalRoute modes='car bicycle public' vType=' pType=''
<   Stage(type=3, vType=DEFAULT_VEHTYPE, line=car, edges=('A0B0', 'B0B1', 'B1A1', 'A1B1'), travelTime=126.216342693, cost=126.216342693, length=3571.04, intended=car, depart=-1.0, departPos=894.8, arrivalPos=987.6)
< 
< findIntermodalRoute modes='car bicycle public' vType=defaultCar' pType=''
<   Stage(type=3, vType=defaultCar, line=defaultCar, edges=('A0B0', 'B0B1', 'B1A1', 'A1B1'), travelTime=126.216342693, cost=126.216342693, length=3571.04, intended=defaultCar, depart=-1.0, departPos=894.8, arrivalPos=987.6)
< 
< findIntermodalRoute modes='car bicycle public' vType=slowCar' pType=''
<   Stage(type=3, vType=DEFAULT_VEHTYPE, line=car, edges=('A0B0', 'B0B1', 'B1A1', 'A1B1'), travelTime=126.216342693, cost=126.216342693, length=3571.04, intended=car, depart=-1.0, departPos=894.8, arrivalPos=987.6)
< 
< findIntermodalRoute modes='car bicycle public' vType=slowCarFactor' pType=''
<   Stage(type=3, vType=DEFAULT_VEHTYPE, line=car, edges=('A0B0', 'B0B1', 'B1A1', 'A1B1'), travelTime=126.216342693, cost=126.216342693, length=3571.04, intended=car, depart=-1.0, departPos=894.8, arrivalPos=987.6)
< 
< findIntermodalRoute modes='car bicycle public' vType=fastCar' pType=''
<   Stage(type=3, vType=fastCar, line=fastCar, edges=('A0B0', 'B0B1', 'B1A1', 'A1B1'), travelTime=65.3581713463, cost=65.3581713463, length=3571.04, intended=fastCar, depart=-1.0, departPos=894.8, arrivalPos=987.6)
< 
< 
< 
< findIntermodalRoute modes='public' vType=' pType=''
<   Stage(type=2, destStop=stopC_W, edges=('A0B0', 'accessC'), travelTime=181.27776, cost=181.27776, length=2194.03, depart=-1.0, departPos=894.8, arrivalPos=91.9)
<   Stage(type=3, line=train2:1, destStop=stopA_W, edges=('railEW',), travelTime=559.72296, cost=559.72296, length=2392.8, intended=train_train2:1.0, depart=599.0, departPos=0.0, arrivalPos=1100.0)
<   Stage(type=2, destStop=stopA_N, edges=('accessA',), travelTime=3.80256, cost=3.80256, length=1603.96, depart=-1.0, departPos=86.23, arrivalPos=90.19)
<   Stage(type=3, line=train1:0, destStop=stopB_N, edges=('railSN',), travelTime=355.19796, cost=355.19796, length=1192.8, intended=train_train1:0.1, depart=1001.0, departPos=0.0, arrivalPos=500.0)
<   Stage(type=2, edges=('accessB', 'A1B1'), travelTime=203.9232, cost=203.9232, length=2087.62, depart=-1.0, departPos=91.16, arrivalPos=987.6)
< 
< findIntermodalRoute modes='public' vType=defaultCar' pType=''
<   Stage(type=3, vType=defaultCar, line=defaultCar, edges=('A0B0', 'B0B1', 'B1A1', 'A1B1'), travelTime=126.216342693, cost=126.216342693, length=3571.04, intended=defaultCar, depart=-1.0, departPos=894.8, arrivalPos=987.6)
< 
< findIntermodalRoute modes='public' vType=slowCar' pType=''
<   Stage(type=2, destStop=stopC_W, edges=('A0B0', 'accessC'), travelTime=181.27776, cost=181.27776, length=2194.03, depart=-1.0, departPos=894.8, arrivalPos=91.9)
<truncated after showing first 30 lines>

TEST were terminated before completion (TIMEOUT) on ts-sim-winbuild-ba : traffic_lights loop_flow ( Last six runs Oct2019 )

Test exceeded wallclock time limit of 900.0 seconds
---------- Differences in output ----------
1,144d0
< Computing for 0<->0
<  for tls-type static
<  for tls-type actuated
<  for tls-type sotl_phase
<  for tls-type sotl_platoon
<  for tls-type sotl_request
<  for tls-type sotl_wave
<  for tls-type sotl_marching
<  for tls-type swarm
< Computing for 0<->600
<  for tls-type static
<  for tls-type actuated
<  for tls-type sotl_phase
<  for tls-type sotl_platoon
<  for tls-type sotl_request
<  for tls-type sotl_wave
<  for tls-type sotl_marching
<  for tls-type swarm
< Computing for 0<->1200
<  for tls-type static
<  for tls-type actuated
<  for tls-type sotl_phase
<  for tls-type sotl_platoon
<  for tls-type sotl_request
<  for tls-type sotl_wave
<  for tls-type sotl_marching
<  for tls-type swarm
< Computing for 0<->1800
<  for tls-type static
<truncated after showing first 30 lines>