04Jun20rv1_6_0+0521-bad558c3e9 - detailed test results for NETEDITCHECKOUTPUT

To reconnect the TextTest GUI to these results, run:

texttestc.py -a neteditcheckoutput -d C:/Users/delphi/Code/sumo/git/tests -reconnect C:/Users/delphi/Code/sumo/msvc12x64Dtexttesttmp/msvc12x64D.30Jun042102.12116 -g

To start TextTest for these tests, run:

texttestc.py -a neteditcheckoutput -d C:/Users/delphi/Code/sumo/git/tests


default: 2494 tests: 2204 succeeded 216 known bugs 72 FAILED 2 killed

Detailed information for the tests that FAILED:

2 TESTS FAILED on ts-sim-winbuild-ba :

---------- Differences in output ----------
1d0
< Loading configuration ... done.
---------- New result in errors ----------
Error: Could not access configuration 'sumo.sumocfg'.
Quitting (on error).
bugs ticket4528 ( Last six runs Jun2020 )
bugs ticket5540 ( Last six runs Jun2020 )

TEST FAILED on ts-sim-winbuild-ba : demandElements flow inspect via ( Last six runs Jun2020 )

---------- Differences in errors ----------
0a1,3
> Warning: No connection between edge 'gneE2' and edge 'gneE8' found.
> Error: Vehicle 'flow_0.0' has no valid route from edge 'gneE2' to stop edge 'gneE8'.
> Quitting (on error).
---------- New result in exitcode ----------
1

TEST FAILED on ts-sim-winbuild-ba : demandElements flow inspect_selection departPos random_free ( Last six runs Jun2020 )

---------- Differences in errors ----------
141a142,151
> Error: Vehicle 'flowB.16' will not be able to depart using the given velocity (junction 'gneJ6' too close)!
> Error: Vehicle 'flowB.16' will not be able to depart using the given velocity (junction 'gneJ6' too close)!
> Error: Vehicle 'flowB.16' will not be able to depart using the given velocity (junction 'gneJ6' too close)!
> Error: Vehicle 'flowB.16' will not be able to depart using the given velocity (junction 'gneJ6' too close)!
> Error: Vehicle 'flowB.16' will not be able to depart using the given velocity (junction 'gneJ6' too close)!
> Error: Vehicle 'flowB.16' will not be able to depart using the given velocity (junction 'gneJ6' too close)!
> Error: Vehicle 'flowB.16' will not be able to depart using the given velocity (junction 'gneJ6' too close)!
> Error: Vehicle 'flowB.16' will not be able to depart using the given velocity (junction 'gneJ6' too close)!
> Error: Vehicle 'flowB.16' will not be able to depart using the given velocity (junction 'gneJ6' too close)!
> Error: Vehicle 'flowB.16' will not be able to depart using the given velocity (junction 'gneJ6' too close)!
164,179c174,187
< Warning: Teleporting vehicle 'flowA.6'; waited too long (jam), lane=':gneJ5_2_0', time=2138.00.
< Warning: Vehicle 'flowA.6' ends teleporting on edge 'gneE4', time 2138.00.
< Warning: Teleporting vehicle 'flowA.7'; waited too long (jam), lane=':gneJ5_2_0', time=2443.00.
< Warning: Vehicle 'flowA.7' ends teleporting on edge 'gneE4', time 2443.00.
< Warning: Teleporting vehicle 'flowA.8'; waited too long (jam), lane=':gneJ5_2_0', time=2748.00.
< Warning: Vehicle 'flowA.8' ends teleporting on edge 'gneE4', time 2748.00.
< Warning: Teleporting vehicle 'flowA.9'; waited too long (jam), lane=':gneJ5_2_0', time=3053.00.
< Warning: Vehicle 'flowA.9' ends teleporting on edge 'gneE4', time 3053.00.
< Warning: Teleporting vehicle 'flowA.10'; waited too long (jam), lane=':gneJ5_2_0', time=3358.00.
< Warning: Vehicle 'flowA.10' ends teleporting on edge 'gneE4', time 3358.00.
< Warning: Teleporting vehicle 'flowA.11'; waited too long (jam), lane=':gneJ5_2_0', time=3662.00.
< Warning: Vehicle 'flowA.11' ends teleporting on edge 'gneE4', time 3662.00.
< Warning: Teleporting vehicle 'flowA.12'; waited too long (jam), lane=':gneJ5_2_0', time=3967.00.
< Warning: Vehicle 'flowA.12' ends teleporting on edge 'gneE4', time 3967.00.
< Warning: Teleporting vehicle 'flowA.13'; waited too long (jam), lane=':gneJ5_2_0', time=4273.00.
< Warning: Vehicle 'flowA.13' ends teleporting on edge 'gneE4', time 4273.00.
---
> Warning: Teleporting vehicle 'flowA.6'; waited too long (jam), lane=':gneJ5_2_0', time=2137.00.
<truncated after showing first 30 lines>

TEST FAILED on ts-sim-winbuild-ba : demandElements flow inspect_selection parameters ( Last six runs Jun2020 )

---------- Differences in errors ----------
1,18c1,18
< Error: Vehicle 'flowB.0' will not be able to depart using the given velocity (junction too close)!
< Error: Vehicle 'flowB.1' will not be able to depart using the given velocity (junction too close)!
< Error: Vehicle 'flowB.2' will not be able to depart using the given velocity (junction too close)!
< Error: Vehicle 'flowB.3' will not be able to depart using the given velocity (junction too close)!
< Error: Vehicle 'flowB.4' will not be able to depart using the given velocity (junction too close)!
< Error: Vehicle 'flowB.5' will not be able to depart using the given velocity (junction too close)!
< Error: Vehicle 'flowB.6' will not be able to depart using the given velocity (junction too close)!
< Error: Vehicle 'flowB.7' will not be able to depart using the given velocity (junction too close)!
< Error: Vehicle 'flowB.8' will not be able to depart using the given velocity (junction too close)!
< Error: Vehicle 'flowB.9' will not be able to depart using the given velocity (junction too close)!
< Error: Vehicle 'flowB.10' will not be able to depart using the given velocity (junction too close)!
< Error: Vehicle 'flowB.11' will not be able to depart using the given velocity (junction too close)!
< Error: Vehicle 'flowB.12' will not be able to depart using the given velocity (junction too close)!
< Error: Vehicle 'flowB.13' will not be able to depart using the given velocity (junction too close)!
< Error: Vehicle 'flowB.14' will not be able to depart using the given velocity (junction too close)!
< Error: Vehicle 'flowB.15' will not be able to depart using the given velocity (junction too close)!
< Error: Vehicle 'flowB.16' will not be able to depart using the given velocity (junction too close)!
< Error: Vehicle 'flowB.17' will not be able to depart using the given velocity (junction too close)!
---
> Error: Vehicle 'flowB.0' will not be able to depart using the given velocity (junction 'gneJ6' too close)!
> Error: Vehicle 'flowB.1' will not be able to depart using the given velocity (junction 'gneJ6' too close)!
> Error: Vehicle 'flowB.2' will not be able to depart using the given velocity (junction 'gneJ6' too close)!
> Error: Vehicle 'flowB.3' will not be able to depart using the given velocity (junction 'gneJ6' too close)!
> Error: Vehicle 'flowB.4' will not be able to depart using the given velocity (junction 'gneJ6' too close)!
> Error: Vehicle 'flowB.5' will not be able to depart using the given velocity (junction 'gneJ6' too close)!
> Error: Vehicle 'flowB.6' will not be able to depart using the given velocity (junction 'gneJ6' too close)!
> Error: Vehicle 'flowB.7' will not be able to depart using the given velocity (junction 'gneJ6' too close)!
> Error: Vehicle 'flowB.8' will not be able to depart using the given velocity (junction 'gneJ6' too close)!
> Error: Vehicle 'flowB.9' will not be able to depart using the given velocity (junction 'gneJ6' too close)!
<truncated after showing first 30 lines>

2 TESTS FAILED on ts-sim-winbuild-ba :

---------- Differences in errors ----------
12a13,20
> Warning: Invalid departPos 500.00 given for vehicle 'flow_3.1'. Inserting at lane end instead.
> Warning: Invalid departPos 500.00 given for vehicle 'flow_3.1'. Inserting at lane end instead.
> Warning: Invalid departPos 500.00 given for vehicle 'flow_3.1'. Inserting at lane end instead.
> Warning: Invalid departPos 500.00 given for vehicle 'flow_3.1'. Inserting at lane end instead.
> Warning: Invalid departPos 500.00 given for vehicle 'flow_3.2'. Inserting at lane end instead.
> Warning: Invalid departPos 500.00 given for vehicle 'flow_3.2'. Inserting at lane end instead.
> Warning: Invalid departPos 500.00 given for vehicle 'flow_3.2'. Inserting at lane end instead.
> Warning: Invalid departPos 500.00 given for vehicle 'flow_3.2'. Inserting at lane end instead.
15d22
< Warning: Invalid departPos 500.00 given for vehicle 'flow_3.3'. Inserting at lane end instead.
22,27c29,36
< Warning: Invalid departPos 500.00 given for vehicle 'flow_3.5'. Inserting at lane end instead.
< Warning: Invalid departPos 500.00 given for vehicle 'flow_3.5'. Inserting at lane end instead.
< Warning: Invalid departPos 500.00 given for vehicle 'flow_3.5'. Inserting at lane end instead.
< Warning: Invalid departPos 500.00 given for vehicle 'flow_3.5'. Inserting at lane end instead.
< Warning: Invalid departPos 500.00 given for vehicle 'flow_3.5'. Inserting at lane end instead.
< Warning: Invalid departPos 500.00 given for vehicle 'flow_3.5'. Inserting at lane end instead.
---
> Warning: Invalid departPos 500.00 given for vehicle 'flow_3.4'. Inserting at lane end instead.
> Warning: Invalid departPos 500.00 given for vehicle 'flow_3.4'. Inserting at lane end instead.
> Warning: Invalid departPos 500.00 given for vehicle 'flow_3.4'. Inserting at lane end instead.
> Warning: Invalid departPos 500.00 given for vehicle 'flow_3.4'. Inserting at lane end instead.
> Warning: Invalid departPos 500.00 given for vehicle 'flow_3.4'. Inserting at lane end instead.
> Warning: Invalid departPos 500.00 given for vehicle 'flow_3.4'. Inserting at lane end instead.
> Warning: Invalid departPos 500.00 given for vehicle 'flow_3.4'. Inserting at lane end instead.
> Warning: Invalid departPos 500.00 given for vehicle 'flow_3.4'. Inserting at lane end instead.
34,36c43,44
< Warning: Invalid departPos 500.00 given for vehicle 'flow_3.7'. Inserting at lane end instead.
< Warning: Invalid departPos 500.00 given for vehicle 'flow_3.7'. Inserting at lane end instead.
<truncated after showing first 30 lines>
demandElements flow load departPos ( Last six runs Jun2020 )
demandElements routeflow load departPos ( Last six runs Jun2020 )

TEST FAILED on ts-sim-winbuild-ba : demandElements person create default_ride default_ride_busstop ( Last six runs Jun2020 )

---------- Differences in errors ----------
1c1,5
< Warning: Person 'person_0' aborted waiting for ANY at busStop 'busStop'.
---
> Error: missing required attribute 'lines'
>  In file 'routes.netedit'
>  At line/column 59/47.
> 
> Quitting (on error).
---------- New result in exitcode ----------
1

TEST FAILED on ts-sim-winbuild-ba : demandElements person create default_ride default_ride_fromto ( Last six runs Jun2020 )

---------- Differences in errors ----------
1c1,5
< Warning: Person 'person_0' aborted waiting for ANY at edge 'gneE2'.
---
> Error: missing required attribute 'lines'
>  In file 'routes.netedit'
>  At line/column 59/40.
> 
> Quitting (on error).
---------- New result in exitcode ----------
1

TEST FAILED on ts-sim-winbuild-ba : demandElements personFlow create color ( Last six runs Jun2020 )

---------- Differences in errors ----------
0a1,5
> Error: attribute 'vehsPerHour' is not declared for element 'personFlow'
>  In file 'routes.netedit'
>  At line/column 58/97.
> 
> Quitting (on error).
---------- New result in exitcode ----------
1

TEST FAILED on ts-sim-winbuild-ba : demandElements personFlow create default_ride default_ride_busstop ( Last six runs Jun2020 )

---------- Differences in errors ----------
1,1800c1,5
< Warning: Person 'personFlow_0.0' aborted waiting for ANY at busStop 'busStop'.
< Warning: Person 'personFlow_0.1' aborted waiting for ANY at busStop 'busStop'.
< Warning: Person 'personFlow_0.2' aborted waiting for ANY at busStop 'busStop'.
< Warning: Person 'personFlow_0.3' aborted waiting for ANY at busStop 'busStop'.
< Warning: Person 'personFlow_0.4' aborted waiting for ANY at busStop 'busStop'.
< Warning: Person 'personFlow_0.5' aborted waiting for ANY at busStop 'busStop'.
< Warning: Person 'personFlow_0.6' aborted waiting for ANY at busStop 'busStop'.
< Warning: Person 'personFlow_0.7' aborted waiting for ANY at busStop 'busStop'.
< Warning: Person 'personFlow_0.8' aborted waiting for ANY at busStop 'busStop'.
< Warning: Person 'personFlow_0.9' aborted waiting for ANY at busStop 'busStop'.
< Warning: Person 'personFlow_0.10' aborted waiting for ANY at busStop 'busStop'.
< Warning: Person 'personFlow_0.11' aborted waiting for ANY at busStop 'busStop'.
< Warning: Person 'personFlow_0.12' aborted waiting for ANY at busStop 'busStop'.
< Warning: Person 'personFlow_0.13' aborted waiting for ANY at busStop 'busStop'.
< Warning: Person 'personFlow_0.14' aborted waiting for ANY at busStop 'busStop'.
< Warning: Person 'personFlow_0.15' aborted waiting for ANY at busStop 'busStop'.
< Warning: Person 'personFlow_0.16' aborted waiting for ANY at busStop 'busStop'.
< Warning: Person 'personFlow_0.17' aborted waiting for ANY at busStop 'busStop'.
< Warning: Person 'personFlow_0.18' aborted waiting for ANY at busStop 'busStop'.
< Warning: Person 'personFlow_0.19' aborted waiting for ANY at busStop 'busStop'.
< Warning: Person 'personFlow_0.20' aborted waiting for ANY at busStop 'busStop'.
< Warning: Person 'personFlow_0.21' aborted waiting for ANY at busStop 'busStop'.
< Warning: Person 'personFlow_0.22' aborted waiting for ANY at busStop 'busStop'.
< Warning: Person 'personFlow_0.23' aborted waiting for ANY at busStop 'busStop'.
< Warning: Person 'personFlow_0.24' aborted waiting for ANY at busStop 'busStop'.
< Warning: Person 'personFlow_0.25' aborted waiting for ANY at busStop 'busStop'.
< Warning: Person 'personFlow_0.26' aborted waiting for ANY at busStop 'busStop'.
< Warning: Person 'personFlow_0.27' aborted waiting for ANY at busStop 'busStop'.
< Warning: Person 'personFlow_0.28' aborted waiting for ANY at busStop 'busStop'.
<truncated after showing first 30 lines>
---------- New result in exitcode ----------
1

TEST FAILED on ts-sim-winbuild-ba : demandElements personFlow create default_ride default_ride_fromto ( Last six runs Jun2020 )

---------- Differences in errors ----------
1,1800c1,5
< Warning: Person 'personFlow_0.0' aborted waiting for ANY at edge 'gneE2'.
< Warning: Person 'personFlow_0.1' aborted waiting for ANY at edge 'gneE2'.
< Warning: Person 'personFlow_0.2' aborted waiting for ANY at edge 'gneE2'.
< Warning: Person 'personFlow_0.3' aborted waiting for ANY at edge 'gneE2'.
< Warning: Person 'personFlow_0.4' aborted waiting for ANY at edge 'gneE2'.
< Warning: Person 'personFlow_0.5' aborted waiting for ANY at edge 'gneE2'.
< Warning: Person 'personFlow_0.6' aborted waiting for ANY at edge 'gneE2'.
< Warning: Person 'personFlow_0.7' aborted waiting for ANY at edge 'gneE2'.
< Warning: Person 'personFlow_0.8' aborted waiting for ANY at edge 'gneE2'.
< Warning: Person 'personFlow_0.9' aborted waiting for ANY at edge 'gneE2'.
< Warning: Person 'personFlow_0.10' aborted waiting for ANY at edge 'gneE2'.
< Warning: Person 'personFlow_0.11' aborted waiting for ANY at edge 'gneE2'.
< Warning: Person 'personFlow_0.12' aborted waiting for ANY at edge 'gneE2'.
< Warning: Person 'personFlow_0.13' aborted waiting for ANY at edge 'gneE2'.
< Warning: Person 'personFlow_0.14' aborted waiting for ANY at edge 'gneE2'.
< Warning: Person 'personFlow_0.15' aborted waiting for ANY at edge 'gneE2'.
< Warning: Person 'personFlow_0.16' aborted waiting for ANY at edge 'gneE2'.
< Warning: Person 'personFlow_0.17' aborted waiting for ANY at edge 'gneE2'.
< Warning: Person 'personFlow_0.18' aborted waiting for ANY at edge 'gneE2'.
< Warning: Person 'personFlow_0.19' aborted waiting for ANY at edge 'gneE2'.
< Warning: Person 'personFlow_0.20' aborted waiting for ANY at edge 'gneE2'.
< Warning: Person 'personFlow_0.21' aborted waiting for ANY at edge 'gneE2'.
< Warning: Person 'personFlow_0.22' aborted waiting for ANY at edge 'gneE2'.
< Warning: Person 'personFlow_0.23' aborted waiting for ANY at edge 'gneE2'.
< Warning: Person 'personFlow_0.24' aborted waiting for ANY at edge 'gneE2'.
< Warning: Person 'personFlow_0.25' aborted waiting for ANY at edge 'gneE2'.
< Warning: Person 'personFlow_0.26' aborted waiting for ANY at edge 'gneE2'.
< Warning: Person 'personFlow_0.27' aborted waiting for ANY at edge 'gneE2'.
< Warning: Person 'personFlow_0.28' aborted waiting for ANY at edge 'gneE2'.
<truncated after showing first 30 lines>
---------- New result in exitcode ----------
1

TEST FAILED on ts-sim-winbuild-ba : demandElements personFlow create default_walk default_walk_edges ( Last six runs Jun2020 )

---------- Differences in errors ----------
0a1,5
> Error: attribute 'vehsPerHour' is not declared for element 'personFlow'
>  In file 'routes.netedit'
>  At line/column 58/84.
> 
> Quitting (on error).
---------- New result in exitcode ----------
1

TEST FAILED on ts-sim-winbuild-ba : demandElements personFlow create departPos ( Last six runs Jun2020 )

---------- Differences in errors ----------
1c1,5
< Warning: Invalid departPos 5000.00 given for stopping at gneE2. Using edge end instead.
---
> Error: attribute 'vehsPerHour' is not declared for element 'personFlow'
>  In file 'routes.netedit'
>  At line/column 58/103.
> 
> Quitting (on error).
---------- New result in exitcode ----------
1

TEST FAILED on ts-sim-winbuild-ba : demandElements stop stopBusStop create actType ( Last six runs Jun2020 )

---------- Differences in errors ----------
0a1,2
> Warning: Vehicle 'vehicle_0' ignores container triggered stop on lane 'gneE1_0' due to capacity constraints.
> Warning: Vehicle 'vehicle_0' ignores container triggered stop on lane 'gneE1_0' due to capacity constraints.

TEST FAILED on ts-sim-winbuild-ba : demandElements stop stopBusStop create containerTrigger ( Last six runs Jun2020 )

---------- Differences in errors ----------
1c1
< Warning: Vehicle 'vehicle_0' ignores container triggered stop on lane 'gneE1_0' due to capacity constraints.
---
> Error: Attribute 'expected' in definition of a stop is empty.

TEST FAILED on ts-sim-winbuild-ba : demandElements stop stopBusStop create parking ( Last six runs Jun2020 )

---------- Differences in errors ----------
0a1,3
> Error: Attribute 'expectedContainers' in definition of a stop is empty.
> Warning: Vehicle 'vehicle_0' ignores container triggered stop on lane 'gneE1_0' due to capacity constraints.
> Warning: Vehicle 'vehicle_0' ignores container triggered stop on lane 'gneE1_0' due to capacity constraints.

2 TESTS FAILED on ts-sim-winbuild-ba :

---------- New result in errors ----------
Error: Attribute 'expected' in definition of a stop is empty.
---------- Missing result in exitcode ----------
1
demandElements stop stopBusStop load expected ( Last six runs Jun2020 )
demandElements stop stopContainerStop load expected ( Last six runs Jun2020 )

TEST FAILED on ts-sim-winbuild-ba : demandElements stop stopChargingStation create actType ( Last six runs Jun2020 )

---------- Differences in errors ----------
0a1,32
> Warning: Vehicle 'flow.0' ignores container triggered stop on lane 'gneE1_0' due to capacity constraints.
> Warning: Vehicle 'flow.1' ignores container triggered stop on lane 'gneE1_0' due to capacity constraints.
> Warning: Vehicle 'flow.0' ignores container triggered stop on lane 'gneE1_0' due to capacity constraints.
> Warning: Vehicle 'flow.1' ignores container triggered stop on lane 'gneE1_0' due to capacity constraints.
> Warning: Vehicle 'flow.2' ignores container triggered stop on lane 'gneE1_0' due to capacity constraints.
> Warning: Vehicle 'flow.3' ignores container triggered stop on lane 'gneE1_0' due to capacity constraints.
> Warning: Vehicle 'flow.2' ignores container triggered stop on lane 'gneE1_0' due to capacity constraints.
> Warning: Vehicle 'flow.3' ignores container triggered stop on lane 'gneE1_0' due to capacity constraints.
> Warning: Vehicle 'flow.4' ignores container triggered stop on lane 'gneE1_0' due to capacity constraints.
> Warning: Vehicle 'flow.5' ignores container triggered stop on lane 'gneE1_0' due to capacity constraints.
> Warning: Vehicle 'flow.4' ignores container triggered stop on lane 'gneE1_0' due to capacity constraints.
> Warning: Vehicle 'flow.5' ignores container triggered stop on lane 'gneE1_0' due to capacity constraints.
> Warning: Vehicle 'flow.6' ignores container triggered stop on lane 'gneE1_0' due to capacity constraints.
> Warning: Vehicle 'flow.7' ignores container triggered stop on lane 'gneE1_0' due to capacity constraints.
> Warning: Vehicle 'flow.6' ignores container triggered stop on lane 'gneE1_0' due to capacity constraints.
> Warning: Vehicle 'flow.7' ignores container triggered stop on lane 'gneE1_0' due to capacity constraints.
> Warning: Vehicle 'flow.8' ignores container triggered stop on lane 'gneE1_0' due to capacity constraints.
> Warning: Vehicle 'flow.9' ignores container triggered stop on lane 'gneE1_0' due to capacity constraints.
> Warning: Vehicle 'flow.8' ignores container triggered stop on lane 'gneE1_0' due to capacity constraints.
> Warning: Vehicle 'flow.9' ignores container triggered stop on lane 'gneE1_0' due to capacity constraints.
> Warning: Vehicle 'flow.10' ignores container triggered stop on lane 'gneE1_0' due to capacity constraints.
> Warning: Vehicle 'flow.11' ignores container triggered stop on lane 'gneE1_0' due to capacity constraints.
> Warning: Vehicle 'flow.10' ignores container triggered stop on lane 'gneE1_0' due to capacity constraints.
> Warning: Vehicle 'flow.11' ignores container triggered stop on lane 'gneE1_0' due to capacity constraints.
> Warning: Vehicle 'flow.12' ignores container triggered stop on lane 'gneE1_0' due to capacity constraints.
> Warning: Vehicle 'flow.13' ignores container triggered stop on lane 'gneE1_0' due to capacity constraints.
> Warning: Vehicle 'flow.12' ignores container triggered stop on lane 'gneE1_0' due to capacity constraints.
> Warning: Vehicle 'flow.13' ignores container triggered stop on lane 'gneE1_0' due to capacity constraints.
> Warning: Vehicle 'flow.14' ignores container triggered stop on lane 'gneE1_0' due to capacity constraints.
<truncated after showing first 30 lines>

TEST FAILED on ts-sim-winbuild-ba : demandElements stop stopChargingStation create containerTrigger ( Last six runs Jun2020 )

---------- Differences in errors ----------
1,18c1
< Warning: Vehicle 'flow.0' ignores container triggered stop on lane 'gneE1_0' due to capacity constraints.
< Warning: Vehicle 'flow.1' ignores container triggered stop on lane 'gneE1_0' due to capacity constraints.
< Warning: Vehicle 'flow.2' ignores container triggered stop on lane 'gneE1_0' due to capacity constraints.
< Warning: Vehicle 'flow.3' ignores container triggered stop on lane 'gneE1_0' due to capacity constraints.
< Warning: Vehicle 'flow.4' ignores container triggered stop on lane 'gneE1_0' due to capacity constraints.
< Warning: Vehicle 'flow.5' ignores container triggered stop on lane 'gneE1_0' due to capacity constraints.
< Warning: Vehicle 'flow.6' ignores container triggered stop on lane 'gneE1_0' due to capacity constraints.
< Warning: Vehicle 'flow.7' ignores container triggered stop on lane 'gneE1_0' due to capacity constraints.
< Warning: Vehicle 'flow.8' ignores container triggered stop on lane 'gneE1_0' due to capacity constraints.
< Warning: Vehicle 'flow.9' ignores container triggered stop on lane 'gneE1_0' due to capacity constraints.
< Warning: Vehicle 'flow.10' ignores container triggered stop on lane 'gneE1_0' due to capacity constraints.
< Warning: Vehicle 'flow.11' ignores container triggered stop on lane 'gneE1_0' due to capacity constraints.
< Warning: Vehicle 'flow.12' ignores container triggered stop on lane 'gneE1_0' due to capacity constraints.
< Warning: Vehicle 'flow.13' ignores container triggered stop on lane 'gneE1_0' due to capacity constraints.
< Warning: Vehicle 'flow.14' ignores container triggered stop on lane 'gneE1_0' due to capacity constraints.
< Warning: Vehicle 'flow.15' ignores container triggered stop on lane 'gneE1_0' due to capacity constraints.
< Warning: Vehicle 'flow.16' ignores container triggered stop on lane 'gneE1_0' due to capacity constraints.
< Warning: Vehicle 'flow.17' ignores container triggered stop on lane 'gneE1_0' due to capacity constraints.
---
> Error: Attribute 'expected' in definition of a stop is empty.

TEST FAILED on ts-sim-winbuild-ba : demandElements stop stopChargingStation create duration ( Last six runs Jun2020 )

---------- Differences in errors ----------
0a1,24
> Warning: Teleporting vehicle 'flow.2'; waited too long (jam), lane='gneE1_0', time=321.00.
> Warning: Vehicle 'flow.2' teleports beyond arrival edge 'gneE1', time 321.00.
> Warning: Vehicle 'flow.2' skips stop on lane 'gneE1_0' time=321.00.
> Warning: Vehicle 'flow.2' skips stop on lane 'gneE1_0' time=321.00.
> Warning: Vehicle 'flow.2' skips stop on lane 'gneE1_0' time=321.00.
> Warning: Vehicle 'flow.2' skips stop on lane 'gneE1_0' time=321.00.
> Warning: Teleporting vehicle 'flow.3'; waited too long (jam), lane='gneE1_0', time=625.00.
> Warning: Vehicle 'flow.3' teleports beyond arrival edge 'gneE1', time 625.00.
> Warning: Vehicle 'flow.3' skips stop on lane 'gneE1_0' time=625.00.
> Warning: Vehicle 'flow.3' skips stop on lane 'gneE1_0' time=625.00.
> Warning: Vehicle 'flow.3' skips stop on lane 'gneE1_0' time=625.00.
> Warning: Vehicle 'flow.3' skips stop on lane 'gneE1_0' time=625.00.
> Warning: Teleporting vehicle 'flow.4'; waited too long (jam), lane='gneE1_0', time=931.00.
> Warning: Vehicle 'flow.4' teleports beyond arrival edge 'gneE1', time 931.00.
> Warning: Vehicle 'flow.4' skips stop on lane 'gneE1_0' time=931.00.
> Warning: Vehicle 'flow.4' skips stop on lane 'gneE1_0' time=931.00.
> Warning: Vehicle 'flow.4' skips stop on lane 'gneE1_0' time=931.00.
> Warning: Vehicle 'flow.4' skips stop on lane 'gneE1_0' time=931.00.
> Warning: Teleporting vehicle 'flow.5'; waited too long (jam), lane='gneE1_0', time=1236.00.
> Warning: Vehicle 'flow.5' teleports beyond arrival edge 'gneE1', time 1236.00.
> Warning: Vehicle 'flow.5' skips stop on lane 'gneE1_0' time=1236.00.
> Warning: Vehicle 'flow.5' skips stop on lane 'gneE1_0' time=1236.00.
> Warning: Vehicle 'flow.5' skips stop on lane 'gneE1_0' time=1236.00.
> Warning: Vehicle 'flow.5' skips stop on lane 'gneE1_0' time=1236.00.

TEST FAILED on ts-sim-winbuild-ba : demandElements stop stopChargingStation create expected ( Last six runs Jun2020 )

---------- Differences in errors ----------
0a1,20
> Warning: Teleporting vehicle 'flow.2'; waited too long (jam), lane='gneE1_0', time=321.00.
> Warning: Vehicle 'flow.2' teleports beyond arrival edge 'gneE1', time 321.00.
> Warning: Vehicle 'flow.2' skips stop on lane 'gneE1_0' time=321.00.
> Warning: Vehicle 'flow.2' skips stop on lane 'gneE1_0' time=321.00.
> Warning: Vehicle 'flow.2' skips stop on lane 'gneE1_0' time=321.00.
> Warning: Teleporting vehicle 'flow.3'; waited too long (jam), lane='gneE1_0', time=625.00.
> Warning: Vehicle 'flow.3' teleports beyond arrival edge 'gneE1', time 625.00.
> Warning: Vehicle 'flow.3' skips stop on lane 'gneE1_0' time=625.00.
> Warning: Vehicle 'flow.3' skips stop on lane 'gneE1_0' time=625.00.
> Warning: Vehicle 'flow.3' skips stop on lane 'gneE1_0' time=625.00.
> Warning: Teleporting vehicle 'flow.4'; waited too long (jam), lane='gneE1_0', time=931.00.
> Warning: Vehicle 'flow.4' teleports beyond arrival edge 'gneE1', time 931.00.
> Warning: Vehicle 'flow.4' skips stop on lane 'gneE1_0' time=931.00.
> Warning: Vehicle 'flow.4' skips stop on lane 'gneE1_0' time=931.00.
> Warning: Vehicle 'flow.4' skips stop on lane 'gneE1_0' time=931.00.
> Warning: Teleporting vehicle 'flow.5'; waited too long (jam), lane='gneE1_0', time=1236.00.
> Warning: Vehicle 'flow.5' teleports beyond arrival edge 'gneE1', time 1236.00.
> Warning: Vehicle 'flow.5' skips stop on lane 'gneE1_0' time=1236.00.
> Warning: Vehicle 'flow.5' skips stop on lane 'gneE1_0' time=1236.00.
> Warning: Vehicle 'flow.5' skips stop on lane 'gneE1_0' time=1236.00.

TEST FAILED on ts-sim-winbuild-ba : demandElements stop stopChargingStation create expectedContainer ( Last six runs Jun2020 )

---------- Differences in errors ----------
1,54d0
< Warning: Vehicle 'flow.0' ignores container triggered stop on lane 'gneE1_0' due to capacity constraints.
< Warning: Vehicle 'flow.1' ignores container triggered stop on lane 'gneE1_0' due to capacity constraints.
< Warning: Vehicle 'flow.2' ignores container triggered stop on lane 'gneE1_0' due to capacity constraints.
< Warning: Vehicle 'flow.3' ignores container triggered stop on lane 'gneE1_0' due to capacity constraints.
< Warning: Vehicle 'flow.4' ignores container triggered stop on lane 'gneE1_0' due to capacity constraints.
< Warning: Vehicle 'flow.5' ignores container triggered stop on lane 'gneE1_0' due to capacity constraints.
< Warning: Vehicle 'flow.6' ignores container triggered stop on lane 'gneE1_0' due to capacity constraints.
< Warning: Vehicle 'flow.7' ignores container triggered stop on lane 'gneE1_0' due to capacity constraints.
< Warning: Vehicle 'flow.8' ignores container triggered stop on lane 'gneE1_0' due to capacity constraints.
< Warning: Vehicle 'flow.9' ignores container triggered stop on lane 'gneE1_0' due to capacity constraints.
< Warning: Vehicle 'flow.10' ignores container triggered stop on lane 'gneE1_0' due to capacity constraints.
< Warning: Vehicle 'flow.11' ignores container triggered stop on lane 'gneE1_0' due to capacity constraints.
< Warning: Vehicle 'flow.12' ignores container triggered stop on lane 'gneE1_0' due to capacity constraints.
< Warning: Vehicle 'flow.13' ignores container triggered stop on lane 'gneE1_0' due to capacity constraints.
< Warning: Vehicle 'flow.14' ignores container triggered stop on lane 'gneE1_0' due to capacity constraints.
< Warning: Vehicle 'flow.15' ignores container triggered stop on lane 'gneE1_0' due to capacity constraints.
< Warning: Vehicle 'flow.16' ignores container triggered stop on lane 'gneE1_0' due to capacity constraints.
< Warning: Vehicle 'flow.17' ignores container triggered stop on lane 'gneE1_0' due to capacity constraints.
< Warning: Vehicle 'flow.0' ignores container triggered stop on lane 'gneE1_0' due to capacity constraints.
< Warning: Vehicle 'flow.1' ignores container triggered stop on lane 'gneE1_0' due to capacity constraints.
< Warning: Vehicle 'flow.2' ignores container triggered stop on lane 'gneE1_0' due to capacity constraints.
< Warning: Vehicle 'flow.3' ignores container triggered stop on lane 'gneE1_0' due to capacity constraints.
< Warning: Vehicle 'flow.4' ignores container triggered stop on lane 'gneE1_0' due to capacity constraints.
< Warning: Vehicle 'flow.5' ignores container triggered stop on lane 'gneE1_0' due to capacity constraints.
< Warning: Vehicle 'flow.6' ignores container triggered stop on lane 'gneE1_0' due to capacity constraints.
< Warning: Vehicle 'flow.7' ignores container triggered stop on lane 'gneE1_0' due to capacity constraints.
< Warning: Vehicle 'flow.8' ignores container triggered stop on lane 'gneE1_0' due to capacity constraints.
< Warning: Vehicle 'flow.9' ignores container triggered stop on lane 'gneE1_0' due to capacity constraints.
< Warning: Vehicle 'flow.10' ignores container triggered stop on lane 'gneE1_0' due to capacity constraints.
<truncated after showing first 30 lines>

TEST FAILED on ts-sim-winbuild-ba : demandElements stop stopChargingStation create parking ( Last six runs Jun2020 )

---------- Differences in errors ----------
0a1,33
> Error: Attribute 'expectedContainers' in definition of a stop is empty.
> Warning: Vehicle 'flow.0' ignores container triggered stop on lane 'gneE1_0' due to capacity constraints.
> Warning: Vehicle 'flow.1' ignores container triggered stop on lane 'gneE1_0' due to capacity constraints.
> Warning: Vehicle 'flow.0' ignores container triggered stop on lane 'gneE1_0' due to capacity constraints.
> Warning: Vehicle 'flow.1' ignores container triggered stop on lane 'gneE1_0' due to capacity constraints.
> Warning: Vehicle 'flow.2' ignores container triggered stop on lane 'gneE1_0' due to capacity constraints.
> Warning: Vehicle 'flow.3' ignores container triggered stop on lane 'gneE1_0' due to capacity constraints.
> Warning: Vehicle 'flow.2' ignores container triggered stop on lane 'gneE1_0' due to capacity constraints.
> Warning: Vehicle 'flow.3' ignores container triggered stop on lane 'gneE1_0' due to capacity constraints.
> Warning: Vehicle 'flow.4' ignores container triggered stop on lane 'gneE1_0' due to capacity constraints.
> Warning: Vehicle 'flow.5' ignores container triggered stop on lane 'gneE1_0' due to capacity constraints.
> Warning: Vehicle 'flow.4' ignores container triggered stop on lane 'gneE1_0' due to capacity constraints.
> Warning: Vehicle 'flow.5' ignores container triggered stop on lane 'gneE1_0' due to capacity constraints.
> Warning: Vehicle 'flow.6' ignores container triggered stop on lane 'gneE1_0' due to capacity constraints.
> Warning: Vehicle 'flow.7' ignores container triggered stop on lane 'gneE1_0' due to capacity constraints.
> Warning: Vehicle 'flow.6' ignores container triggered stop on lane 'gneE1_0' due to capacity constraints.
> Warning: Vehicle 'flow.7' ignores container triggered stop on lane 'gneE1_0' due to capacity constraints.
> Warning: Vehicle 'flow.8' ignores container triggered stop on lane 'gneE1_0' due to capacity constraints.
> Warning: Vehicle 'flow.9' ignores container triggered stop on lane 'gneE1_0' due to capacity constraints.
> Warning: Vehicle 'flow.8' ignores container triggered stop on lane 'gneE1_0' due to capacity constraints.
> Warning: Vehicle 'flow.9' ignores container triggered stop on lane 'gneE1_0' due to capacity constraints.
> Warning: Vehicle 'flow.10' ignores container triggered stop on lane 'gneE1_0' due to capacity constraints.
> Warning: Vehicle 'flow.11' ignores container triggered stop on lane 'gneE1_0' due to capacity constraints.
> Warning: Vehicle 'flow.10' ignores container triggered stop on lane 'gneE1_0' due to capacity constraints.
> Warning: Vehicle 'flow.11' ignores container triggered stop on lane 'gneE1_0' due to capacity constraints.
> Warning: Vehicle 'flow.12' ignores container triggered stop on lane 'gneE1_0' due to capacity constraints.
> Warning: Vehicle 'flow.13' ignores container triggered stop on lane 'gneE1_0' due to capacity constraints.
> Warning: Vehicle 'flow.12' ignores container triggered stop on lane 'gneE1_0' due to capacity constraints.
> Warning: Vehicle 'flow.13' ignores container triggered stop on lane 'gneE1_0' due to capacity constraints.
<truncated after showing first 30 lines>

TEST FAILED on ts-sim-winbuild-ba : demandElements stop stopChargingStation create triggered ( Last six runs Jun2020 )

---------- Differences in errors ----------
0a1,16
> Warning: Teleporting vehicle 'flow.2'; waited too long (jam), lane='gneE1_0', time=383.00.
> Warning: Vehicle 'flow.2' teleports beyond arrival edge 'gneE1', time 383.00.
> Warning: Vehicle 'flow.2' skips stop on lane 'gneE1_0' time=383.00.
> Warning: Vehicle 'flow.2' skips stop on lane 'gneE1_0' time=383.00.
> Warning: Teleporting vehicle 'flow.3'; waited too long (jam), lane='gneE1_0', time=689.00.
> Warning: Vehicle 'flow.3' teleports beyond arrival edge 'gneE1', time 689.00.
> Warning: Vehicle 'flow.3' skips stop on lane 'gneE1_0' time=689.00.
> Warning: Vehicle 'flow.3' skips stop on lane 'gneE1_0' time=689.00.
> Warning: Teleporting vehicle 'flow.4'; waited too long (jam), lane='gneE1_0', time=995.00.
> Warning: Vehicle 'flow.4' teleports beyond arrival edge 'gneE1', time 995.00.
> Warning: Vehicle 'flow.4' skips stop on lane 'gneE1_0' time=995.00.
> Warning: Vehicle 'flow.4' skips stop on lane 'gneE1_0' time=995.00.
> Warning: Teleporting vehicle 'flow.5'; waited too long (jam), lane='gneE1_0', time=1301.00.
> Warning: Vehicle 'flow.5' teleports beyond arrival edge 'gneE1', time 1301.00.
> Warning: Vehicle 'flow.5' skips stop on lane 'gneE1_0' time=1301.00.
> Warning: Vehicle 'flow.5' skips stop on lane 'gneE1_0' time=1301.00.

2 TESTS FAILED on ts-sim-winbuild-ba :

---------- Differences in errors ----------
0a1,12
> Warning: Teleporting vehicle 'flow.2'; waited too long (jam), lane='gneE1_0', time=321.00.
> Warning: Vehicle 'flow.2' teleports beyond arrival edge 'gneE1', time 321.00.
> Warning: Vehicle 'flow.2' skips stop on lane 'gneE1_0' time=321.00.
> Warning: Teleporting vehicle 'flow.3'; waited too long (jam), lane='gneE1_0', time=625.00.
> Warning: Vehicle 'flow.3' teleports beyond arrival edge 'gneE1', time 625.00.
> Warning: Vehicle 'flow.3' skips stop on lane 'gneE1_0' time=625.00.
> Warning: Teleporting vehicle 'flow.4'; waited too long (jam), lane='gneE1_0', time=931.00.
> Warning: Vehicle 'flow.4' teleports beyond arrival edge 'gneE1', time 931.00.
> Warning: Vehicle 'flow.4' skips stop on lane 'gneE1_0' time=931.00.
> Warning: Teleporting vehicle 'flow.5'; waited too long (jam), lane='gneE1_0', time=1236.00.
> Warning: Vehicle 'flow.5' teleports beyond arrival edge 'gneE1', time 1236.00.
> Warning: Vehicle 'flow.5' skips stop on lane 'gneE1_0' time=1236.00.
demandElements stop stopChargingStation inspect expected ( Last six runs Jun2020 )
demandElements stop stopChargingStation inspect triggered ( Last six runs Jun2020 )

2 TESTS FAILED on ts-sim-winbuild-ba :

---------- Differences in errors ----------
5,18d4
< Warning: Vehicle 'flow_1.4' ignores container triggered stop on lane 'gneE0_0' due to capacity constraints.
< Warning: Vehicle 'flow_1.5' ignores container triggered stop on lane 'gneE0_0' due to capacity constraints.
< Warning: Vehicle 'flow_1.6' ignores container triggered stop on lane 'gneE0_0' due to capacity constraints.
< Warning: Vehicle 'flow_1.7' ignores container triggered stop on lane 'gneE0_0' due to capacity constraints.
< Warning: Vehicle 'flow_1.8' ignores container triggered stop on lane 'gneE0_0' due to capacity constraints.
< Warning: Vehicle 'flow_1.9' ignores container triggered stop on lane 'gneE0_0' due to capacity constraints.
< Warning: Vehicle 'flow_1.10' ignores container triggered stop on lane 'gneE0_0' due to capacity constraints.
< Warning: Vehicle 'flow_1.11' ignores container triggered stop on lane 'gneE0_0' due to capacity constraints.
< Warning: Vehicle 'flow_1.12' ignores container triggered stop on lane 'gneE0_0' due to capacity constraints.
< Warning: Vehicle 'flow_1.13' ignores container triggered stop on lane 'gneE0_0' due to capacity constraints.
< Warning: Vehicle 'flow_1.14' ignores container triggered stop on lane 'gneE0_0' due to capacity constraints.
< Warning: Vehicle 'flow_1.15' ignores container triggered stop on lane 'gneE0_0' due to capacity constraints.
< Warning: Vehicle 'flow_1.16' ignores container triggered stop on lane 'gneE0_0' due to capacity constraints.
< Warning: Vehicle 'flow_1.17' ignores container triggered stop on lane 'gneE0_0' due to capacity constraints.
20a7,8
> Warning: Vehicle 'flow_1.4' ignores container triggered stop on lane 'gneE0_0' due to capacity constraints.
> Warning: Vehicle 'flow_1.5' ignores container triggered stop on lane 'gneE0_0' due to capacity constraints.
22a11,12
> Warning: Vehicle 'flow_1.6' ignores container triggered stop on lane 'gneE0_0' due to capacity constraints.
> Warning: Vehicle 'flow_1.7' ignores container triggered stop on lane 'gneE0_0' due to capacity constraints.
24a15,16
> Warning: Vehicle 'flow_1.8' ignores container triggered stop on lane 'gneE0_0' due to capacity constraints.
> Warning: Vehicle 'flow_1.9' ignores container triggered stop on lane 'gneE0_0' due to capacity constraints.
26a19,20
> Warning: Vehicle 'flow_1.10' ignores container triggered stop on lane 'gneE0_0' due to capacity constraints.
> Warning: Vehicle 'flow_1.11' ignores container triggered stop on lane 'gneE0_0' due to capacity constraints.
28a23,24
> Warning: Vehicle 'flow_1.12' ignores container triggered stop on lane 'gneE0_0' due to capacity constraints.
> Warning: Vehicle 'flow_1.13' ignores container triggered stop on lane 'gneE0_0' due to capacity constraints.
<truncated after showing first 30 lines>
demandElements stop stopChargingStation inspect_selection containerTrigger ( Last six runs Jun2020 )
demandElements stop stopChargingStation inspect_selection expectedContainer ( Last six runs Jun2020 )

TEST FAILED on ts-sim-winbuild-ba : demandElements stop stopChargingStation load actType ( Last six runs Jun2020 )

---------- Differences in errors ----------
0a1,20
> Warning: Teleporting vehicle 'flow_1.2'; waited too long (wrong lane), lane='gneE0_0', time=313.00.
> Warning: Vehicle 'flow_1.2' skips stop on lane 'gneE0_0' time=313.00.
> Warning: Vehicle 'flow_1.2' skips stop on lane 'gneE0_0' time=313.00.
> Warning: Vehicle 'flow_1.2' skips stop on lane 'gneE0_0' time=313.00.
> Warning: Vehicle 'flow_1.2' ends teleporting on edge 'gneE1', time 313.00.
> Warning: Teleporting vehicle 'flow_1.3'; waited too long (wrong lane), lane='gneE0_0', time=619.00.
> Warning: Vehicle 'flow_1.3' skips stop on lane 'gneE0_0' time=619.00.
> Warning: Vehicle 'flow_1.3' skips stop on lane 'gneE0_0' time=619.00.
> Warning: Vehicle 'flow_1.3' skips stop on lane 'gneE0_0' time=619.00.
> Warning: Vehicle 'flow_1.3' ends teleporting on edge 'gneE1', time 619.00.
> Warning: Teleporting vehicle 'flow_1.4'; waited too long (wrong lane), lane='gneE0_0', time=923.00.
> Warning: Vehicle 'flow_1.4' skips stop on lane 'gneE0_0' time=923.00.
> Warning: Vehicle 'flow_1.4' skips stop on lane 'gneE0_0' time=923.00.
> Warning: Vehicle 'flow_1.4' skips stop on lane 'gneE0_0' time=923.00.
> Warning: Vehicle 'flow_1.4' ends teleporting on edge 'gneE1', time 923.00.
> Warning: Teleporting vehicle 'flow_1.5'; waited too long (wrong lane), lane='gneE0_0', time=1228.00.
> Warning: Vehicle 'flow_1.5' skips stop on lane 'gneE0_0' time=1228.00.
> Warning: Vehicle 'flow_1.5' skips stop on lane 'gneE0_0' time=1228.00.
> Warning: Vehicle 'flow_1.5' skips stop on lane 'gneE0_0' time=1228.00.
> Warning: Vehicle 'flow_1.5' ends teleporting on edge 'gneE1', time 1228.00.

TEST FAILED on ts-sim-winbuild-ba : demandElements stop stopChargingStation load containerTrigger ( Last six runs Jun2020 )

---------- Differences in errors ----------
1,18c1,16
< Warning: Vehicle 'flow_1.0' ignores container triggered stop on lane 'gneE0_0' due to capacity constraints.
< Warning: Vehicle 'flow_1.1' ignores container triggered stop on lane 'gneE0_0' due to capacity constraints.
< Warning: Vehicle 'flow_1.2' ignores container triggered stop on lane 'gneE0_0' due to capacity constraints.
< Warning: Vehicle 'flow_1.3' ignores container triggered stop on lane 'gneE0_0' due to capacity constraints.
< Warning: Vehicle 'flow_1.4' ignores container triggered stop on lane 'gneE0_0' due to capacity constraints.
< Warning: Vehicle 'flow_1.5' ignores container triggered stop on lane 'gneE0_0' due to capacity constraints.
< Warning: Vehicle 'flow_1.6' ignores container triggered stop on lane 'gneE0_0' due to capacity constraints.
< Warning: Vehicle 'flow_1.7' ignores container triggered stop on lane 'gneE0_0' due to capacity constraints.
< Warning: Vehicle 'flow_1.8' ignores container triggered stop on lane 'gneE0_0' due to capacity constraints.
< Warning: Vehicle 'flow_1.9' ignores container triggered stop on lane 'gneE0_0' due to capacity constraints.
< Warning: Vehicle 'flow_1.10' ignores container triggered stop on lane 'gneE0_0' due to capacity constraints.
< Warning: Vehicle 'flow_1.11' ignores container triggered stop on lane 'gneE0_0' due to capacity constraints.
< Warning: Vehicle 'flow_1.12' ignores container triggered stop on lane 'gneE0_0' due to capacity constraints.
< Warning: Vehicle 'flow_1.13' ignores container triggered stop on lane 'gneE0_0' due to capacity constraints.
< Warning: Vehicle 'flow_1.14' ignores container triggered stop on lane 'gneE0_0' due to capacity constraints.
< Warning: Vehicle 'flow_1.15' ignores container triggered stop on lane 'gneE0_0' due to capacity constraints.
< Warning: Vehicle 'flow_1.16' ignores container triggered stop on lane 'gneE0_0' due to capacity constraints.
< Warning: Vehicle 'flow_1.17' ignores container triggered stop on lane 'gneE0_0' due to capacity constraints.
---
> Warning: Teleporting vehicle 'flow_1.2'; waited too long (wrong lane), lane='gneE0_0', time=313.00.
> Warning: Vehicle 'flow_1.2' skips stop on lane 'gneE0_0' time=313.00.
> Warning: Vehicle 'flow_1.2' skips stop on lane 'gneE0_0' time=313.00.
> Warning: Vehicle 'flow_1.2' ends teleporting on edge 'gneE1', time 313.00.
> Warning: Teleporting vehicle 'flow_1.3'; waited too long (wrong lane), lane='gneE0_0', time=619.00.
> Warning: Vehicle 'flow_1.3' skips stop on lane 'gneE0_0' time=619.00.
> Warning: Vehicle 'flow_1.3' skips stop on lane 'gneE0_0' time=619.00.
> Warning: Vehicle 'flow_1.3' ends teleporting on edge 'gneE1', time 619.00.
> Warning: Teleporting vehicle 'flow_1.4'; waited too long (wrong lane), lane='gneE0_0', time=923.00.
> Warning: Vehicle 'flow_1.4' skips stop on lane 'gneE0_0' time=923.00.
<truncated after showing first 30 lines>

TEST FAILED on ts-sim-winbuild-ba : demandElements stop stopChargingStation load default ( Last six runs Jun2020 )

---------- Differences in errors ----------
0a1,12
> Warning: Teleporting vehicle 'flow_1.2'; waited too long (wrong lane), lane='gneE0_0', time=313.00.
> Warning: Vehicle 'flow_1.2' skips stop on lane 'gneE0_0' time=313.00.
> Warning: Vehicle 'flow_1.2' ends teleporting on edge 'gneE1', time 313.00.
> Warning: Teleporting vehicle 'flow_1.3'; waited too long (wrong lane), lane='gneE0_0', time=619.00.
> Warning: Vehicle 'flow_1.3' skips stop on lane 'gneE0_0' time=619.00.
> Warning: Vehicle 'flow_1.3' ends teleporting on edge 'gneE1', time 619.00.
> Warning: Teleporting vehicle 'flow_1.4'; waited too long (wrong lane), lane='gneE0_0', time=923.00.
> Warning: Vehicle 'flow_1.4' skips stop on lane 'gneE0_0' time=923.00.
> Warning: Vehicle 'flow_1.4' ends teleporting on edge 'gneE1', time 923.00.
> Warning: Teleporting vehicle 'flow_1.5'; waited too long (wrong lane), lane='gneE0_0', time=1228.00.
> Warning: Vehicle 'flow_1.5' skips stop on lane 'gneE0_0' time=1228.00.
> Warning: Vehicle 'flow_1.5' ends teleporting on edge 'gneE1', time 1228.00.

TEST FAILED on ts-sim-winbuild-ba : demandElements stop stopChargingStation load expected ( Last six runs Jun2020 )

---------- New result in errors ----------
Error: Attribute 'expected' in definition of a stop is empty.
Warning: Teleporting vehicle 'flow_1.2'; waited too long (wrong lane), lane='gneE0_0', time=313.00.
Warning: Vehicle 'flow_1.2' skips stop on lane 'gneE0_0' time=313.00.
Warning: Vehicle 'flow_1.2' skips stop on lane 'gneE0_0' time=313.00.
Warning: Vehicle 'flow_1.2' skips stop on lane 'gneE0_0' time=313.00.
Warning: Vehicle 'flow_1.2' skips stop on lane 'gneE0_0' time=313.00.
Warning: Vehicle 'flow_1.2' ends teleporting on edge 'gneE1', time 313.00.
Warning: Teleporting vehicle 'flow_1.3'; waited too long (wrong lane), lane='gneE0_0', time=619.00.
Warning: Vehicle 'flow_1.3' skips stop on lane 'gneE0_0' time=619.00.
Warning: Vehicle 'flow_1.3' skips stop on lane 'gneE0_0' time=619.00.
Warning: Vehicle 'flow_1.3' skips stop on lane 'gneE0_0' time=619.00.
Warning: Vehicle 'flow_1.3' skips stop on lane 'gneE0_0' time=619.00.
Warning: Vehicle 'flow_1.3' ends teleporting on edge 'gneE1', time 619.00.
Warning: Teleporting vehicle 'flow_1.4'; waited too long (wrong lane), lane='gneE0_0', time=923.00.
Warning: Vehicle 'flow_1.4' skips stop on lane 'gneE0_0' time=923.00.
Warning: Vehicle 'flow_1.4' skips stop on lane 'gneE0_0' time=923.00.
Warning: Vehicle 'flow_1.4' skips stop on lane 'gneE0_0' time=923.00.
Warning: Vehicle 'flow_1.4' skips stop on lane 'gneE0_0' time=923.00.
Warning: Vehicle 'flow_1.4' ends teleporting on edge 'gneE1', time 923.00.
Warning: Teleporting vehicle 'flow_1.5'; waited too long (wrong lane), lane='gneE0_0', time=1228.00.
Warning: Vehicle 'flow_1.5' skips stop on lane 'gneE0_0' time=1228.00.
Warning: Vehicle 'flow_1.5' skips stop on lane 'gneE0_0' time=1228.00.
Warning: Vehicle 'flow_1.5' skips stop on lane 'gneE0_0' time=1228.00.
Warning: Vehicle 'flow_1.5' skips stop on lane 'gneE0_0' time=1228.00.
Warning: Vehicle 'flow_1.5' ends teleporting on edge 'gneE1', time 1228.00.
---------- Missing result in exitcode ----------
1

TEST FAILED on ts-sim-winbuild-ba : demandElements stop stopChargingStation load expectedContainer ( Last six runs Jun2020 )

---------- Differences in errors ----------
2,3d1
< Warning: Vehicle 'flow_1.1' ignores container triggered stop on lane 'gneE0_0' due to capacity constraints.
< Warning: Vehicle 'flow_1.2' ignores container triggered stop on lane 'gneE0_0' due to capacity constraints.
5c3
< Warning: Vehicle 'flow_1.3' ignores container triggered stop on lane 'gneE0_0' due to capacity constraints.
---
> Warning: Vehicle 'flow_1.1' ignores container triggered stop on lane 'gneE0_0' due to capacity constraints.
7d4
< Warning: Vehicle 'flow_1.4' ignores container triggered stop on lane 'gneE0_0' due to capacity constraints.
9,10d5
< Warning: Vehicle 'flow_1.5' ignores container triggered stop on lane 'gneE0_0' due to capacity constraints.
< Warning: Vehicle 'flow_1.6' ignores container triggered stop on lane 'gneE0_0' due to capacity constraints.
12d6
< Warning: Vehicle 'flow_1.7' ignores container triggered stop on lane 'gneE0_0' due to capacity constraints.
14,22d7
< Warning: Vehicle 'flow_1.8' ignores container triggered stop on lane 'gneE0_0' due to capacity constraints.
< Warning: Vehicle 'flow_1.1' ignores container triggered stop on lane 'gneE0_0' due to capacity constraints.
< Warning: Vehicle 'flow_1.9' ignores container triggered stop on lane 'gneE0_0' due to capacity constraints.
< Warning: Vehicle 'flow_1.10' ignores container triggered stop on lane 'gneE0_0' due to capacity constraints.
< Warning: Vehicle 'flow_1.11' ignores container triggered stop on lane 'gneE0_0' due to capacity constraints.
< Warning: Vehicle 'flow_1.2' ignores container triggered stop on lane 'gneE0_0' due to capacity constraints.
< Warning: Vehicle 'flow_1.12' ignores container triggered stop on lane 'gneE0_0' due to capacity constraints.
< Warning: Vehicle 'flow_1.2' ignores container triggered stop on lane 'gneE0_0' due to capacity constraints.
< Warning: Vehicle 'flow_1.13' ignores container triggered stop on lane 'gneE0_0' due to capacity constraints.
24,28c9
< Warning: Vehicle 'flow_1.14' ignores container triggered stop on lane 'gneE0_0' due to capacity constraints.
< Warning: Vehicle 'flow_1.15' ignores container triggered stop on lane 'gneE0_0' due to capacity constraints.
< Warning: Vehicle 'flow_1.16' ignores container triggered stop on lane 'gneE0_0' due to capacity constraints.
< Warning: Vehicle 'flow_1.17' ignores container triggered stop on lane 'gneE0_0' due to capacity constraints.
< Warning: Vehicle 'flow_1.6' ignores container triggered stop on lane 'gneE0_0' due to capacity constraints.
<truncated after showing first 30 lines>

TEST FAILED on ts-sim-winbuild-ba : demandElements stop stopChargingStation load index ( Last six runs Jun2020 )

---------- Differences in errors ----------
0a1,16
> Warning: Teleporting vehicle 'flow_1.2'; waited too long (wrong lane), lane='gneE0_0', time=313.00.
> Warning: Vehicle 'flow_1.2' skips stop on lane 'gneE0_0' time=313.00.
> Warning: Vehicle 'flow_1.2' skips stop on lane 'gneE0_0' time=313.00.
> Warning: Vehicle 'flow_1.2' ends teleporting on edge 'gneE1', time 313.00.
> Warning: Teleporting vehicle 'flow_1.3'; waited too long (wrong lane), lane='gneE0_0', time=619.00.
> Warning: Vehicle 'flow_1.3' skips stop on lane 'gneE0_0' time=619.00.
> Warning: Vehicle 'flow_1.3' skips stop on lane 'gneE0_0' time=619.00.
> Warning: Vehicle 'flow_1.3' ends teleporting on edge 'gneE1', time 619.00.
> Warning: Teleporting vehicle 'flow_1.4'; waited too long (wrong lane), lane='gneE0_0', time=923.00.
> Warning: Vehicle 'flow_1.4' skips stop on lane 'gneE0_0' time=923.00.
> Warning: Vehicle 'flow_1.4' skips stop on lane 'gneE0_0' time=923.00.
> Warning: Vehicle 'flow_1.4' ends teleporting on edge 'gneE1', time 923.00.
> Warning: Teleporting vehicle 'flow_1.5'; waited too long (wrong lane), lane='gneE0_0', time=1228.00.
> Warning: Vehicle 'flow_1.5' skips stop on lane 'gneE0_0' time=1228.00.
> Warning: Vehicle 'flow_1.5' skips stop on lane 'gneE0_0' time=1228.00.
> Warning: Vehicle 'flow_1.5' ends teleporting on edge 'gneE1', time 1228.00.

TEST FAILED on ts-sim-winbuild-ba : demandElements stop stopChargingStation load triggered ( Last six runs Jun2020 )

---------- Differences in errors ----------
0a1,16
> Warning: Teleporting vehicle 'flow_1.2'; waited too long (wrong lane), lane='gneE0_0', time=316.00.
> Warning: Vehicle 'flow_1.2' skips stop on lane 'gneE0_0' time=316.00.
> Warning: Vehicle 'flow_1.2' skips stop on lane 'gneE0_0' time=316.00.
> Warning: Vehicle 'flow_1.2' ends teleporting on edge 'gneE1', time 316.00.
> Warning: Teleporting vehicle 'flow_1.3'; waited too long (wrong lane), lane='gneE0_0', time=620.00.
> Warning: Vehicle 'flow_1.3' skips stop on lane 'gneE0_0' time=620.00.
> Warning: Vehicle 'flow_1.3' skips stop on lane 'gneE0_0' time=620.00.
> Warning: Vehicle 'flow_1.3' ends teleporting on edge 'gneE1', time 620.00.
> Warning: Teleporting vehicle 'flow_1.4'; waited too long (wrong lane), lane='gneE0_0', time=925.00.
> Warning: Vehicle 'flow_1.4' skips stop on lane 'gneE0_0' time=925.00.
> Warning: Vehicle 'flow_1.4' skips stop on lane 'gneE0_0' time=925.00.
> Warning: Vehicle 'flow_1.4' ends teleporting on edge 'gneE1', time 925.00.
> Warning: Teleporting vehicle 'flow_1.5'; waited too long (wrong lane), lane='gneE0_0', time=1230.00.
> Warning: Vehicle 'flow_1.5' skips stop on lane 'gneE0_0' time=1230.00.
> Warning: Vehicle 'flow_1.5' skips stop on lane 'gneE0_0' time=1230.00.
> Warning: Vehicle 'flow_1.5' ends teleporting on edge 'gneE1', time 1230.00.

TEST FAILED on ts-sim-winbuild-ba : demandElements stop stopChargingStation volatileRecomputing ( Last six runs Jun2020 )

---------- Differences in errors ----------
1,45c1,38
< Warning: Teleporting vehicle 'flow_0.15'; waited too long (wrong lane), lane='gneE2_3', time=336.00.
< Warning: Vehicle 'flow_0.15' skips stop on lane 'gneE4_0' time=387.00.
< Warning: Vehicle 'flow_0.15' ends teleporting on edge 'gneE2', time 388.00.
< Warning: Teleporting vehicle 'flow_0.12'; waited too long (wrong lane), lane='gneE2_4', time=464.00.
< Warning: Teleporting vehicle 'flow_0.14'; waited too long (wrong lane), lane='gneE2_4', time=467.00.
< Warning: Teleporting vehicle 'flow_0.11'; waited too long (wrong lane), lane='gneE2_4', time=468.00.
< Warning: Teleporting vehicle 'flow_0.3'; waited too long (jam), lane=':gneJ2_0_0', time=471.00.
< Warning: Vehicle 'flow_0.3' ends teleporting on edge 'gneE2', time 483.00.
< Warning: Vehicle 'flow_0.12' skips stop on lane 'gneE4_0' time=515.00.
< Warning: Vehicle 'flow_0.14' skips stop on lane 'gneE4_0' time=518.00.
< Warning: Vehicle 'flow_0.11' skips stop on lane 'gneE4_0' time=519.00.
< Warning: Vehicle 'flow_0.12' skips stop on lane 'gneE2_5' time=566.00.
< Warning: Vehicle 'flow_0.14' skips stop on lane 'gneE2_5' time=569.00.
< Warning: Vehicle 'flow_0.11' skips stop on lane 'gneE2_5' time=570.00.
< Warning: Vehicle 'flow_0.12' skips stop on lane 'gneE2_4' time=668.00.
< Warning: Vehicle 'flow_0.14' skips stop on lane 'gneE2_4' time=671.00.
< Warning: Vehicle 'flow_0.11' skips stop on lane 'gneE2_4' time=672.00.
< Warning: Teleporting vehicle 'flow_0.10'; waited too long (jam), lane='gneE2_5', time=753.00.
< Warning: Vehicle 'flow_0.11' ends teleporting on edge 'gneE2', time 753.00.
< Warning: Vehicle 'flow_0.12' ends teleporting on edge 'gneE2', time 754.00.
< Warning: Vehicle 'flow_0.14' skips stop on lane 'gneE2_3' time=773.00.
< Warning: Teleporting vehicle 'flow_0.17'; waited too long (wrong lane), lane='gneE2_4', time=781.00.
< Warning: Teleporting vehicle 'flow_0.4'; waited too long (jam), lane=':gneJ2_0_0', time=782.00.
< Warning: Vehicle 'flow_0.4' ends teleporting on edge 'gneE2', time 782.00.
< Warning: Vehicle 'flow_0.10' skips stop on lane 'gneE4_0' time=804.00.
< Warning: Vehicle 'flow_0.17' skips stop on lane 'gneE4_0' time=832.00.
< Warning: Vehicle 'flow_0.10' skips stop on lane 'gneE2_5' time=855.00.
< Warning: Vehicle 'flow_0.14' ends teleporting on edge 'gneE2', time 864.00.
< Warning: Vehicle 'flow_0.17' ends teleporting on edge 'gneE2', time 869.00.
<truncated after showing first 30 lines>

TEST FAILED on ts-sim-winbuild-ba : demandElements stop stopContainerStop create actType ( Last six runs Jun2020 )

---------- Differences in errors ----------
0a1,2
> Warning: Vehicle 'trip' ignores container triggered stop on lane 'gneE1_0' due to capacity constraints.
> Warning: Vehicle 'trip' ignores container triggered stop on lane 'gneE1_0' due to capacity constraints.

TEST FAILED on ts-sim-winbuild-ba : demandElements stop stopContainerStop create containerTrigger ( Last six runs Jun2020 )

---------- Differences in errors ----------
1c1
< Warning: Vehicle 'trip' ignores container triggered stop on lane 'gneE1_0' due to capacity constraints.
---
> Error: Attribute 'expected' in definition of a stop is empty.

TEST FAILED on ts-sim-winbuild-ba : demandElements stop stopContainerStop create parking ( Last six runs Jun2020 )

---------- Differences in errors ----------
0a1,3
> Error: Attribute 'expectedContainers' in definition of a stop is empty.
> Warning: Vehicle 'trip' ignores container triggered stop on lane 'gneE1_0' due to capacity constraints.
> Warning: Vehicle 'trip' ignores container triggered stop on lane 'gneE1_0' due to capacity constraints.

TEST FAILED on ts-sim-winbuild-ba : demandElements stop stopContainerStop load containerTrigger ( Last six runs Jun2020 )

---------- Differences in errors ----------
1d0
< Warning: Vehicle 'trip' ignores container triggered stop on lane 'gneE0_0' due to capacity constraints.

TEST FAILED on ts-sim-winbuild-ba : demandElements stop stopLane create actType ( Last six runs Jun2020 )

---------- Differences in errors ----------
0a1,59
> Warning: Vehicle 'routeFlow.0' ignores container triggered stop on lane 'gneE1_0' due to capacity constraints.
> Warning: Vehicle 'routeFlow.1' ignores container triggered stop on lane 'gneE1_0' due to capacity constraints.
> Warning: Vehicle 'routeFlow.2' ignores container triggered stop on lane 'gneE1_0' due to capacity constraints.
> Warning: Vehicle 'routeFlow.0' ignores container triggered stop on lane 'gneE1_0' due to capacity constraints.
> Warning: Vehicle 'routeFlow.3' ignores container triggered stop on lane 'gneE1_0' due to capacity constraints.
> Warning: Vehicle 'routeFlow.4' ignores container triggered stop on lane 'gneE1_0' due to capacity constraints.
> Warning: Vehicle 'routeFlow.5' ignores container triggered stop on lane 'gneE1_0' due to capacity constraints.
> Warning: Vehicle 'routeFlow.2' ignores container triggered stop on lane 'gneE1_0' due to capacity constraints.
> Warning: Vehicle 'routeFlow.6' ignores container triggered stop on lane 'gneE1_0' due to capacity constraints.
> Warning: Vehicle 'routeFlow.7' ignores container triggered stop on lane 'gneE1_0' due to capacity constraints.
> Warning: Vehicle 'routeFlow.4' ignores container triggered stop on lane 'gneE1_0' due to capacity constraints.
> Warning: Vehicle 'routeFlow.8' ignores container triggered stop on lane 'gneE1_0' due to capacity constraints.
> Warning: Vehicle 'routeFlow.3' ignores container triggered stop on lane 'gneE1_0' due to capacity constraints.
> Warning: Vehicle 'routeFlow.9' ignores container triggered stop on lane 'gneE1_0' due to capacity constraints.
> Warning: Vehicle 'routeFlow.10' ignores container triggered stop on lane 'gneE1_0' due to capacity constraints.
> Warning: Vehicle 'routeFlow.11' ignores container triggered stop on lane 'gneE1_0' due to capacity constraints.
> Warning: Vehicle 'routeFlow.6' ignores container triggered stop on lane 'gneE1_0' due to capacity constraints.
> Warning: Vehicle 'routeFlow.12' ignores container triggered stop on lane 'gneE1_0' due to capacity constraints.
> Warning: Vehicle 'routeFlow.13' ignores container triggered stop on lane 'gneE1_0' due to capacity constraints.
> Warning: Vehicle 'routeFlow.8' ignores container triggered stop on lane 'gneE1_0' due to capacity constraints.
> Warning: Vehicle 'routeFlow.14' ignores container triggered stop on lane 'gneE1_0' due to capacity constraints.
> Warning: Vehicle 'routeFlow.15' ignores container triggered stop on lane 'gneE1_0' due to capacity constraints.
> Warning: Vehicle 'routeFlow.10' ignores container triggered stop on lane 'gneE1_0' due to capacity constraints.
> Warning: Vehicle 'routeFlow.16' ignores container triggered stop on lane 'gneE1_0' due to capacity constraints.
> Warning: Vehicle 'routeFlow.17' ignores container triggered stop on lane 'gneE1_0' due to capacity constraints.
> Warning: Vehicle 'routeFlow.12' ignores container triggered stop on lane 'gneE1_0' due to capacity constraints.
> Warning: Vehicle 'routeFlow.18' ignores container triggered stop on lane 'gneE1_0' due to capacity constraints.
> Warning: Vehicle 'routeFlow.11' ignores container triggered stop on lane 'gneE1_0' due to capacity constraints.
> Warning: Vehicle 'routeFlow.19' ignores container triggered stop on lane 'gneE1_0' due to capacity constraints.
<truncated after showing first 30 lines>

2 TESTS FAILED on ts-sim-winbuild-ba :

---------- Differences in errors ----------
0a1
> Error: Attribute 'expected' in definition of a stop is empty.
demandElements stop stopLane create containerTrigger ( Last six runs Jun2020 )
demandElements stop stopParkingArea create containerTrigger ( Last six runs Jun2020 )

TEST FAILED on ts-sim-winbuild-ba : demandElements stop stopLane create parking ( Last six runs Jun2020 )

---------- Differences in errors ----------
0a1,40
> Warning: Vehicle 'routeFlow.0' ignores container triggered stop on lane 'gneE1_0' due to capacity constraints.
> Warning: Vehicle 'routeFlow.1' ignores container triggered stop on lane 'gneE1_0' due to capacity constraints.
> Warning: Vehicle 'routeFlow.2' ignores container triggered stop on lane 'gneE1_0' due to capacity constraints.
> Warning: Vehicle 'routeFlow.3' ignores container triggered stop on lane 'gneE1_0' due to capacity constraints.
> Warning: Vehicle 'routeFlow.4' ignores container triggered stop on lane 'gneE1_0' due to capacity constraints.
> Warning: Vehicle 'routeFlow.5' ignores container triggered stop on lane 'gneE1_0' due to capacity constraints.
> Warning: Vehicle 'routeFlow.6' ignores container triggered stop on lane 'gneE1_0' due to capacity constraints.
> Warning: Vehicle 'routeFlow.7' ignores container triggered stop on lane 'gneE1_0' due to capacity constraints.
> Warning: Vehicle 'routeFlow.8' ignores container triggered stop on lane 'gneE1_0' due to capacity constraints.
> Warning: Vehicle 'routeFlow.9' ignores container triggered stop on lane 'gneE1_0' due to capacity constraints.
> Warning: Vehicle 'routeFlow.10' ignores container triggered stop on lane 'gneE1_0' due to capacity constraints.
> Warning: Vehicle 'routeFlow.11' ignores container triggered stop on lane 'gneE1_0' due to capacity constraints.
> Warning: Vehicle 'routeFlow.12' ignores container triggered stop on lane 'gneE1_0' due to capacity constraints.
> Warning: Vehicle 'routeFlow.13' ignores container triggered stop on lane 'gneE1_0' due to capacity constraints.
> Warning: Vehicle 'routeFlow.14' ignores container triggered stop on lane 'gneE1_0' due to capacity constraints.
> Warning: Vehicle 'routeFlow.15' ignores container triggered stop on lane 'gneE1_0' due to capacity constraints.
> Warning: Vehicle 'routeFlow.16' ignores container triggered stop on lane 'gneE1_0' due to capacity constraints.
> Warning: Vehicle 'routeFlow.17' ignores container triggered stop on lane 'gneE1_0' due to capacity constraints.
> Warning: Vehicle 'routeFlow.18' ignores container triggered stop on lane 'gneE1_0' due to capacity constraints.
> Warning: Vehicle 'routeFlow.19' ignores container triggered stop on lane 'gneE1_0' due to capacity constraints.
> Warning: Vehicle 'routeFlow.20' ignores container triggered stop on lane 'gneE1_0' due to capacity constraints.
> Warning: Vehicle 'routeFlow.21' ignores container triggered stop on lane 'gneE1_0' due to capacity constraints.
> Warning: Vehicle 'routeFlow.22' ignores container triggered stop on lane 'gneE1_0' due to capacity constraints.
> Warning: Vehicle 'routeFlow.23' ignores container triggered stop on lane 'gneE1_0' due to capacity constraints.
> Warning: Vehicle 'routeFlow.24' ignores container triggered stop on lane 'gneE1_0' due to capacity constraints.
> Warning: Vehicle 'routeFlow.25' ignores container triggered stop on lane 'gneE1_0' due to capacity constraints.
> Warning: Vehicle 'routeFlow.26' ignores container triggered stop on lane 'gneE1_0' due to capacity constraints.
> Warning: Vehicle 'routeFlow.27' ignores container triggered stop on lane 'gneE1_0' due to capacity constraints.
> Warning: Vehicle 'routeFlow.28' ignores container triggered stop on lane 'gneE1_0' due to capacity constraints.
<truncated after showing first 30 lines>

TEST FAILED on ts-sim-winbuild-ba : demandElements stop stopParkingArea create actType ( Last six runs Jun2020 )

---------- Differences in errors ----------
6d5
< Warning: Vehicle 'vehicle_0' skips stop on lane 'gneE1_0' time=314.00.

TEST FAILED on ts-sim-winbuild-ba : demandElements stop stopParkingArea create parking ( Last six runs Jun2020 )

---------- Differences in errors ----------
1c1
< Warning: Stop at parkingarea overrides attribute 'parking' for stop at 'parkingAreaB' in vehicle 'vehicle_0'.
---
> Error: Attribute 'expectedContainers' in definition of a stop is empty.

TEST FAILED on ts-sim-winbuild-ba : demandElements stop stopParkingArea volatileRecomputing ( Last six runs Jun2020 )

---------- Differences in errors ----------
0a1,2
> Error: parkingArea 'parkingAreaH' for vehicle 'vehicle0' on lane 'gneE4_0' is not downstream the current route.
> Quitting (on error).
---------- New result in exitcode ----------
1

TEST FAILED on ts-sim-winbuild-ba : demandElements trip inspect via ( Last six runs Jun2020 )

---------- Differences in errors ----------
0a1,3
> Warning: No connection between edge 'gneE2' and edge 'gneE8' found.
> Error: Vehicle 'trip_0' has no valid route from edge 'gneE2' to stop edge 'gneE8'.
> Quitting (on error).
---------- New result in exitcode ----------
1

TEST FAILED on ts-sim-winbuild-ba : demandElements trip inspect_selection depart float ( Last six runs Jun2020 )

---------- Differences in errors ----------
1,3c1,3
< Error: Vehicle 'tripB' will not be able to depart using the given velocity (junction too close)!
< Warning: Teleporting vehicle 'tripA'; waited too long (jam), lane=':gneJ5_2_0', time=320.00.
< Warning: Vehicle 'tripA' ends teleporting on edge 'gneE4', time 320.00.
---
> Error: Vehicle 'tripB' will not be able to depart using the given velocity (junction 'gneJ6' too close)!
> Warning: Teleporting vehicle 'tripA'; waited too long (jam), lane=':gneJ5_2_0', time=321.00.
> Warning: Vehicle 'tripA' ends teleporting on edge 'gneE4', time 321.00.

TEST FAILED on ts-sim-winbuild-ba : demandElements vehicle inspect_selection depart float ( Last six runs Jun2020 )

---------- Differences in errors ----------
1,2c1,2
< Warning: Teleporting vehicle 'vehicleA'; waited too long (jam), lane=':gneJ5_2_0', time=320.00.
< Warning: Vehicle 'vehicleA' ends teleporting on edge 'gneE4', time 320.00.
---
> Warning: Teleporting vehicle 'vehicleA'; waited too long (jam), lane=':gneJ5_2_0', time=321.00.
> Warning: Vehicle 'vehicleA' ends teleporting on edge 'gneE4', time 321.00.

TEST FAILED on ts-sim-winbuild-ba : demandElements vehicletype load actionStepLength ( Last six runs Jun2020 )

---------- Differences in errors ----------
1a2
> Warning: Action step length '12.00' is used for vehicle type 'vType3' but step-method.ballistic was not set. Setting it now to avoid collisions.

17 TESTS FAILED on ts-sim-winbuild-ba :

---------- Differences in errors ----------
1,9d0
< The number of lanes needs to be specified in the attributes of carFollowing-CC with the "lanesCount" attribute
< Error: The number of lanes needs to be specified in the attributes of carFollowing-CC with the "lanesCount" attribute
< The number of lanes needs to be specified in the attributes of carFollowing-CC with the "lanesCount" attribute
< Error: The number of lanes needs to be specified in the attributes of carFollowing-CC with the "lanesCount" attribute
< The number of lanes needs to be specified in the attributes of carFollowing-CC with the "lanesCount" attribute
< Error: The number of lanes needs to be specified in the attributes of carFollowing-CC with the "lanesCount" attribute
< The number of lanes needs to be specified in the attributes of carFollowing-CC with the "lanesCount" attribute
< Error: The number of lanes needs to be specified in the attributes of carFollowing-CC with the "lanesCount" attribute
< The number of lanes needs to be specified in the attributes of carFollowing-CC with the "lanesCount" attribute
10a2
> Quitting (on error).
---------- New result in exitcode ----------
1
demandElements vehicletype load carfollowingmodel_params cf_cc_c1 ( Last six runs Jun2020 )
demandElements vehicletype load carfollowingmodel_params cf_cc_ccaccel ( Last six runs Jun2020 )
demandElements vehicletype load carfollowingmodel_params cf_cc_ccdecel ( Last six runs Jun2020 )
demandElements vehicletype load carfollowingmodel_params cf_cc_constspacing ( Last six runs Jun2020 )
demandElements vehicletype load carfollowingmodel_params cf_cc_flatbed_d ( Last six runs Jun2020 )
demandElements vehicletype load carfollowingmodel_params cf_cc_flatbed_h ( Last six runs Jun2020 )
demandElements vehicletype load carfollowingmodel_params cf_cc_flatbed_ka ( Last six runs Jun2020 )
demandElements vehicletype load carfollowingmodel_params cf_cc_flatbed_kp ( Last six runs Jun2020 )
demandElements vehicletype load carfollowingmodel_params cf_cc_flatbed_kv ( Last six runs Jun2020 )
demandElements vehicletype load carfollowingmodel_params cf_cc_kp ( Last six runs Jun2020 )
demandElements vehicletype load carfollowingmodel_params cf_cc_lambda ( Last six runs Jun2020 )
demandElements vehicletype load carfollowingmodel_params cf_cc_omegan ( Last six runs Jun2020 )
demandElements vehicletype load carfollowingmodel_params cf_cc_ploeg_h ( Last six runs Jun2020 )
demandElements vehicletype load carfollowingmodel_params cf_cc_ploeg_kd ( Last six runs Jun2020 )
demandElements vehicletype load carfollowingmodel_params cf_cc_ploeg_kp ( Last six runs Jun2020 )
demandElements vehicletype load carfollowingmodel_params cf_cc_tau ( Last six runs Jun2020 )
demandElements vehicletype load carfollowingmodel_params cf_cc_xi ( Last six runs Jun2020 )

TEST FAILED on ts-sim-winbuild-ba : demandElements vehicletype load carfollowingmodel_params cf_cc_lanes_count ( Last six runs Jun2020 )

---------- Differences in errors ----------
1d0
< The number of lanes needs to be specified in the attributes of carFollowing-CC with the "lanesCount" attribute
2a2
> Quitting (on error).
---------- New result in exitcode ----------
1

TEST FAILED on ts-sim-winbuild-ba : shapeElements poi inspect parameters ( Last six runs Jun2020 )

---------- Differences in errors ----------
0a1,2
> Error: File 'net.netedit' is not accessible (No such file or directory).
> Quitting (on error).
---------- New result in exitcode ----------
1

Detailed information for the tests that had known bugs:

TEST had known bugs (#5893) on ts-sim-winbuild-ba : additionalElements access volatileRecomputing ( Last six runs Jun2020 )

See #5893
(This bug was triggered by text found in file 'errors' matching 'Warning: Ignoring invalid access from non-pedestrian lane')
---------- Differences in errors ----------
0a1,9
> Warning: Ignoring invalid access from non-pedestrian lane 'gneE2_1' in busStop 'busStop_gneE1_0_2'.
> Warning: Ignoring invalid access from non-pedestrian lane 'gneE1_1' in busStop 'busStop_gneE1_0_2'.
> Warning: Ignoring invalid access from non-pedestrian lane 'gneE0_1' in busStop 'busStop_gneE1_0_2'.
> Warning: Ignoring invalid access from non-pedestrian lane 'gneE2_3' in busStop 'busStop_gneE2_0_5'.
> Warning: Ignoring invalid access from non-pedestrian lane 'gneE1_1' in busStop 'busStop_gneE2_0_5'.
> Warning: Ignoring invalid access from non-pedestrian lane 'gneE0_1' in busStop 'busStop_gneE2_0_5'.
> Warning: Ignoring invalid access from non-pedestrian lane 'gneE2_3' in busStop 'busStop_gneE4_0_0'.
> Warning: Ignoring invalid access from non-pedestrian lane 'gneE1_1' in busStop 'busStop_gneE4_0_0'.
> Warning: Ignoring invalid access from non-pedestrian lane 'gneE0_1' in busStop 'busStop_gneE4_0_0'.

210 TESTS had known bugs (Test needed #3045) on ts-sim-winbuild-ba :

#3045
(This bug was triggered by text found in file 'errors' matching 'File 'net.netedit' is not accessible')
---------- New result in errors ----------
Error: File 'net.netedit' is not accessible (No such file or directory).
Quitting (on error).
additionalElements busstop create parkingLength ( Last six runs Jun2020 )
additionalElements busstop inspect parkingLength ( Last six runs Jun2020 )
additionalElements busstop inspect_selection parkingLength ( Last six runs Jun2020 )
additionalElements busstop load parkingLength ( Last six runs Jun2020 )
additionalElements calibrator create id ( Last six runs Jun2020 )
additionalElements e2detector create id ( Last six runs Jun2020 )
additionalElements lanecalibrator create id ( Last six runs Jun2020 )
additionalElements parkingarea create id ( Last six runs Jun2020 )
additionalElements routeprobe create id ( Last six runs Jun2020 )
demandElements flow create begin ( Last six runs Jun2020 )
demandElements flow create end ( Last six runs Jun2020 )
demandElements flow create id ( Last six runs Jun2020 )
demandElements flow create number ( Last six runs Jun2020 )
demandElements flow create period ( Last six runs Jun2020 )
demandElements flow create probability ( Last six runs Jun2020 )
demandElements flow create vehsPerHour ( Last six runs Jun2020 )
demandElements flow fix ( Last six runs Jun2020 )
demandElements flow inspect begin ( Last six runs Jun2020 )
demandElements flow inspect end ( Last six runs Jun2020 )
demandElements flow inspect number ( Last six runs Jun2020 )
demandElements flow inspect period ( Last six runs Jun2020 )
demandElements flow inspect probability ( Last six runs Jun2020 )
demandElements flow inspect vehsPerHour ( Last six runs Jun2020 )
demandElements flow inspect_selection begin ( Last six runs Jun2020 )
demandElements flow inspect_selection end ( Last six runs Jun2020 )
demandElements flow inspect_selection number ( Last six runs Jun2020 )
demandElements flow inspect_selection period ( Last six runs Jun2020 )
demandElements flow inspect_selection probability ( Last six runs Jun2020 )
demandElements flow inspect_selection type ( Last six runs Jun2020 )
demandElements flow inspect_selection vehsPerHour ( Last six runs Jun2020 )
demandElements person create id ( Last six runs Jun2020 )
demandElements person fix ( Last six runs Jun2020 )
demandElements person inspect ( Last six runs Jun2020 )
demandElements person inspect_selection ( Last six runs Jun2020 )
demandElements person load ( Last six runs Jun2020 )
demandElements person volatileRecomputing ( Last six runs Jun2020 )
demandElements personFlow create begin ( Last six runs Jun2020 )
demandElements personFlow create end ( Last six runs Jun2020 )
demandElements personFlow create id ( Last six runs Jun2020 )
demandElements personFlow create number ( Last six runs Jun2020 )
demandElements personFlow create period ( Last six runs Jun2020 )
demandElements personFlow create probability ( Last six runs Jun2020 )
demandElements personFlow create vehsPerHour ( Last six runs Jun2020 )
demandElements personFlow fix ( Last six runs Jun2020 )
demandElements personFlow inspect ( Last six runs Jun2020 )
demandElements personFlow inspect_selection ( Last six runs Jun2020 )
demandElements personFlow load ( Last six runs Jun2020 )
demandElements personFlow volatileRecomputing ( Last six runs Jun2020 )
demandElements route create_consecutive id ( Last six runs Jun2020 )
demandElements route create_nonconsecutive id ( Last six runs Jun2020 )
demandElements routeflow create begin ( Last six runs Jun2020 )
demandElements routeflow create end ( Last six runs Jun2020 )
demandElements routeflow create id ( Last six runs Jun2020 )
demandElements routeflow create number ( Last six runs Jun2020 )
demandElements routeflow create period ( Last six runs Jun2020 )
demandElements routeflow create probability ( Last six runs Jun2020 )
demandElements routeflow create vehsPerHour ( Last six runs Jun2020 )
demandElements routeflow fix ( Last six runs Jun2020 )
demandElements routeflow inspect begin ( Last six runs Jun2020 )
demandElements routeflow inspect end ( Last six runs Jun2020 )
demandElements routeflow inspect number ( Last six runs Jun2020 )
demandElements routeflow inspect period ( Last six runs Jun2020 )
demandElements routeflow inspect probability ( Last six runs Jun2020 )
demandElements routeflow inspect vehsPerHour ( Last six runs Jun2020 )
demandElements routeflow inspect_selection begin ( Last six runs Jun2020 )
demandElements routeflow inspect_selection end ( Last six runs Jun2020 )
demandElements routeflow inspect_selection number ( Last six runs Jun2020 )
demandElements routeflow inspect_selection period ( Last six runs Jun2020 )
demandElements routeflow inspect_selection probability ( Last six runs Jun2020 )
demandElements routeflow inspect_selection type ( Last six runs Jun2020 )
demandElements routeflow inspect_selection vehsPerHour ( Last six runs Jun2020 )
demandElements stop stopLane inspect endPos ( Last six runs Jun2020 )
demandElements stop stopLane inspect startPos ( Last six runs Jun2020 )
demandElements trip create id ( Last six runs Jun2020 )
demandElements trip fix ( Last six runs Jun2020 )
demandElements trip inspect_selection type ( Last six runs Jun2020 )
demandElements vehicle create id ( Last six runs Jun2020 )
demandElements vehicle fix ( Last six runs Jun2020 )
demandElements vehicle inspect_selection type ( Last six runs Jun2020 )
demandElements vehicletype copy ( Last six runs Jun2020 )
demandElements vehicletype create basic accel ( Last six runs Jun2020 )
demandElements vehicletype create basic color ( Last six runs Jun2020 )
demandElements vehicletype create basic decel ( Last six runs Jun2020 )
demandElements vehicletype create basic default ( Last six runs Jun2020 )
demandElements vehicletype create basic id ( Last six runs Jun2020 )
demandElements vehicletype create basic length ( Last six runs Jun2020 )
demandElements vehicletype create basic maxspeed ( Last six runs Jun2020 )
demandElements vehicletype create basic mingap ( Last six runs Jun2020 )
demandElements vehicletype create basic sigma ( Last six runs Jun2020 )
demandElements vehicletype create basic tau ( Last six runs Jun2020 )
demandElements vehicletype create basic vclass ( Last six runs Jun2020 )
demandElements vehicletype create dialog actionStepLength ( Last six runs Jun2020 )
demandElements vehicletype create dialog boardingduration ( Last six runs Jun2020 )
demandElements vehicletype create dialog carfollowingmodel ( Last six runs Jun2020 )
demandElements vehicletype create dialog carfollowingmodel_params accel ( Last six runs Jun2020 )
demandElements vehicletype create dialog carfollowingmodel_params apparentdecel ( Last six runs Jun2020 )
demandElements vehicletype create dialog carfollowingmodel_params ca_gain_gap_cacc ( Last six runs Jun2020 )
demandElements vehicletype create dialog carfollowingmodel_params ca_gain_gap_dot_cacc ( Last six runs Jun2020 )
demandElements vehicletype create dialog carfollowingmodel_params ca_gain_space ( Last six runs Jun2020 )
demandElements vehicletype create dialog carfollowingmodel_params ca_gain_speed ( Last six runs Jun2020 )
demandElements vehicletype create dialog carfollowingmodel_params cf_cc_c1 ( Last six runs Jun2020 )
demandElements vehicletype create dialog carfollowingmodel_params cf_cc_ccaccel ( Last six runs Jun2020 )
demandElements vehicletype create dialog carfollowingmodel_params cf_cc_ccdecel ( Last six runs Jun2020 )
demandElements vehicletype create dialog carfollowingmodel_params cf_cc_constspacing ( Last six runs Jun2020 )
demandElements vehicletype create dialog carfollowingmodel_params cf_cc_flatbed_d ( Last six runs Jun2020 )
demandElements vehicletype create dialog carfollowingmodel_params cf_cc_flatbed_h ( Last six runs Jun2020 )
demandElements vehicletype create dialog carfollowingmodel_params cf_cc_flatbed_ka ( Last six runs Jun2020 )
demandElements vehicletype create dialog carfollowingmodel_params cf_cc_flatbed_kp ( Last six runs Jun2020 )
demandElements vehicletype create dialog carfollowingmodel_params cf_cc_flatbed_kv ( Last six runs Jun2020 )
demandElements vehicletype create dialog carfollowingmodel_params cf_cc_kp ( Last six runs Jun2020 )
demandElements vehicletype create dialog carfollowingmodel_params cf_cc_lambda ( Last six runs Jun2020 )
demandElements vehicletype create dialog carfollowingmodel_params cf_cc_lanes_count ( Last six runs Jun2020 )
demandElements vehicletype create dialog carfollowingmodel_params cf_cc_omegan ( Last six runs Jun2020 )
demandElements vehicletype create dialog carfollowingmodel_params cf_cc_ploeg_h ( Last six runs Jun2020 )
demandElements vehicletype create dialog carfollowingmodel_params cf_cc_ploeg_kd ( Last six runs Jun2020 )
demandElements vehicletype create dialog carfollowingmodel_params cf_cc_ploeg_kp ( Last six runs Jun2020 )
demandElements vehicletype create dialog carfollowingmodel_params cf_cc_tau ( Last six runs Jun2020 )
demandElements vehicletype create dialog carfollowingmodel_params cf_cc_xi ( Last six runs Jun2020 )
demandElements vehicletype create dialog carfollowingmodel_params cf_idm_delta ( Last six runs Jun2020 )
demandElements vehicletype create dialog carfollowingmodel_params cf_idm_stepping ( Last six runs Jun2020 )
demandElements vehicletype create dialog carfollowingmodel_params cf_idmm_adapt_factor ( Last six runs Jun2020 )
demandElements vehicletype create dialog carfollowingmodel_params cf_idmm_adapt_time ( Last six runs Jun2020 )
demandElements vehicletype create dialog carfollowingmodel_params cf_kerner_phi ( Last six runs Jun2020 )
demandElements vehicletype create dialog carfollowingmodel_params cf_pwagner2009_approb ( Last six runs Jun2020 )
demandElements vehicletype create dialog carfollowingmodel_params cf_pwagner2009_taulast ( Last six runs Jun2020 )
demandElements vehicletype create dialog carfollowingmodel_params cf_w99_cc1 ( Last six runs Jun2020 )
demandElements vehicletype create dialog carfollowingmodel_params cf_w99_cc2 ( Last six runs Jun2020 )
demandElements vehicletype create dialog carfollowingmodel_params cf_w99_cc3 ( Last six runs Jun2020 )
demandElements vehicletype create dialog carfollowingmodel_params cf_w99_cc4 ( Last six runs Jun2020 )
demandElements vehicletype create dialog carfollowingmodel_params cf_w99_cc5 ( Last six runs Jun2020 )
demandElements vehicletype create dialog carfollowingmodel_params cf_w99_cc6 ( Last six runs Jun2020 )
demandElements vehicletype create dialog carfollowingmodel_params cf_w99_cc7 ( Last six runs Jun2020 )
demandElements vehicletype create dialog carfollowingmodel_params cf_w99_cc8 ( Last six runs Jun2020 )
demandElements vehicletype create dialog carfollowingmodel_params cf_w99_cc9 ( Last six runs Jun2020 )
demandElements vehicletype create dialog carfollowingmodel_params cf_wiedemann_estimation ( Last six runs Jun2020 )
demandElements vehicletype create dialog carfollowingmodel_params cf_wiedemann_security ( Last six runs Jun2020 )
demandElements vehicletype create dialog carfollowingmodel_params collision_mingap_factor ( Last six runs Jun2020 )
demandElements vehicletype create dialog carfollowingmodel_params decel ( Last six runs Jun2020 )
demandElements vehicletype create dialog carfollowingmodel_params emergencydecel ( Last six runs Jun2020 )
demandElements vehicletype create dialog carfollowingmodel_params gc_gain_gap_cacc ( Last six runs Jun2020 )
demandElements vehicletype create dialog carfollowingmodel_params gc_gain_gap_dot_cacc ( Last six runs Jun2020 )
demandElements vehicletype create dialog carfollowingmodel_params gc_gain_space ( Last six runs Jun2020 )
demandElements vehicletype create dialog carfollowingmodel_params gc_gain_speed ( Last six runs Jun2020 )
demandElements vehicletype create dialog carfollowingmodel_params gcc_gain_gap_cacc ( Last six runs Jun2020 )
demandElements vehicletype create dialog carfollowingmodel_params gcc_gain_gap_dot_cacc ( Last six runs Jun2020 )
demandElements vehicletype create dialog carfollowingmodel_params gcc_gain_space ( Last six runs Jun2020 )
demandElements vehicletype create dialog carfollowingmodel_params gcc_gain_speed ( Last six runs Jun2020 )
demandElements vehicletype create dialog carfollowingmodel_params headway_time_cacc_to_acc ( Last six runs Jun2020 )
demandElements vehicletype create dialog carfollowingmodel_params k ( Last six runs Jun2020 )
demandElements vehicletype create dialog carfollowingmodel_params sc_gain ( Last six runs Jun2020 )
demandElements vehicletype create dialog carfollowingmodel_params sc_gain_cacc ( Last six runs Jun2020 )
demandElements vehicletype create dialog carfollowingmodel_params sigma ( Last six runs Jun2020 )
demandElements vehicletype create dialog carfollowingmodel_params tau ( Last six runs Jun2020 )
demandElements vehicletype create dialog carfollowingmodel_params tmp1 ( Last six runs Jun2020 )
demandElements vehicletype create dialog carfollowingmodel_params tmp2 ( Last six runs Jun2020 )
demandElements vehicletype create dialog carfollowingmodel_params tmp3 ( Last six runs Jun2020 )
demandElements vehicletype create dialog carfollowingmodel_params tmp4 ( Last six runs Jun2020 )
demandElements vehicletype create dialog carfollowingmodel_params tmp5 ( Last six runs Jun2020 )
demandElements vehicletype create dialog carfollowingmodel_params train_type ( Last six runs Jun2020 )
demandElements vehicletype create dialog color ( Last six runs Jun2020 )
demandElements vehicletype create dialog containercapacity ( Last six runs Jun2020 )
demandElements vehicletype create dialog default ( Last six runs Jun2020 )
demandElements vehicletype create dialog emissionclass ( Last six runs Jun2020 )
demandElements vehicletype create dialog guishape ( Last six runs Jun2020 )
demandElements vehicletype create dialog id ( Last six runs Jun2020 )
demandElements vehicletype create dialog imgfile ( Last six runs Jun2020 )
demandElements vehicletype create dialog impatience ( Last six runs Jun2020 )
demandElements vehicletype create dialog junctionmodel_params jm_crossing_gap ( Last six runs Jun2020 )
demandElements vehicletype create dialog junctionmodel_params jm_drive_after_red_time ( Last six runs Jun2020 )
demandElements vehicletype create dialog junctionmodel_params jm_drive_after_yellow_time ( Last six runs Jun2020 )
demandElements vehicletype create dialog junctionmodel_params jm_drive_red_speed ( Last six runs Jun2020 )
demandElements vehicletype create dialog junctionmodel_params jm_ignore_foe_prob ( Last six runs Jun2020 )
demandElements vehicletype create dialog junctionmodel_params jm_ignore_foe_speed ( Last six runs Jun2020 )
demandElements vehicletype create dialog junctionmodel_params jm_ignore_keep_clear_time ( Last six runs Jun2020 )
demandElements vehicletype create dialog junctionmodel_params jm_sigma_minor ( Last six runs Jun2020 )
demandElements vehicletype create dialog junctionmodel_params jm_timegap_minor ( Last six runs Jun2020 )
demandElements vehicletype create dialog lanechangemodel ( Last six runs Jun2020 )
demandElements vehicletype create dialog lanechangemodel_params lc_accel_lat ( Last six runs Jun2020 )
demandElements vehicletype create dialog lanechangemodel_params lc_assertive ( Last six runs Jun2020 )
demandElements vehicletype create dialog lanechangemodel_params lc_cooperative ( Last six runs Jun2020 )
demandElements vehicletype create dialog lanechangemodel_params lc_impatience ( Last six runs Jun2020 )
demandElements vehicletype create dialog lanechangemodel_params lc_keep_right ( Last six runs Jun2020 )
demandElements vehicletype create dialog lanechangemodel_params lc_lookahead_left ( Last six runs Jun2020 )
demandElements vehicletype create dialog lanechangemodel_params lc_max_speed_lat_factor ( Last six runs Jun2020 )
demandElements vehicletype create dialog lanechangemodel_params lc_max_speed_lat_standing ( Last six runs Jun2020 )
demandElements vehicletype create dialog lanechangemodel_params lc_opposite ( Last six runs Jun2020 )
demandElements vehicletype create dialog lanechangemodel_params lc_overtake_right ( Last six runs Jun2020 )
demandElements vehicletype create dialog lanechangemodel_params lc_pushy ( Last six runs Jun2020 )
demandElements vehicletype create dialog lanechangemodel_params lc_pushy_gap ( Last six runs Jun2020 )
demandElements vehicletype create dialog lanechangemodel_params lc_speed_gain ( Last six runs Jun2020 )
demandElements vehicletype create dialog lanechangemodel_params lc_speed_gain_right ( Last six runs Jun2020 )
demandElements vehicletype create dialog lanechangemodel_params lc_strategic ( Last six runs Jun2020 )
demandElements vehicletype create dialog lanechangemodel_params lc_sublane ( Last six runs Jun2020 )
demandElements vehicletype create dialog lanechangemodel_params lc_time_to_impatience ( Last six runs Jun2020 )
demandElements vehicletype create dialog lanechangemodel_params lc_turn_alignment_distance ( Last six runs Jun2020 )
demandElements vehicletype create dialog latalignment ( Last six runs Jun2020 )
demandElements vehicletype create dialog length ( Last six runs Jun2020 )
demandElements vehicletype create dialog loadingduration ( Last six runs Jun2020 )
demandElements vehicletype create dialog maxspeed ( Last six runs Jun2020 )
demandElements vehicletype create dialog maxspeedlat ( Last six runs Jun2020 )
demandElements vehicletype create dialog mingap ( Last six runs Jun2020 )
demandElements vehicletype create dialog mingaplat ( Last six runs Jun2020 )
demandElements vehicletype create dialog osgfile ( Last six runs Jun2020 )
demandElements vehicletype create dialog personcapacity ( Last six runs Jun2020 )
demandElements vehicletype create dialog speeddev ( Last six runs Jun2020 )
demandElements vehicletype create dialog speedfactor ( Last six runs Jun2020 )
demandElements vehicletype create dialog vclass ( Last six runs Jun2020 )
demandElements vehicletype create dialog width ( Last six runs Jun2020 )
netElements edges templates ( Last six runs Jun2020 )
selection basic contextual_menu ( Last six runs Jun2020 )

TEST had known bugs (Routeprobes #5941) on ts-sim-winbuild-ba : additionalElements calibrator inspect routeprobe ( Last six runs Jun2020 )

#5941
(This bug was triggered by text found in file 'errors' matching 'is not known')
---------- Differences in errors ----------
1c1,2
< Warning: No flow intervals in calibrator 'calibrator_gneE2_0'.
---
> Error: The routeProbe 'customRouteProbeName' to use within the calibrator 'calibrator_gneE2_0' is not known.
> Quitting (on error).
---------- New result in exitcode ----------
1

TEST had known bugs (Routeprobes #5941) on ts-sim-winbuild-ba : additionalElements calibrator load routeProbe ( Last six runs Jun2020 )

#5941
(This bug was triggered by text found in file 'errors' matching 'is not known')
---------- Differences in errors ----------
1c1
< Warning: No flow intervals in calibrator 'calibrator01'.
---
> Error: The routeProbe '%%$%$$$' to use within the calibrator 'calibrator01' is not known.
3a4
> Quitting (on error).
---------- New result in exitcode ----------
1

TEST had known bugs (Routeprobes #5941) on ts-sim-winbuild-ba : additionalElements lanecalibrator inspect routeprobe ( Last six runs Jun2020 )

#5941
(This bug was triggered by text found in file 'errors' matching 'is not known')
---------- Differences in errors ----------
1c1,2
< Warning: No flow intervals in calibrator 'laneCalibrator_gneE2_1_0'.
---
> Error: The routeProbe 'customRouteProbeName' to use within the calibrator 'laneCalibrator_gneE3_1_0' is not known.
> Quitting (on error).
---------- New result in exitcode ----------
1

TEST had known bugs (Routeprobes #5941) on ts-sim-winbuild-ba : additionalElements lanecalibrator load routeProbe ( Last six runs Jun2020 )

#5941
(This bug was triggered by text found in file 'errors' matching 'is not known')
---------- Differences in errors ----------
1c1
< Warning: No flow intervals in calibrator 'calibrator01'.
---
> Error: The routeProbe '%%$%$$$' to use within the calibrator 'calibrator01' is not known.
3c3,4
< Warning: No flow intervals in calibrator 'calibrator03'.
---
> Error: The routeProbe 'myRouteProbe' to use within the calibrator 'calibrator03' is not known.
> Quitting (on error).
---------- New result in exitcode ----------
1

TEST had known bugs (#5875) on ts-sim-winbuild-ba : demandElements routeflow load line ( Last six runs Jun2020 )

See #5875
(This bug was triggered by text found in file 'errors' matching 'Error: Attribute 'line' in definition of flow 'flow_1' is empty')
---------- Differences in errors ----------
0a1
> Error: Attribute 'line' in definition of flow 'flow_1' is empty.

Detailed information for the tests that were terminated before completion:

TEST were terminated before completion (TIMEOUT) on ts-sim-winbuild-ba : netElements junctions inspect type internal ( Last six runs Jun2020 )

Test exceeded wallclock time limit of 600.0 seconds
---------- Differences in errors ----------
0a1
> Assertion failed: specialLane->getLinkCont().size() == 1, file C:\Users\delphi\Code\sumo\git\src\microsim\MSInternalJunction.cpp, line 59

TEST were terminated before completion (TIMEOUT) on ts-sim-winbuild-ba : netElements junctions inspect_selected type rail_signal ( Last six runs Jun2020 )

Test exceeded wallclock time limit of 600.0 seconds
---------- Differences in errors ----------
1,2c1
< Warning: Found circular block after railSignal junction 'Center', link 16 (0 edges, length 12.80)
< Warning: Found circular block after railSignal junction 'Center', link 17 (0 edges, length 12.80)
---
> Assertion failed: myLanes.size() > 0, file C:\Users\delphi\Code\sumo\git\src\microsim\traffic_lights\MSRailSignal.cpp, line 95