10Apr21rv1_8_0+2048-05c87afc33 - detailed test results for NETEDITCHECKOUTPUT

To reconnect the TextTest GUI to these results, run:

texttest.pyw -a neteditcheckoutput -d C:/Users/delphi/Code/sumo/git/tests -reconnect C:/Users/delphi/Code/sumo/msvc12x64Dtexttesttmp/msvc12x64D.13Apr041538.2676 -g

To start TextTest for these tests, run:

texttest.pyw -a neteditcheckoutput -d C:/Users/delphi/Code/sumo/git/tests


default: 2792 tests: 2486 succeeded 235 known bugs 64 FAILED 7 killed

Detailed information for the tests that FAILED:

TEST FAILED on ts-sim-winbuild-ba : additionalElements busstop create parkingLength ( Last six runs Apr2021 )

---------- Differences in errors ----------
0a1,5
> Error: value '-7.50' must be greater than or equal to minInclusive facet value '0'
>  In file 'additionals.netedit'
>  At line/column 61/107.
> 
> Quitting (on error).
---------- New result in exitcode ----------
1

3 TESTS FAILED on ts-sim-winbuild-ba :

---------- Differences in errors ----------
0a1,5
> Error: value '-15.00' must be greater than or equal to minInclusive facet value '0'
>  In file 'additionals.netedit'
>  At line/column 66/153.
> 
> Quitting (on error).
---------- New result in exitcode ----------
1
additionalElements busstop inspect_selection blockmove ( Last six runs Apr2021 )
additionalElements busstop inspect_selection parameters ( Last six runs Apr2021 )
additionalElements busstop inspect_selection personcapacity ( Last six runs Apr2021 )

TEST FAILED on ts-sim-winbuild-ba : additionalElements busstop inspect_selection friendlypos ( Last six runs Apr2021 )

---------- Differences in errors ----------
0a1,5
> Error: value '-15.00' must be greater than or equal to minInclusive facet value '0'
>  In file 'additionals.netedit'
>  At line/column 66/169.
> 
> Quitting (on error).
---------- New result in exitcode ----------
1

2 TESTS FAILED on ts-sim-winbuild-ba :

---------- Differences in errors ----------
0a1,5
> Error: value '-15.00' must be greater than or equal to minInclusive facet value '0'
>  In file 'additionals.netedit'
>  At line/column 66/165.
> 
> Quitting (on error).
---------- New result in exitcode ----------
1
additionalElements busstop inspect_selection lines ( Last six runs Apr2021 )
additionalElements busstop inspect_selection name ( Last six runs Apr2021 )

TEST FAILED on ts-sim-winbuild-ba : additionalElements busstop load parkingLength ( Last six runs Apr2021 )

---------- Differences in errors ----------
0a1,5
> Error: value '-7.00' must be greater than or equal to minInclusive facet value '0'
>  In file 'additionals.netedit'
>  At line/column 64/115.
> 
> Quitting (on error).
---------- New result in exitcode ----------
1

TEST FAILED on ts-sim-winbuild-ba : additionalElements e1InstantDetector volatileRecomputing ( Last six runs Apr2021 )

---------- Differences in errors ----------
0a1,7
> Error: The lane with the id 'gneE2_1' is not known (while building instantInductionLoop 'instantInductionLoop_gneE2_0_0').
> Error: The lane with the id 'gneE2_2' is not known (while building instantInductionLoop 'instantInductionLoop_gneE2_1_1').
> Error: The lane with the id 'gneE2_3' is not known (while building instantInductionLoop 'instantInductionLoop_gneE2_2_2').
> Error: The lane with the id 'gneE2_4' is not known (while building instantInductionLoop 'instantInductionLoop_gneE2_3_3').
> Error: The lane with the id 'gneE2_5' is not known (while building instantInductionLoop 'instantInductionLoop_gneE2_4_4').
> Error: The lane with the id 'gneE4_0' is not known (while building instantInductionLoop 'instantInductionLoop_gneE4_0_5').
> Quitting (on error).
---------- New result in exitcode ----------
1

TEST FAILED on ts-sim-winbuild-ba : additionalElements e2MultiLaneDetector inspect file ( Last six runs Apr2021 )

---------- Differences in errors ----------
0a1,2
> Error: Attribute 'file' in definition of e2Detector 'e2MultilaneDetector_0' is empty.
> Quitting (on error).
---------- New result in exitcode ----------
1

TEST FAILED on ts-sim-winbuild-ba : additionalElements e2MultiLaneDetector inspect freq ( Last six runs Apr2021 )

---------- Differences in errors ----------
0a1,2
> Error: The tls '120' is not known.
> Quitting (on error).
---------- New result in exitcode ----------
1

TEST FAILED on ts-sim-winbuild-ba : additionalElements e2MultiLaneDetector load freq ( Last six runs Apr2021 )

---------- Differences in errors ----------
1c1,5
< Warning: The given time value 12.50 is not a multiple of the step length 1.00 (in e2Detector 'e2MultilaneDetector_3').
---
> Error: invalid character encountered
>  In file 'additionals.netedit'
>  At line/column 63/146.
> 
> Quitting (on error).
---------- New result in exitcode ----------
1

9 TESTS FAILED on ts-sim-winbuild-ba :

---------- Differences in errors ----------
0a1,2
> Error: File 'additionals.netedit' is not accessible (No such file or directory).
> Quitting (on error).
---------- New result in exitcode ----------
1
bugs processing ticket3071 ( Last six runs Apr2021 )
demandElements person create color ( Last six runs Apr2021 )
demandElements person create default_trip default_trip_fromto ( Last six runs Apr2021 )
demandElements person create default_walk default_walk_fromto ( Last six runs Apr2021 )
demandElements person create default_walk default_walk_route ( Last six runs Apr2021 )
demandElements personFlow create color ( Last six runs Apr2021 )
demandElements personFlow create default_trip default_trip_fromto ( Last six runs Apr2021 )
demandElements personFlow create default_walk default_walk_fromto ( Last six runs Apr2021 )
volatileRecomputing abort-recomputing ( Last six runs Apr2021 )

2 TESTS FAILED on ts-sim-winbuild-ba :

---------- Differences in output ----------
1d0
< Loading configuration ... done.
---------- New result in errors ----------
Error: Could not access configuration 'sumo.sumocfg'.
Quitting (on error).
bugs ticket4528 ( Last six runs Apr2021 )
bugs ticket5540 ( Last six runs Apr2021 )

TEST FAILED on ts-sim-winbuild-ba : demandElements flow inspect from ( Last six runs Apr2021 )

---------- Differences in errors ----------
0a1,4
> Warning: No connection between edge 'gneE8' and edge 'gneE5' found.
> Warning: No route for vehicle 'flow_0.0' found.
> Error: Vehicle 'flow_0.0' has no valid route.
> Quitting (on error).
---------- New result in exitcode ----------
1

TEST FAILED on ts-sim-winbuild-ba : demandElements flow inspect via ( Last six runs Apr2021 )

---------- Differences in errors ----------
0a1,3
> Warning: No connection between edge 'gneE2' and edge 'gneE8' found.
> Error: Vehicle 'flow_0.0' has no valid route from edge 'gneE2' to stop edge 'gneE8'.
> Quitting (on error).
---------- New result in exitcode ----------
1

TEST FAILED on ts-sim-winbuild-ba : demandElements flow_embedded create default_continuous ( Last six runs Apr2021 )

---------- Differences in errors ----------
0a1,2
> Error: Vehicle 'flow_0.0' has no valid route. No connection between edge 'gneE4' and edge 'gneE4'.
> Quitting (on error).
---------- New result in exitcode ----------
1

TEST FAILED on ts-sim-winbuild-ba : demandElements flow_embedded load route ( Last six runs Apr2021 )

---------- Differences in errors ----------
0a1,2
> Error: Vehicle 'vehicle_2.0' has no valid route. No connection between edge 'gneE2' and edge 'gneE5'.
> Quitting (on error).
---------- New result in exitcode ----------
1

TEST FAILED on ts-sim-winbuild-ba : demandElements person create default_ride default_ride_busstop ( Last six runs Apr2021 )

---------- Differences in errors ----------
1c1,5
< Warning: Person 'person_0' aborted waiting for ANY at busStop 'busStop'.
---
> Error: missing required attribute 'lines'
>  In file 'routes.netedit'
>  At line/column 59/47.
> 
> Quitting (on error).
---------- New result in exitcode ----------
1

TEST FAILED on ts-sim-winbuild-ba : demandElements person create default_ride default_ride_fromto ( Last six runs Apr2021 )

---------- Differences in errors ----------
1c1,2
< Warning: Person 'person_0' aborted waiting for ANY at edge 'gneE2'.
---
> Error: File 'additionals.netedit' is not accessible (No such file or directory).
> Quitting (on error).
---------- New result in exitcode ----------
1

TEST FAILED on ts-sim-winbuild-ba : demandElements personFlow create default_ride default_ride_busstop ( Last six runs Apr2021 )

---------- Differences in errors ----------
1,1800c1,5
< Warning: Person 'personFlow_0.0' aborted waiting for ANY at busStop 'busStop'.
< Warning: Person 'personFlow_0.1' aborted waiting for ANY at busStop 'busStop'.
< Warning: Person 'personFlow_0.2' aborted waiting for ANY at busStop 'busStop'.
< Warning: Person 'personFlow_0.3' aborted waiting for ANY at busStop 'busStop'.
< Warning: Person 'personFlow_0.4' aborted waiting for ANY at busStop 'busStop'.
< Warning: Person 'personFlow_0.5' aborted waiting for ANY at busStop 'busStop'.
< Warning: Person 'personFlow_0.6' aborted waiting for ANY at busStop 'busStop'.
< Warning: Person 'personFlow_0.7' aborted waiting for ANY at busStop 'busStop'.
< Warning: Person 'personFlow_0.8' aborted waiting for ANY at busStop 'busStop'.
< Warning: Person 'personFlow_0.9' aborted waiting for ANY at busStop 'busStop'.
< Warning: Person 'personFlow_0.10' aborted waiting for ANY at busStop 'busStop'.
< Warning: Person 'personFlow_0.11' aborted waiting for ANY at busStop 'busStop'.
< Warning: Person 'personFlow_0.12' aborted waiting for ANY at busStop 'busStop'.
< Warning: Person 'personFlow_0.13' aborted waiting for ANY at busStop 'busStop'.
< Warning: Person 'personFlow_0.14' aborted waiting for ANY at busStop 'busStop'.
< Warning: Person 'personFlow_0.15' aborted waiting for ANY at busStop 'busStop'.
< Warning: Person 'personFlow_0.16' aborted waiting for ANY at busStop 'busStop'.
< Warning: Person 'personFlow_0.17' aborted waiting for ANY at busStop 'busStop'.
< Warning: Person 'personFlow_0.18' aborted waiting for ANY at busStop 'busStop'.
< Warning: Person 'personFlow_0.19' aborted waiting for ANY at busStop 'busStop'.
< Warning: Person 'personFlow_0.20' aborted waiting for ANY at busStop 'busStop'.
< Warning: Person 'personFlow_0.21' aborted waiting for ANY at busStop 'busStop'.
< Warning: Person 'personFlow_0.22' aborted waiting for ANY at busStop 'busStop'.
< Warning: Person 'personFlow_0.23' aborted waiting for ANY at busStop 'busStop'.
< Warning: Person 'personFlow_0.24' aborted waiting for ANY at busStop 'busStop'.
< Warning: Person 'personFlow_0.25' aborted waiting for ANY at busStop 'busStop'.
< Warning: Person 'personFlow_0.26' aborted waiting for ANY at busStop 'busStop'.
< Warning: Person 'personFlow_0.27' aborted waiting for ANY at busStop 'busStop'.
< Warning: Person 'personFlow_0.28' aborted waiting for ANY at busStop 'busStop'.
<truncated after showing first 30 lines>
---------- New result in exitcode ----------
1

TEST FAILED on ts-sim-winbuild-ba : demandElements personFlow create default_ride default_ride_fromto ( Last six runs Apr2021 )

---------- Differences in errors ----------
1,1800c1,2
< Warning: Person 'personFlow_0.0' aborted waiting for ANY at edge 'gneE2'.
< Warning: Person 'personFlow_0.1' aborted waiting for ANY at edge 'gneE2'.
< Warning: Person 'personFlow_0.2' aborted waiting for ANY at edge 'gneE2'.
< Warning: Person 'personFlow_0.3' aborted waiting for ANY at edge 'gneE2'.
< Warning: Person 'personFlow_0.4' aborted waiting for ANY at edge 'gneE2'.
< Warning: Person 'personFlow_0.5' aborted waiting for ANY at edge 'gneE2'.
< Warning: Person 'personFlow_0.6' aborted waiting for ANY at edge 'gneE2'.
< Warning: Person 'personFlow_0.7' aborted waiting for ANY at edge 'gneE2'.
< Warning: Person 'personFlow_0.8' aborted waiting for ANY at edge 'gneE2'.
< Warning: Person 'personFlow_0.9' aborted waiting for ANY at edge 'gneE2'.
< Warning: Person 'personFlow_0.10' aborted waiting for ANY at edge 'gneE2'.
< Warning: Person 'personFlow_0.11' aborted waiting for ANY at edge 'gneE2'.
< Warning: Person 'personFlow_0.12' aborted waiting for ANY at edge 'gneE2'.
< Warning: Person 'personFlow_0.13' aborted waiting for ANY at edge 'gneE2'.
< Warning: Person 'personFlow_0.14' aborted waiting for ANY at edge 'gneE2'.
< Warning: Person 'personFlow_0.15' aborted waiting for ANY at edge 'gneE2'.
< Warning: Person 'personFlow_0.16' aborted waiting for ANY at edge 'gneE2'.
< Warning: Person 'personFlow_0.17' aborted waiting for ANY at edge 'gneE2'.
< Warning: Person 'personFlow_0.18' aborted waiting for ANY at edge 'gneE2'.
< Warning: Person 'personFlow_0.19' aborted waiting for ANY at edge 'gneE2'.
< Warning: Person 'personFlow_0.20' aborted waiting for ANY at edge 'gneE2'.
< Warning: Person 'personFlow_0.21' aborted waiting for ANY at edge 'gneE2'.
< Warning: Person 'personFlow_0.22' aborted waiting for ANY at edge 'gneE2'.
< Warning: Person 'personFlow_0.23' aborted waiting for ANY at edge 'gneE2'.
< Warning: Person 'personFlow_0.24' aborted waiting for ANY at edge 'gneE2'.
< Warning: Person 'personFlow_0.25' aborted waiting for ANY at edge 'gneE2'.
< Warning: Person 'personFlow_0.26' aborted waiting for ANY at edge 'gneE2'.
< Warning: Person 'personFlow_0.27' aborted waiting for ANY at edge 'gneE2'.
< Warning: Person 'personFlow_0.28' aborted waiting for ANY at edge 'gneE2'.
<truncated after showing first 30 lines>
---------- New result in exitcode ----------
1

TEST FAILED on ts-sim-winbuild-ba : demandElements personFlow create default_walk default_walk_edges ( Last six runs Apr2021 )

---------- Differences in errors ----------
0a1,5
> Error: attribute 'vehsPerHour' is not declared for element 'personFlow'
>  In file 'routes.netedit'
>  At line/column 58/84.
> 
> Quitting (on error).
---------- New result in exitcode ----------
1

TEST FAILED on ts-sim-winbuild-ba : demandElements personFlow create departPos ( Last six runs Apr2021 )

---------- Differences in errors ----------
1c1,5
< Warning: Invalid departPos 5000.00 given for stopping at gneE2. Using edge end instead.
---
> Error: attribute 'vehsPerHour' is not declared for element 'personFlow'
>  In file 'routes.netedit'
>  At line/column 58/103.
> 
> Quitting (on error).
---------- New result in exitcode ----------
1

TEST FAILED on ts-sim-winbuild-ba : demandElements routeflow inspect_selection departLane random ( Last six runs Apr2021 )

---------- Differences in errors ----------
7,9c7,8
< Error: Vehicle 'flowB.14' will not be able to depart using the given velocity (slow lane ahead)!
< Error: Vehicle 'flowB.16' will not be able to depart using the given velocity (slow lane ahead)!
< Error: Vehicle 'flowB.17' will not be able to depart using the given velocity (slow lane ahead)!
---
> Error: Vehicle 'flowB.13' will not be able to depart using the given velocity (slow lane ahead)!
> Error: Vehicle 'flowB.15' will not be able to depart using the given velocity (slow lane ahead)!

2 TESTS FAILED on ts-sim-winbuild-ba :

---------- New result in errors ----------
Error: Attribute 'expected' in definition of a stop is empty.
---------- Missing result in exitcode ----------
1
demandElements stop stopBusStop load expected ( Last six runs Apr2021 )
demandElements stop stopContainerStop load expected ( Last six runs Apr2021 )

TEST FAILED on ts-sim-winbuild-ba : demandElements stop stopChargingStation load expected ( Last six runs Apr2021 )

---------- New result in errors ----------
Error: Attribute 'expected' in definition of a stop is empty.
Warning: Teleporting vehicle 'flow.2'; waited too long (wrong lane), lane='gneE0_0', time=310.00.
Warning: Vehicle 'flow.2' skips stop on lane 'gneE0_0' time=310.00.
Warning: Vehicle 'flow.2' skips stop on lane 'gneE0_0' time=310.00.
Warning: Vehicle 'flow.2' skips stop on lane 'gneE0_0' time=310.00.
Warning: Vehicle 'flow.2' skips stop on lane 'gneE0_0' time=310.00.
Warning: Vehicle 'flow.2' ends teleporting on edge 'gneE1', time 310.00.
Warning: Teleporting vehicle 'flow.3'; waited too long (wrong lane), lane='gneE0_0', time=611.00.
Warning: Vehicle 'flow.3' skips stop on lane 'gneE0_0' time=611.00.
Warning: Vehicle 'flow.3' skips stop on lane 'gneE0_0' time=611.00.
Warning: Vehicle 'flow.3' skips stop on lane 'gneE0_0' time=611.00.
Warning: Vehicle 'flow.3' skips stop on lane 'gneE0_0' time=611.00.
Warning: Vehicle 'flow.3' ends teleporting on edge 'gneE1', time 611.00.
Warning: Teleporting vehicle 'flow.4'; waited too long (wrong lane), lane='gneE0_0', time=912.00.
Warning: Vehicle 'flow.4' skips stop on lane 'gneE0_0' time=912.00.
Warning: Vehicle 'flow.4' skips stop on lane 'gneE0_0' time=912.00.
Warning: Vehicle 'flow.4' skips stop on lane 'gneE0_0' time=912.00.
Warning: Vehicle 'flow.4' skips stop on lane 'gneE0_0' time=912.00.
Warning: Vehicle 'flow.4' ends teleporting on edge 'gneE1', time 912.00.
Warning: Teleporting vehicle 'flow.5'; waited too long (wrong lane), lane='gneE0_0', time=1213.00.
Warning: Vehicle 'flow.5' skips stop on lane 'gneE0_0' time=1213.00.
Warning: Vehicle 'flow.5' skips stop on lane 'gneE0_0' time=1213.00.
Warning: Vehicle 'flow.5' skips stop on lane 'gneE0_0' time=1213.00.
Warning: Vehicle 'flow.5' skips stop on lane 'gneE0_0' time=1213.00.
Warning: Vehicle 'flow.5' ends teleporting on edge 'gneE1', time 1213.00.
---------- Missing result in exitcode ----------
1

TEST FAILED on ts-sim-winbuild-ba : demandElements stop stopChargingStation volatileRecomputing ( Last six runs Apr2021 )

---------- Differences in errors ----------
0a1,5
> Error: Expected end of tag 'route'
>  In file 'routes.netedit'
>  At line/column 67/7.
> 
> Quitting (on error).
---------- New result in exitcode ----------
1

TEST FAILED on ts-sim-winbuild-ba : demandElements stop stopContainerStop volatileRecomputing ( Last six runs Apr2021 )

---------- Differences in errors ----------
0a1,3
> Warning: No connection between edge 'gneE0' and edge 'gneE4' found.
> Error: Vehicle 'trip0' has no valid route from edge 'gneE0' to stop edge 'gneE4'.
> Quitting (on error).
---------- New result in exitcode ----------
1

TEST FAILED on ts-sim-winbuild-ba : demandElements stop stopLane volatileRecomputing ( Last six runs Apr2021 )

---------- Differences in errors ----------
1,3c1,2
< Warning: Disconnected plan for person 'person_0' (stop range 31.00-35.00 does not cover previous arrival position 25.00).
< Warning: Disconnected plan for person 'person_0' (stop range 38.00-42.00 does not cover previous arrival position 25.00).
< Warning: Disconnected plan for person 'person_0' (stop range 42.00-44.00 does not cover previous arrival position 25.00).
---
> Error: stop for vehicle 'routeFlowA.0' on lane 'gneE2_4' is not downstream the current route.
> Quitting (on error).
---------- New result in exitcode ----------
1

TEST FAILED on ts-sim-winbuild-ba : demandElements stop stopParkingArea load expected ( Last six runs Apr2021 )

---------- New result in errors ----------
Error: Attribute 'expected' in definition of a stop is empty.
Warning: Teleporting vehicle 'vehicle_0'; waited too long (wrong lane), lane='gneE0_0', time=304.00.
Warning: Vehicle 'vehicle_0' skips stop on lane 'gneE0_0' time=304.00.
Warning: Vehicle 'vehicle_0' skips stop on lane 'gneE0_0' time=304.00.
Warning: Vehicle 'vehicle_0' skips stop on lane 'gneE0_0' time=304.00.
Warning: Vehicle 'vehicle_0' skips stop on lane 'gneE0_0' time=304.00.
Warning: Vehicle 'vehicle_0' ends teleporting on edge 'gneE1', time 304.00.
---------- Missing result in exitcode ----------
1

TEST FAILED on ts-sim-winbuild-ba : demandElements stop stopParkingArea volatileRecomputing ( Last six runs Apr2021 )

---------- Differences in errors ----------
0a1,2
> Error: parkingArea 'parkingAreaH' for vehicle 'vehicle_0' on lane 'gneE4_0' is not downstream the current route.
> Quitting (on error).
---------- New result in exitcode ----------
1

TEST FAILED on ts-sim-winbuild-ba : demandElements trip inspect from ( Last six runs Apr2021 )

---------- Differences in errors ----------
0a1,4
> Warning: No connection between edge 'gneE8' and edge 'gneE5' found.
> Warning: No route for vehicle 'vehicle_0' found.
> Error: Vehicle 'vehicle_0' has no valid route.
> Quitting (on error).
---------- New result in exitcode ----------
1

TEST FAILED on ts-sim-winbuild-ba : demandElements trip inspect via ( Last six runs Apr2021 )

---------- Differences in errors ----------
0a1,3
> Warning: No connection between edge 'gneE2' and edge 'gneE8' found.
> Error: Vehicle 'vehicle_0' has no valid route from edge 'gneE2' to stop edge 'gneE8'.
> Quitting (on error).
---------- New result in exitcode ----------
1

TEST FAILED on ts-sim-winbuild-ba : demandElements vehicle_embedded create default_continuous ( Last six runs Apr2021 )

---------- Differences in errors ----------
0a1,2
> Error: Vehicle 'vehicle_0' has no valid route. No connection between edge 'gneE4' and edge 'gneE4'.
> Quitting (on error).
---------- New result in exitcode ----------
1

TEST FAILED on ts-sim-winbuild-ba : demandElements vehicle_embedded load route ( Last six runs Apr2021 )

---------- Differences in errors ----------
0a1,2
> Error: Vehicle 'vehicle_2' has no valid route. No connection between edge 'gneE2' and edge 'gneE5'.
> Quitting (on error).
---------- New result in exitcode ----------
1

17 TESTS FAILED on ts-sim-winbuild-ba :

---------- Differences in errors ----------
1,9d0
< The number of lanes needs to be specified in the attributes of carFollowing-CC with the "lanesCount" attribute
< Error: The number of lanes needs to be specified in the attributes of carFollowing-CC with the "lanesCount" attribute
< The number of lanes needs to be specified in the attributes of carFollowing-CC with the "lanesCount" attribute
< Error: The number of lanes needs to be specified in the attributes of carFollowing-CC with the "lanesCount" attribute
< The number of lanes needs to be specified in the attributes of carFollowing-CC with the "lanesCount" attribute
< Error: The number of lanes needs to be specified in the attributes of carFollowing-CC with the "lanesCount" attribute
< The number of lanes needs to be specified in the attributes of carFollowing-CC with the "lanesCount" attribute
< Error: The number of lanes needs to be specified in the attributes of carFollowing-CC with the "lanesCount" attribute
< The number of lanes needs to be specified in the attributes of carFollowing-CC with the "lanesCount" attribute
10a2
> Quitting (on error).
---------- New result in exitcode ----------
1
demandElements vehicletype load carfollowingmodel_params cf_cc_c1 ( Last six runs Apr2021 )
demandElements vehicletype load carfollowingmodel_params cf_cc_ccaccel ( Last six runs Apr2021 )
demandElements vehicletype load carfollowingmodel_params cf_cc_ccdecel ( Last six runs Apr2021 )
demandElements vehicletype load carfollowingmodel_params cf_cc_constspacing ( Last six runs Apr2021 )
demandElements vehicletype load carfollowingmodel_params cf_cc_flatbed_d ( Last six runs Apr2021 )
demandElements vehicletype load carfollowingmodel_params cf_cc_flatbed_h ( Last six runs Apr2021 )
demandElements vehicletype load carfollowingmodel_params cf_cc_flatbed_ka ( Last six runs Apr2021 )
demandElements vehicletype load carfollowingmodel_params cf_cc_flatbed_kp ( Last six runs Apr2021 )
demandElements vehicletype load carfollowingmodel_params cf_cc_flatbed_kv ( Last six runs Apr2021 )
demandElements vehicletype load carfollowingmodel_params cf_cc_kp ( Last six runs Apr2021 )
demandElements vehicletype load carfollowingmodel_params cf_cc_lambda ( Last six runs Apr2021 )
demandElements vehicletype load carfollowingmodel_params cf_cc_omegan ( Last six runs Apr2021 )
demandElements vehicletype load carfollowingmodel_params cf_cc_ploeg_h ( Last six runs Apr2021 )
demandElements vehicletype load carfollowingmodel_params cf_cc_ploeg_kd ( Last six runs Apr2021 )
demandElements vehicletype load carfollowingmodel_params cf_cc_ploeg_kp ( Last six runs Apr2021 )
demandElements vehicletype load carfollowingmodel_params cf_cc_tau ( Last six runs Apr2021 )
demandElements vehicletype load carfollowingmodel_params cf_cc_xi ( Last six runs Apr2021 )

TEST FAILED on ts-sim-winbuild-ba : demandElements vehicletype load carfollowingmodel_params cf_cc_lanes_count ( Last six runs Apr2021 )

---------- Differences in errors ----------
1d0
< The number of lanes needs to be specified in the attributes of carFollowing-CC with the "lanesCount" attribute
2a2
> Quitting (on error).
---------- New result in exitcode ----------
1

Detailed information for the tests that had known bugs:

230 TESTS had known bugs (Test needed #3045) on ts-sim-winbuild-ba :

#3045
(This bug was triggered by text found in file 'errors' matching 'File 'net.netedit' is not accessible')
---------- New result in errors ----------
Error: File 'net.netedit' is not accessible (No such file or directory).
Quitting (on error).
additionalElements calibrator create id ( Last six runs Apr2021 )
additionalElements e2detector create id ( Last six runs Apr2021 )
additionalElements lanecalibrator create id ( Last six runs Apr2021 )
additionalElements parkingarea create id ( Last six runs Apr2021 )
additionalElements routeprobe create id ( Last six runs Apr2021 )
demandElements flow create begin ( Last six runs Apr2021 )
demandElements flow create end ( Last six runs Apr2021 )
demandElements flow create id ( Last six runs Apr2021 )
demandElements flow create number ( Last six runs Apr2021 )
demandElements flow create period ( Last six runs Apr2021 )
demandElements flow create probability ( Last six runs Apr2021 )
demandElements flow create vehsPerHour ( Last six runs Apr2021 )
demandElements flow fix ( Last six runs Apr2021 )
demandElements flow inspect begin ( Last six runs Apr2021 )
demandElements flow inspect end ( Last six runs Apr2021 )
demandElements flow inspect number ( Last six runs Apr2021 )
demandElements flow inspect period ( Last six runs Apr2021 )
demandElements flow inspect probability ( Last six runs Apr2021 )
demandElements flow inspect vehsPerHour ( Last six runs Apr2021 )
demandElements flow inspect_selection begin ( Last six runs Apr2021 )
demandElements flow inspect_selection end ( Last six runs Apr2021 )
demandElements flow inspect_selection number ( Last six runs Apr2021 )
demandElements flow inspect_selection period ( Last six runs Apr2021 )
demandElements flow inspect_selection probability ( Last six runs Apr2021 )
demandElements flow inspect_selection type ( Last six runs Apr2021 )
demandElements flow inspect_selection vehsPerHour ( Last six runs Apr2021 )
demandElements flow_embedded create begin ( Last six runs Apr2021 )
demandElements flow_embedded create end ( Last six runs Apr2021 )
demandElements flow_embedded create id ( Last six runs Apr2021 )
demandElements flow_embedded create number ( Last six runs Apr2021 )
demandElements flow_embedded create period ( Last six runs Apr2021 )
demandElements flow_embedded create probability ( Last six runs Apr2021 )
demandElements flow_embedded create vehsPerHour ( Last six runs Apr2021 )
demandElements flow_embedded fix ( Last six runs Apr2021 )
demandElements flow_embedded inspect begin ( Last six runs Apr2021 )
demandElements flow_embedded inspect end ( Last six runs Apr2021 )
demandElements flow_embedded inspect number ( Last six runs Apr2021 )
demandElements flow_embedded inspect period ( Last six runs Apr2021 )
demandElements flow_embedded inspect probability ( Last six runs Apr2021 )
demandElements flow_embedded inspect vehsPerHour ( Last six runs Apr2021 )
demandElements flow_embedded inspect_selection begin ( Last six runs Apr2021 )
demandElements flow_embedded inspect_selection end ( Last six runs Apr2021 )
demandElements flow_embedded inspect_selection number ( Last six runs Apr2021 )
demandElements flow_embedded inspect_selection period ( Last six runs Apr2021 )
demandElements flow_embedded inspect_selection probability ( Last six runs Apr2021 )
demandElements flow_embedded inspect_selection type ( Last six runs Apr2021 )
demandElements flow_embedded inspect_selection vehsPerHour ( Last six runs Apr2021 )
demandElements person create id ( Last six runs Apr2021 )
demandElements person fix ( Last six runs Apr2021 )
demandElements person inspect ( Last six runs Apr2021 )
demandElements person inspect_selection ( Last six runs Apr2021 )
demandElements person load ( Last six runs Apr2021 )
demandElements person volatileRecomputing ( Last six runs Apr2021 )
demandElements personFlow create begin ( Last six runs Apr2021 )
demandElements personFlow create end ( Last six runs Apr2021 )
demandElements personFlow create id ( Last six runs Apr2021 )
demandElements personFlow create number ( Last six runs Apr2021 )
demandElements personFlow create period ( Last six runs Apr2021 )
demandElements personFlow create probability ( Last six runs Apr2021 )
demandElements personFlow create vehsPerHour ( Last six runs Apr2021 )
demandElements personFlow fix ( Last six runs Apr2021 )
demandElements personFlow inspect ( Last six runs Apr2021 )
demandElements personFlow inspect_selection ( Last six runs Apr2021 )
demandElements personFlow load ( Last six runs Apr2021 )
demandElements personFlow volatileRecomputing ( Last six runs Apr2021 )
demandElements route create_consecutive id ( Last six runs Apr2021 )
demandElements route create_nonconsecutive id ( Last six runs Apr2021 )
demandElements routeflow create begin ( Last six runs Apr2021 )
demandElements routeflow create end ( Last six runs Apr2021 )
demandElements routeflow create id ( Last six runs Apr2021 )
demandElements routeflow create number ( Last six runs Apr2021 )
demandElements routeflow create period ( Last six runs Apr2021 )
demandElements routeflow create probability ( Last six runs Apr2021 )
demandElements routeflow create vehsPerHour ( Last six runs Apr2021 )
demandElements routeflow fix ( Last six runs Apr2021 )
demandElements routeflow inspect begin ( Last six runs Apr2021 )
demandElements routeflow inspect end ( Last six runs Apr2021 )
demandElements routeflow inspect number ( Last six runs Apr2021 )
demandElements routeflow inspect period ( Last six runs Apr2021 )
demandElements routeflow inspect probability ( Last six runs Apr2021 )
demandElements routeflow inspect vehsPerHour ( Last six runs Apr2021 )
demandElements routeflow inspect_selection begin ( Last six runs Apr2021 )
demandElements routeflow inspect_selection end ( Last six runs Apr2021 )
demandElements routeflow inspect_selection number ( Last six runs Apr2021 )
demandElements routeflow inspect_selection period ( Last six runs Apr2021 )
demandElements routeflow inspect_selection probability ( Last six runs Apr2021 )
demandElements routeflow inspect_selection type ( Last six runs Apr2021 )
demandElements routeflow inspect_selection vehsPerHour ( Last six runs Apr2021 )
demandElements stop stopLane inspect endPos ( Last six runs Apr2021 )
demandElements stop stopLane inspect startPos ( Last six runs Apr2021 )
demandElements trip create id ( Last six runs Apr2021 )
demandElements trip fix ( Last six runs Apr2021 )
demandElements trip inspect_selection type ( Last six runs Apr2021 )
demandElements vehicle create id ( Last six runs Apr2021 )
demandElements vehicle fix ( Last six runs Apr2021 )
demandElements vehicle inspect_selection type ( Last six runs Apr2021 )
demandElements vehicle_embedded create id ( Last six runs Apr2021 )
demandElements vehicle_embedded fix ( Last six runs Apr2021 )
demandElements vehicle_embedded inspect_selection type ( Last six runs Apr2021 )
demandElements vehicletype copy ( Last six runs Apr2021 )
demandElements vehicletype create basic accel ( Last six runs Apr2021 )
demandElements vehicletype create basic color ( Last six runs Apr2021 )
demandElements vehicletype create basic decel ( Last six runs Apr2021 )
demandElements vehicletype create basic default ( Last six runs Apr2021 )
demandElements vehicletype create basic id ( Last six runs Apr2021 )
demandElements vehicletype create basic length ( Last six runs Apr2021 )
demandElements vehicletype create basic maxspeed ( Last six runs Apr2021 )
demandElements vehicletype create basic mingap ( Last six runs Apr2021 )
demandElements vehicletype create basic sigma ( Last six runs Apr2021 )
demandElements vehicletype create basic tau ( Last six runs Apr2021 )
demandElements vehicletype create basic vclass ( Last six runs Apr2021 )
demandElements vehicletype create dialog actionStepLength ( Last six runs Apr2021 )
demandElements vehicletype create dialog boardingduration ( Last six runs Apr2021 )
demandElements vehicletype create dialog carfollowingmodel ( Last six runs Apr2021 )
demandElements vehicletype create dialog carfollowingmodel_params accel ( Last six runs Apr2021 )
demandElements vehicletype create dialog carfollowingmodel_params apparentdecel ( Last six runs Apr2021 )
demandElements vehicletype create dialog carfollowingmodel_params ca_gain_gap_cacc ( Last six runs Apr2021 )
demandElements vehicletype create dialog carfollowingmodel_params ca_gain_gap_dot_cacc ( Last six runs Apr2021 )
demandElements vehicletype create dialog carfollowingmodel_params ca_gain_space ( Last six runs Apr2021 )
demandElements vehicletype create dialog carfollowingmodel_params ca_gain_speed ( Last six runs Apr2021 )
demandElements vehicletype create dialog carfollowingmodel_params cf_cc_c1 ( Last six runs Apr2021 )
demandElements vehicletype create dialog carfollowingmodel_params cf_cc_ccaccel ( Last six runs Apr2021 )
demandElements vehicletype create dialog carfollowingmodel_params cf_cc_ccdecel ( Last six runs Apr2021 )
demandElements vehicletype create dialog carfollowingmodel_params cf_cc_constspacing ( Last six runs Apr2021 )
demandElements vehicletype create dialog carfollowingmodel_params cf_cc_flatbed_d ( Last six runs Apr2021 )
demandElements vehicletype create dialog carfollowingmodel_params cf_cc_flatbed_h ( Last six runs Apr2021 )
demandElements vehicletype create dialog carfollowingmodel_params cf_cc_flatbed_ka ( Last six runs Apr2021 )
demandElements vehicletype create dialog carfollowingmodel_params cf_cc_flatbed_kp ( Last six runs Apr2021 )
demandElements vehicletype create dialog carfollowingmodel_params cf_cc_flatbed_kv ( Last six runs Apr2021 )
demandElements vehicletype create dialog carfollowingmodel_params cf_cc_kp ( Last six runs Apr2021 )
demandElements vehicletype create dialog carfollowingmodel_params cf_cc_lambda ( Last six runs Apr2021 )
demandElements vehicletype create dialog carfollowingmodel_params cf_cc_lanes_count ( Last six runs Apr2021 )
demandElements vehicletype create dialog carfollowingmodel_params cf_cc_omegan ( Last six runs Apr2021 )
demandElements vehicletype create dialog carfollowingmodel_params cf_cc_ploeg_h ( Last six runs Apr2021 )
demandElements vehicletype create dialog carfollowingmodel_params cf_cc_ploeg_kd ( Last six runs Apr2021 )
demandElements vehicletype create dialog carfollowingmodel_params cf_cc_ploeg_kp ( Last six runs Apr2021 )
demandElements vehicletype create dialog carfollowingmodel_params cf_cc_tau ( Last six runs Apr2021 )
demandElements vehicletype create dialog carfollowingmodel_params cf_cc_xi ( Last six runs Apr2021 )
demandElements vehicletype create dialog carfollowingmodel_params cf_idm_delta ( Last six runs Apr2021 )
demandElements vehicletype create dialog carfollowingmodel_params cf_idm_stepping ( Last six runs Apr2021 )
demandElements vehicletype create dialog carfollowingmodel_params cf_idmm_adapt_factor ( Last six runs Apr2021 )
demandElements vehicletype create dialog carfollowingmodel_params cf_idmm_adapt_time ( Last six runs Apr2021 )
demandElements vehicletype create dialog carfollowingmodel_params cf_kerner_phi ( Last six runs Apr2021 )
demandElements vehicletype create dialog carfollowingmodel_params cf_pwagner2009_approb ( Last six runs Apr2021 )
demandElements vehicletype create dialog carfollowingmodel_params cf_pwagner2009_taulast ( Last six runs Apr2021 )
demandElements vehicletype create dialog carfollowingmodel_params cf_w99_cc1 ( Last six runs Apr2021 )
demandElements vehicletype create dialog carfollowingmodel_params cf_w99_cc2 ( Last six runs Apr2021 )
demandElements vehicletype create dialog carfollowingmodel_params cf_w99_cc3 ( Last six runs Apr2021 )
demandElements vehicletype create dialog carfollowingmodel_params cf_w99_cc4 ( Last six runs Apr2021 )
demandElements vehicletype create dialog carfollowingmodel_params cf_w99_cc5 ( Last six runs Apr2021 )
demandElements vehicletype create dialog carfollowingmodel_params cf_w99_cc6 ( Last six runs Apr2021 )
demandElements vehicletype create dialog carfollowingmodel_params cf_w99_cc7 ( Last six runs Apr2021 )
demandElements vehicletype create dialog carfollowingmodel_params cf_w99_cc8 ( Last six runs Apr2021 )
demandElements vehicletype create dialog carfollowingmodel_params cf_w99_cc9 ( Last six runs Apr2021 )
demandElements vehicletype create dialog carfollowingmodel_params cf_wiedemann_estimation ( Last six runs Apr2021 )
demandElements vehicletype create dialog carfollowingmodel_params cf_wiedemann_security ( Last six runs Apr2021 )
demandElements vehicletype create dialog carfollowingmodel_params collision_mingap_factor ( Last six runs Apr2021 )
demandElements vehicletype create dialog carfollowingmodel_params decel ( Last six runs Apr2021 )
demandElements vehicletype create dialog carfollowingmodel_params emergencydecel ( Last six runs Apr2021 )
demandElements vehicletype create dialog carfollowingmodel_params gc_gain_gap_cacc ( Last six runs Apr2021 )
demandElements vehicletype create dialog carfollowingmodel_params gc_gain_gap_dot_cacc ( Last six runs Apr2021 )
demandElements vehicletype create dialog carfollowingmodel_params gc_gain_space ( Last six runs Apr2021 )
demandElements vehicletype create dialog carfollowingmodel_params gc_gain_speed ( Last six runs Apr2021 )
demandElements vehicletype create dialog carfollowingmodel_params gcc_gain_gap_cacc ( Last six runs Apr2021 )
demandElements vehicletype create dialog carfollowingmodel_params gcc_gain_gap_dot_cacc ( Last six runs Apr2021 )
demandElements vehicletype create dialog carfollowingmodel_params gcc_gain_space ( Last six runs Apr2021 )
demandElements vehicletype create dialog carfollowingmodel_params gcc_gain_speed ( Last six runs Apr2021 )
demandElements vehicletype create dialog carfollowingmodel_params headway_time_cacc_to_acc ( Last six runs Apr2021 )
demandElements vehicletype create dialog carfollowingmodel_params k ( Last six runs Apr2021 )
demandElements vehicletype create dialog carfollowingmodel_params sc_gain ( Last six runs Apr2021 )
demandElements vehicletype create dialog carfollowingmodel_params sc_gain_cacc ( Last six runs Apr2021 )
demandElements vehicletype create dialog carfollowingmodel_params sigma ( Last six runs Apr2021 )
demandElements vehicletype create dialog carfollowingmodel_params tau ( Last six runs Apr2021 )
demandElements vehicletype create dialog carfollowingmodel_params tmp1 ( Last six runs Apr2021 )
demandElements vehicletype create dialog carfollowingmodel_params tmp2 ( Last six runs Apr2021 )
demandElements vehicletype create dialog carfollowingmodel_params tmp3 ( Last six runs Apr2021 )
demandElements vehicletype create dialog carfollowingmodel_params tmp4 ( Last six runs Apr2021 )
demandElements vehicletype create dialog carfollowingmodel_params tmp5 ( Last six runs Apr2021 )
demandElements vehicletype create dialog carfollowingmodel_params train_type ( Last six runs Apr2021 )
demandElements vehicletype create dialog color ( Last six runs Apr2021 )
demandElements vehicletype create dialog containercapacity ( Last six runs Apr2021 )
demandElements vehicletype create dialog default ( Last six runs Apr2021 )
demandElements vehicletype create dialog emissionclass ( Last six runs Apr2021 )
demandElements vehicletype create dialog guishape ( Last six runs Apr2021 )
demandElements vehicletype create dialog id ( Last six runs Apr2021 )
demandElements vehicletype create dialog imgfile ( Last six runs Apr2021 )
demandElements vehicletype create dialog impatience ( Last six runs Apr2021 )
demandElements vehicletype create dialog junctionmodel_params jm_crossing_gap ( Last six runs Apr2021 )
demandElements vehicletype create dialog junctionmodel_params jm_drive_after_red_time ( Last six runs Apr2021 )
demandElements vehicletype create dialog junctionmodel_params jm_drive_after_yellow_time ( Last six runs Apr2021 )
demandElements vehicletype create dialog junctionmodel_params jm_drive_red_speed ( Last six runs Apr2021 )
demandElements vehicletype create dialog junctionmodel_params jm_ignore_foe_prob ( Last six runs Apr2021 )
demandElements vehicletype create dialog junctionmodel_params jm_ignore_foe_speed ( Last six runs Apr2021 )
demandElements vehicletype create dialog junctionmodel_params jm_ignore_keep_clear_time ( Last six runs Apr2021 )
demandElements vehicletype create dialog junctionmodel_params jm_sigma_minor ( Last six runs Apr2021 )
demandElements vehicletype create dialog junctionmodel_params jm_timegap_minor ( Last six runs Apr2021 )
demandElements vehicletype create dialog lanechangemodel ( Last six runs Apr2021 )
demandElements vehicletype create dialog lanechangemodel_params lc_accel_lat ( Last six runs Apr2021 )
demandElements vehicletype create dialog lanechangemodel_params lc_assertive ( Last six runs Apr2021 )
demandElements vehicletype create dialog lanechangemodel_params lc_cooperative ( Last six runs Apr2021 )
demandElements vehicletype create dialog lanechangemodel_params lc_impatience ( Last six runs Apr2021 )
demandElements vehicletype create dialog lanechangemodel_params lc_keep_right ( Last six runs Apr2021 )
demandElements vehicletype create dialog lanechangemodel_params lc_lookahead_left ( Last six runs Apr2021 )
demandElements vehicletype create dialog lanechangemodel_params lc_max_speed_lat_factor ( Last six runs Apr2021 )
demandElements vehicletype create dialog lanechangemodel_params lc_max_speed_lat_standing ( Last six runs Apr2021 )
demandElements vehicletype create dialog lanechangemodel_params lc_opposite ( Last six runs Apr2021 )
demandElements vehicletype create dialog lanechangemodel_params lc_overtake_right ( Last six runs Apr2021 )
demandElements vehicletype create dialog lanechangemodel_params lc_pushy ( Last six runs Apr2021 )
demandElements vehicletype create dialog lanechangemodel_params lc_pushy_gap ( Last six runs Apr2021 )
demandElements vehicletype create dialog lanechangemodel_params lc_speed_gain ( Last six runs Apr2021 )
demandElements vehicletype create dialog lanechangemodel_params lc_speed_gain_right ( Last six runs Apr2021 )
demandElements vehicletype create dialog lanechangemodel_params lc_strategic ( Last six runs Apr2021 )
demandElements vehicletype create dialog lanechangemodel_params lc_sublane ( Last six runs Apr2021 )
demandElements vehicletype create dialog lanechangemodel_params lc_time_to_impatience ( Last six runs Apr2021 )
demandElements vehicletype create dialog lanechangemodel_params lc_turn_alignment_distance ( Last six runs Apr2021 )
demandElements vehicletype create dialog latalignment ( Last six runs Apr2021 )
demandElements vehicletype create dialog length ( Last six runs Apr2021 )
demandElements vehicletype create dialog loadingduration ( Last six runs Apr2021 )
demandElements vehicletype create dialog maxspeed ( Last six runs Apr2021 )
demandElements vehicletype create dialog maxspeedlat ( Last six runs Apr2021 )
demandElements vehicletype create dialog mingap ( Last six runs Apr2021 )
demandElements vehicletype create dialog mingaplat ( Last six runs Apr2021 )
demandElements vehicletype create dialog osgfile ( Last six runs Apr2021 )
demandElements vehicletype create dialog personcapacity ( Last six runs Apr2021 )
demandElements vehicletype create dialog speeddev ( Last six runs Apr2021 )
demandElements vehicletype create dialog speedfactor ( Last six runs Apr2021 )
demandElements vehicletype create dialog vclass ( Last six runs Apr2021 )
demandElements vehicletype create dialog width ( Last six runs Apr2021 )
netElements edges templates ( Last six runs Apr2021 )
selection basic contextual_menu ( Last six runs Apr2021 )

TEST had known bugs (Routeprobes #5941) on ts-sim-winbuild-ba : additionalElements calibrator inspect routeprobe ( Last six runs Apr2021 )

#5941
(This bug was triggered by text found in file 'errors' matching 'is not known')
---------- Differences in errors ----------
1c1,2
< Warning: No flow intervals in calibrator 'calibrator_gneE2_0'.
---
> Error: The routeProbe 'customRouteProbeName' to use within the calibrator 'calibrator_gneE2_0' is not known.
> Quitting (on error).
---------- New result in exitcode ----------
1

TEST had known bugs (Routeprobes #5941) on ts-sim-winbuild-ba : additionalElements calibrator load routeProbe ( Last six runs Apr2021 )

#5941
(This bug was triggered by text found in file 'errors' matching 'is not known')
---------- Differences in errors ----------
1c1
< Warning: No flow intervals in calibrator 'calibrator01'.
---
> Error: The routeProbe '%%$%$$$' to use within the calibrator 'calibrator01' is not known.
3a4
> Quitting (on error).
---------- New result in exitcode ----------
1

TEST had known bugs (Routeprobes #5941) on ts-sim-winbuild-ba : additionalElements lanecalibrator inspect routeprobe ( Last six runs Apr2021 )

#5941
(This bug was triggered by text found in file 'errors' matching 'is not known')
---------- Differences in errors ----------
1c1,2
< Warning: No flow intervals in calibrator 'laneCalibrator_gneE2_1_0'.
---
> Error: The routeProbe 'customRouteProbeName' to use within the calibrator 'laneCalibrator_gneE3_1_0' is not known.
> Quitting (on error).
---------- New result in exitcode ----------
1

TEST had known bugs (Routeprobes #5941) on ts-sim-winbuild-ba : additionalElements lanecalibrator load routeProbe ( Last six runs Apr2021 )

#5941
(This bug was triggered by text found in file 'errors' matching 'is not known')
---------- Differences in errors ----------
1c1
< Warning: No flow intervals in calibrator 'calibrator01'.
---
> Error: The routeProbe '%%$%$$$' to use within the calibrator 'calibrator01' is not known.
3c3,4
< Warning: No flow intervals in calibrator 'calibrator03'.
---
> Error: The routeProbe 'myRouteProbe' to use within the calibrator 'calibrator03' is not known.
> Quitting (on error).
---------- New result in exitcode ----------
1

TEST had known bugs (#5875) on ts-sim-winbuild-ba : demandElements routeflow load line ( Last six runs Apr2021 )

See #5875
(This bug was triggered by text found in file 'errors' matching 'Error: Attribute 'line' in definition of flow 'flow_1' is empty')
---------- Differences in errors ----------
0a1
> Error: Attribute 'line' in definition of flow 'flow_1' is empty.

Detailed information for the tests that were terminated before completion:

TEST were terminated before completion (TIMEOUT) on ts-sim-winbuild-ba : demandElements flow create vType ( Last six runs Apr2021 )

Test exceeded wallclock time limit of 600.0 seconds
---------- Differences in errors ----------
615,3600d614
< Warning: Teleporting vehicle 'flow_0.307'; waited too long (jam), lane=':gneJ5_1_1', time=94884.00.
< Warning: Vehicle 'flow_0.307' ends teleporting on edge 'gneE4', time 94884.00.
< Warning: Teleporting vehicle 'flow_0.308'; waited too long (jam), lane=':gneJ5_1_1', time=95192.00.
< Warning: Vehicle 'flow_0.308' ends teleporting on edge 'gneE4', time 95192.00.
< Warning: Teleporting vehicle 'flow_0.309'; waited too long (jam), lane=':gneJ5_1_1', time=95501.00.
< Warning: Vehicle 'flow_0.309' ends teleporting on edge 'gneE4', time 95501.00.
< Warning: Teleporting vehicle 'flow_0.310'; waited too long (jam), lane=':gneJ5_1_1', time=95811.00.
< Warning: Vehicle 'flow_0.310' ends teleporting on edge 'gneE4', time 95811.00.
< Warning: Teleporting vehicle 'flow_0.311'; waited too long (jam), lane=':gneJ5_1_1', time=96120.00.
< Warning: Vehicle 'flow_0.311' ends teleporting on edge 'gneE4', time 96120.00.
< Warning: Teleporting vehicle 'flow_0.312'; waited too long (jam), lane=':gneJ5_1_1', time=96429.00.
< Warning: Vehicle 'flow_0.312' ends teleporting on edge 'gneE4', time 96429.00.
< Warning: Teleporting vehicle 'flow_0.313'; waited too long (jam), lane=':gneJ5_1_1', time=96739.00.
< Warning: Vehicle 'flow_0.313' ends teleporting on edge 'gneE4', time 96739.00.
< Warning: Teleporting vehicle 'flow_0.314'; waited too long (jam), lane=':gneJ5_1_1', time=97048.00.
< Warning: Vehicle 'flow_0.314' ends teleporting on edge 'gneE4', time 97048.00.
< Warning: Teleporting vehicle 'flow_0.315'; waited too long (jam), lane=':gneJ5_1_1', time=97357.00.
< Warning: Vehicle 'flow_0.315' ends teleporting on edge 'gneE4', time 97357.00.
< Warning: Teleporting vehicle 'flow_0.316'; waited too long (jam), lane=':gneJ5_1_1', time=97667.00.
< Warning: Vehicle 'flow_0.316' ends teleporting on edge 'gneE4', time 97667.00.
< Warning: Teleporting vehicle 'flow_0.317'; waited too long (jam), lane=':gneJ5_1_1', time=97976.00.
< Warning: Vehicle 'flow_0.317' ends teleporting on edge 'gneE4', time 97976.00.
< Warning: Teleporting vehicle 'flow_0.318'; waited too long (jam), lane=':gneJ5_1_1', time=98285.00.
< Warning: Vehicle 'flow_0.318' ends teleporting on edge 'gneE4', time 98285.00.
< Warning: Teleporting vehicle 'flow_0.319'; waited too long (jam), lane=':gneJ5_1_1', time=98594.00.
< Warning: Vehicle 'flow_0.319' ends teleporting on edge 'gneE4', time 98594.00.
< Warning: Teleporting vehicle 'flow_0.320'; waited too long (jam), lane=':gneJ5_1_1', time=98903.00.
< Warning: Vehicle 'flow_0.320' ends teleporting on edge 'gneE4', time 98903.00.
< Warning: Teleporting vehicle 'flow_0.321'; waited too long (jam), lane=':gneJ5_1_1', time=99212.00.
<truncated after showing first 30 lines>

TEST were terminated before completion (TIMEOUT) on ts-sim-winbuild-ba : demandElements flow inspect vType ( Last six runs Apr2021 )

Test exceeded wallclock time limit of 600.0 seconds
---------- Differences in errors ----------
627,3600d626
< Warning: Teleporting vehicle 'flow_0.313'; waited too long (jam), lane=':gneJ5_1_1', time=96739.00.
< Warning: Vehicle 'flow_0.313' ends teleporting on edge 'gneE4', time 96739.00.
< Warning: Teleporting vehicle 'flow_0.314'; waited too long (jam), lane=':gneJ5_1_1', time=97048.00.
< Warning: Vehicle 'flow_0.314' ends teleporting on edge 'gneE4', time 97048.00.
< Warning: Teleporting vehicle 'flow_0.315'; waited too long (jam), lane=':gneJ5_1_1', time=97357.00.
< Warning: Vehicle 'flow_0.315' ends teleporting on edge 'gneE4', time 97357.00.
< Warning: Teleporting vehicle 'flow_0.316'; waited too long (jam), lane=':gneJ5_1_1', time=97667.00.
< Warning: Vehicle 'flow_0.316' ends teleporting on edge 'gneE4', time 97667.00.
< Warning: Teleporting vehicle 'flow_0.317'; waited too long (jam), lane=':gneJ5_1_1', time=97976.00.
< Warning: Vehicle 'flow_0.317' ends teleporting on edge 'gneE4', time 97976.00.
< Warning: Teleporting vehicle 'flow_0.318'; waited too long (jam), lane=':gneJ5_1_1', time=98285.00.
< Warning: Vehicle 'flow_0.318' ends teleporting on edge 'gneE4', time 98285.00.
< Warning: Teleporting vehicle 'flow_0.319'; waited too long (jam), lane=':gneJ5_1_1', time=98594.00.
< Warning: Vehicle 'flow_0.319' ends teleporting on edge 'gneE4', time 98594.00.
< Warning: Teleporting vehicle 'flow_0.320'; waited too long (jam), lane=':gneJ5_1_1', time=98903.00.
< Warning: Vehicle 'flow_0.320' ends teleporting on edge 'gneE4', time 98903.00.
< Warning: Teleporting vehicle 'flow_0.321'; waited too long (jam), lane=':gneJ5_1_1', time=99212.00.
< Warning: Vehicle 'flow_0.321' ends teleporting on edge 'gneE4', time 99212.00.
< Warning: Teleporting vehicle 'flow_0.322'; waited too long (jam), lane=':gneJ5_1_1', time=99521.00.
< Warning: Vehicle 'flow_0.322' ends teleporting on edge 'gneE4', time 99521.00.
< Warning: Teleporting vehicle 'flow_0.323'; waited too long (jam), lane=':gneJ5_1_1', time=99831.00.
< Warning: Vehicle 'flow_0.323' ends teleporting on edge 'gneE4', time 99831.00.
< Warning: Teleporting vehicle 'flow_0.324'; waited too long (jam), lane=':gneJ5_1_1', time=100142.00.
< Warning: Vehicle 'flow_0.324' ends teleporting on edge 'gneE4', time 100142.00.
< Warning: Teleporting vehicle 'flow_0.325'; waited too long (jam), lane=':gneJ5_1_1', time=100451.00.
< Warning: Vehicle 'flow_0.325' ends teleporting on edge 'gneE4', time 100451.00.
< Warning: Teleporting vehicle 'flow_0.326'; waited too long (jam), lane=':gneJ5_1_1', time=100759.00.
< Warning: Vehicle 'flow_0.326' ends teleporting on edge 'gneE4', time 100759.00.
< Warning: Teleporting vehicle 'flow_0.327'; waited too long (jam), lane=':gneJ5_1_1', time=101069.00.
<truncated after showing first 30 lines>

2 TESTS were terminated before completion (TIMEOUT) on ts-sim-winbuild-ba :

Test exceeded wallclock time limit of 600.0 seconds
---------- Differences in errors ----------
437,3600d436
< Warning: Teleporting vehicle 'flow_0.218'; waited too long (jam), lane=':gneJ5_1_1', time=67380.00.
< Warning: Vehicle 'flow_0.218' ends teleporting on edge 'gneE4', time 67380.00.
< Warning: Teleporting vehicle 'flow_0.219'; waited too long (jam), lane=':gneJ5_1_1', time=67688.00.
< Warning: Vehicle 'flow_0.219' ends teleporting on edge 'gneE4', time 67688.00.
< Warning: Teleporting vehicle 'flow_0.220'; waited too long (jam), lane=':gneJ5_1_1', time=67997.00.
< Warning: Vehicle 'flow_0.220' ends teleporting on edge 'gneE4', time 67997.00.
< Warning: Teleporting vehicle 'flow_0.221'; waited too long (jam), lane=':gneJ5_1_1', time=68306.00.
< Warning: Vehicle 'flow_0.221' ends teleporting on edge 'gneE4', time 68306.00.
< Warning: Teleporting vehicle 'flow_0.222'; waited too long (jam), lane=':gneJ5_1_1', time=68615.00.
< Warning: Vehicle 'flow_0.222' ends teleporting on edge 'gneE4', time 68615.00.
< Warning: Teleporting vehicle 'flow_0.223'; waited too long (jam), lane=':gneJ5_1_1', time=68924.00.
< Warning: Vehicle 'flow_0.223' ends teleporting on edge 'gneE4', time 68924.00.
< Warning: Teleporting vehicle 'flow_0.224'; waited too long (jam), lane=':gneJ5_1_1', time=69232.00.
< Warning: Vehicle 'flow_0.224' ends teleporting on edge 'gneE4', time 69232.00.
< Warning: Teleporting vehicle 'flow_0.225'; waited too long (jam), lane=':gneJ5_1_1', time=69542.00.
< Warning: Vehicle 'flow_0.225' ends teleporting on edge 'gneE4', time 69542.00.
< Warning: Teleporting vehicle 'flow_0.226'; waited too long (jam), lane=':gneJ5_1_1', time=69851.00.
< Warning: Vehicle 'flow_0.226' ends teleporting on edge 'gneE4', time 69851.00.
< Warning: Teleporting vehicle 'flow_0.227'; waited too long (jam), lane=':gneJ5_1_1', time=70161.00.
< Warning: Vehicle 'flow_0.227' ends teleporting on edge 'gneE4', time 70161.00.
< Warning: Teleporting vehicle 'flow_0.228'; waited too long (jam), lane=':gneJ5_1_1', time=70471.00.
< Warning: Vehicle 'flow_0.228' ends teleporting on edge 'gneE4', time 70471.00.
< Warning: Teleporting vehicle 'flow_0.229'; waited too long (jam), lane=':gneJ5_1_1', time=70781.00.
< Warning: Vehicle 'flow_0.229' ends teleporting on edge 'gneE4', time 70781.00.
< Warning: Teleporting vehicle 'flow_0.230'; waited too long (jam), lane=':gneJ5_1_1', time=71089.00.
< Warning: Vehicle 'flow_0.230' ends teleporting on edge 'gneE4', time 71089.00.
< Warning: Teleporting vehicle 'flow_0.231'; waited too long (jam), lane=':gneJ5_1_1', time=71397.00.
< Warning: Vehicle 'flow_0.231' ends teleporting on edge 'gneE4', time 71397.00.
< Warning: Teleporting vehicle 'flow_0.232'; waited too long (jam), lane=':gneJ5_1_1', time=71705.00.
<truncated after showing first 30 lines>
demandElements flow_embedded create vType ( Last six runs Apr2021 )
demandElements flow_embedded inspect vType ( Last six runs Apr2021 )

TEST were terminated before completion (TIMEOUT) on ts-sim-winbuild-ba : demandElements routeflow create vType ( Last six runs Apr2021 )

Test exceeded wallclock time limit of 600.0 seconds
---------- Differences in errors ----------
435,3600d434
< Warning: Teleporting vehicle 'flow_0.217'; waited too long (jam), lane=':gneJ5_1_1', time=67071.00.
< Warning: Vehicle 'flow_0.217' ends teleporting on edge 'gneE4', time 67071.00.
< Warning: Teleporting vehicle 'flow_0.218'; waited too long (jam), lane=':gneJ5_1_1', time=67380.00.
< Warning: Vehicle 'flow_0.218' ends teleporting on edge 'gneE4', time 67380.00.
< Warning: Teleporting vehicle 'flow_0.219'; waited too long (jam), lane=':gneJ5_1_1', time=67688.00.
< Warning: Vehicle 'flow_0.219' ends teleporting on edge 'gneE4', time 67688.00.
< Warning: Teleporting vehicle 'flow_0.220'; waited too long (jam), lane=':gneJ5_1_1', time=67997.00.
< Warning: Vehicle 'flow_0.220' ends teleporting on edge 'gneE4', time 67997.00.
< Warning: Teleporting vehicle 'flow_0.221'; waited too long (jam), lane=':gneJ5_1_1', time=68306.00.
< Warning: Vehicle 'flow_0.221' ends teleporting on edge 'gneE4', time 68306.00.
< Warning: Teleporting vehicle 'flow_0.222'; waited too long (jam), lane=':gneJ5_1_1', time=68615.00.
< Warning: Vehicle 'flow_0.222' ends teleporting on edge 'gneE4', time 68615.00.
< Warning: Teleporting vehicle 'flow_0.223'; waited too long (jam), lane=':gneJ5_1_1', time=68924.00.
< Warning: Vehicle 'flow_0.223' ends teleporting on edge 'gneE4', time 68924.00.
< Warning: Teleporting vehicle 'flow_0.224'; waited too long (jam), lane=':gneJ5_1_1', time=69232.00.
< Warning: Vehicle 'flow_0.224' ends teleporting on edge 'gneE4', time 69232.00.
< Warning: Teleporting vehicle 'flow_0.225'; waited too long (jam), lane=':gneJ5_1_1', time=69542.00.
< Warning: Vehicle 'flow_0.225' ends teleporting on edge 'gneE4', time 69542.00.
< Warning: Teleporting vehicle 'flow_0.226'; waited too long (jam), lane=':gneJ5_1_1', time=69851.00.
< Warning: Vehicle 'flow_0.226' ends teleporting on edge 'gneE4', time 69851.00.
< Warning: Teleporting vehicle 'flow_0.227'; waited too long (jam), lane=':gneJ5_1_1', time=70161.00.
< Warning: Vehicle 'flow_0.227' ends teleporting on edge 'gneE4', time 70161.00.
< Warning: Teleporting vehicle 'flow_0.228'; waited too long (jam), lane=':gneJ5_1_1', time=70471.00.
< Warning: Vehicle 'flow_0.228' ends teleporting on edge 'gneE4', time 70471.00.
< Warning: Teleporting vehicle 'flow_0.229'; waited too long (jam), lane=':gneJ5_1_1', time=70781.00.
< Warning: Vehicle 'flow_0.229' ends teleporting on edge 'gneE4', time 70781.00.
< Warning: Teleporting vehicle 'flow_0.230'; waited too long (jam), lane=':gneJ5_1_1', time=71089.00.
< Warning: Vehicle 'flow_0.230' ends teleporting on edge 'gneE4', time 71089.00.
< Warning: Teleporting vehicle 'flow_0.231'; waited too long (jam), lane=':gneJ5_1_1', time=71397.00.
<truncated after showing first 30 lines>

TEST were terminated before completion (TIMEOUT) on ts-sim-winbuild-ba : demandElements routeflow inspect vType ( Last six runs Apr2021 )

Test exceeded wallclock time limit of 600.0 seconds
---------- Differences in errors ----------
429,3600d428
< Warning: Teleporting vehicle 'flow_0.214'; waited too long (jam), lane=':gneJ5_1_1', time=66144.00.
< Warning: Vehicle 'flow_0.214' ends teleporting on edge 'gneE4', time 66144.00.
< Warning: Teleporting vehicle 'flow_0.215'; waited too long (jam), lane=':gneJ5_1_1', time=66452.00.
< Warning: Vehicle 'flow_0.215' ends teleporting on edge 'gneE4', time 66452.00.
< Warning: Teleporting vehicle 'flow_0.216'; waited too long (jam), lane=':gneJ5_1_1', time=66762.00.
< Warning: Vehicle 'flow_0.216' ends teleporting on edge 'gneE4', time 66762.00.
< Warning: Teleporting vehicle 'flow_0.217'; waited too long (jam), lane=':gneJ5_1_1', time=67071.00.
< Warning: Vehicle 'flow_0.217' ends teleporting on edge 'gneE4', time 67071.00.
< Warning: Teleporting vehicle 'flow_0.218'; waited too long (jam), lane=':gneJ5_1_1', time=67380.00.
< Warning: Vehicle 'flow_0.218' ends teleporting on edge 'gneE4', time 67380.00.
< Warning: Teleporting vehicle 'flow_0.219'; waited too long (jam), lane=':gneJ5_1_1', time=67688.00.
< Warning: Vehicle 'flow_0.219' ends teleporting on edge 'gneE4', time 67688.00.
< Warning: Teleporting vehicle 'flow_0.220'; waited too long (jam), lane=':gneJ5_1_1', time=67997.00.
< Warning: Vehicle 'flow_0.220' ends teleporting on edge 'gneE4', time 67997.00.
< Warning: Teleporting vehicle 'flow_0.221'; waited too long (jam), lane=':gneJ5_1_1', time=68306.00.
< Warning: Vehicle 'flow_0.221' ends teleporting on edge 'gneE4', time 68306.00.
< Warning: Teleporting vehicle 'flow_0.222'; waited too long (jam), lane=':gneJ5_1_1', time=68615.00.
< Warning: Vehicle 'flow_0.222' ends teleporting on edge 'gneE4', time 68615.00.
< Warning: Teleporting vehicle 'flow_0.223'; waited too long (jam), lane=':gneJ5_1_1', time=68924.00.
< Warning: Vehicle 'flow_0.223' ends teleporting on edge 'gneE4', time 68924.00.
< Warning: Teleporting vehicle 'flow_0.224'; waited too long (jam), lane=':gneJ5_1_1', time=69232.00.
< Warning: Vehicle 'flow_0.224' ends teleporting on edge 'gneE4', time 69232.00.
< Warning: Teleporting vehicle 'flow_0.225'; waited too long (jam), lane=':gneJ5_1_1', time=69542.00.
< Warning: Vehicle 'flow_0.225' ends teleporting on edge 'gneE4', time 69542.00.
< Warning: Teleporting vehicle 'flow_0.226'; waited too long (jam), lane=':gneJ5_1_1', time=69851.00.
< Warning: Vehicle 'flow_0.226' ends teleporting on edge 'gneE4', time 69851.00.
< Warning: Teleporting vehicle 'flow_0.227'; waited too long (jam), lane=':gneJ5_1_1', time=70161.00.
< Warning: Vehicle 'flow_0.227' ends teleporting on edge 'gneE4', time 70161.00.
< Warning: Teleporting vehicle 'flow_0.228'; waited too long (jam), lane=':gneJ5_1_1', time=70471.00.
<truncated after showing first 30 lines>

TEST were terminated before completion (TIMEOUT) on ts-sim-winbuild-ba : netElements junctions inspect type internal ( Last six runs Apr2021 )

Test exceeded wallclock time limit of 600.0 seconds
---------- Differences in errors ----------
0a1
> Assertion failed: specialLane->getLinkCont().size() == 1, file C:\Users\delphi\Code\sumo\git\src\microsim\MSInternalJunction.cpp, line 60