24Aug19rv1_3_0+0043-3ea23d5e4c - detailed test results for NETEDITCHECKOUTPUT

To reconnect the TextTest GUI to these results, run:

texttestc.py -a neteditcheckoutput -d C:/Users/delphi/Code/sumo/git/tests -reconnect C:/Users/delphi/Code/sumo/msvc12x64Dtexttesttmp/msvc12x64D.31Aug040236.3996 -g

To start TextTest for these tests, run:

texttestc.py -a neteditcheckoutput -d C:/Users/delphi/Code/sumo/git/tests


default: 2148 tests: 1915 succeeded 205 known bugs 26 killed 2 FAILED

Detailed information for the tests that FAILED:

TEST FAILED on ts-sim-winbuild-ba : demandElements flow inspect_selection departPos random_free ( Last six runs Aug2019 )

---------- Differences in errors ----------
111a112,121
> Error: Vehicle 'flowB.14' will not be able to depart using the given velocity (junction too close)!
> Error: Vehicle 'flowB.14' will not be able to depart using the given velocity (junction too close)!
> Error: Vehicle 'flowB.14' will not be able to depart using the given velocity (junction too close)!
> Error: Vehicle 'flowB.14' will not be able to depart using the given velocity (junction too close)!
> Error: Vehicle 'flowB.14' will not be able to depart using the given velocity (junction too close)!
> Error: Vehicle 'flowB.14' will not be able to depart using the given velocity (junction too close)!
> Error: Vehicle 'flowB.14' will not be able to depart using the given velocity (junction too close)!
> Error: Vehicle 'flowB.14' will not be able to depart using the given velocity (junction too close)!
> Error: Vehicle 'flowB.14' will not be able to depart using the given velocity (junction too close)!
> Error: Vehicle 'flowB.14' will not be able to depart using the given velocity (junction too close)!
154,155c164,169
< Warning: Teleporting vehicle 'flowA.13'; waited too long (jam), lane=':gneJ5_2_0', time=3663.00.
< Warning: Vehicle 'flowA.13' ends teleporting on edge 'gneE4', time 3663.00.
---
> Warning: Teleporting vehicle 'flowA.11'; waited too long (jam), lane=':gneJ5_2_0', time=3663.00.
> Warning: Vehicle 'flowA.11' ends teleporting on edge 'gneE4', time 3663.00.
> Warning: Teleporting vehicle 'flowA.12'; waited too long (jam), lane=':gneJ5_2_0', time=3969.00.
> Warning: Vehicle 'flowA.12' ends teleporting on edge 'gneE4', time 3969.00.
> Warning: Teleporting vehicle 'flowA.13'; waited too long (jam), lane=':gneJ5_2_0', time=4274.00.
> Warning: Vehicle 'flowA.13' ends teleporting on edge 'gneE4', time 4274.00.

TEST FAILED on ts-sim-winbuild-ba : netElements junctions inspect pos ( Last six runs Aug2019 )

---------- Differences in errors ----------
0a1,3
> Error: Invalid position for busStop 'busStop_7_0_1'.
> Error: Could not end a stopping place that is not opened.
> Quitting (on error).
---------- New result in exitcode ----------
1

Detailed information for the tests that had known bugs:

TEST had known bugs (#5893) on ts-sim-winbuild-ba : additionalElements access volatileRecomputing ( Last six runs Aug2019 )

See #5893
(This bug was triggered by text found in file 'errors' matching 'Warning: Ignoring invalid access from non-pedestrian lane')
---------- Differences in errors ----------
0a1,9
> Warning: Ignoring invalid access from non-pedestrian lane 'gneE2_1' in busStop 'busStop_gneE1_0_2'.
> Warning: Ignoring invalid access from non-pedestrian lane 'gneE1_1' in busStop 'busStop_gneE1_0_2'.
> Warning: Ignoring invalid access from non-pedestrian lane 'gneE0_1' in busStop 'busStop_gneE1_0_2'.
> Warning: Ignoring invalid access from non-pedestrian lane 'gneE2_3' in busStop 'busStop_gneE2_0_5'.
> Warning: Ignoring invalid access from non-pedestrian lane 'gneE1_1' in busStop 'busStop_gneE2_0_5'.
> Warning: Ignoring invalid access from non-pedestrian lane 'gneE0_1' in busStop 'busStop_gneE2_0_5'.
> Warning: Ignoring invalid access from non-pedestrian lane 'gneE2_3' in busStop 'busStop_gneE4_0_0'.
> Warning: Ignoring invalid access from non-pedestrian lane 'gneE1_1' in busStop 'busStop_gneE4_0_0'.
> Warning: Ignoring invalid access from non-pedestrian lane 'gneE0_1' in busStop 'busStop_gneE4_0_0'.

TEST had known bugs (Routeprobes #5941) on ts-sim-winbuild-ba : additionalElements calibrator inspect routeprobe ( Last six runs Aug2019 )

#5941
(This bug was triggered by text found in file 'errors' matching 'is not known')
---------- Differences in errors ----------
1c1,2
< Warning: No flow intervals in calibrator 'calibrator_gneE2_0'.
---
> Error: The routeProbe 'customRouteProbeName' to use within the calibrator 'calibrator_gneE2_0' is not known.
> Quitting (on error).
---------- New result in exitcode ----------
1

TEST had known bugs (Routeprobes #5941) on ts-sim-winbuild-ba : additionalElements calibrator load routeProbe ( Last six runs Aug2019 )

#5941
(This bug was triggered by text found in file 'errors' matching 'is not known')
---------- Differences in errors ----------
1c1
< Warning: No flow intervals in calibrator 'calibrator01'.
---
> Error: The routeProbe '%%$%$$$' to use within the calibrator 'calibrator01' is not known.
3a4
> Quitting (on error).
---------- New result in exitcode ----------
1

TEST had known bugs (Routeprobes #5941) on ts-sim-winbuild-ba : additionalElements lanecalibrator inspect routeprobe ( Last six runs Aug2019 )

#5941
(This bug was triggered by text found in file 'errors' matching 'is not known')
---------- Differences in errors ----------
1c1,2
< Warning: No flow intervals in calibrator 'laneCalibrator_gneE2_1_0'.
---
> Error: The routeProbe 'customRouteProbeName' to use within the calibrator 'laneCalibrator_gneE3_1_0' is not known.
> Quitting (on error).
---------- New result in exitcode ----------
1

TEST had known bugs (Routeprobes #5941) on ts-sim-winbuild-ba : additionalElements lanecalibrator load routeProbe ( Last six runs Aug2019 )

#5941
(This bug was triggered by text found in file 'errors' matching 'is not known')
---------- Differences in errors ----------
1c1
< Warning: No flow intervals in calibrator 'calibrator01'.
---
> Error: The routeProbe '%%$%$$$' to use within the calibrator 'calibrator01' is not known.
3c3,4
< Warning: No flow intervals in calibrator 'calibrator03'.
---
> Error: The routeProbe 'myRouteProbe' to use within the calibrator 'calibrator03' is not known.
> Quitting (on error).
---------- New result in exitcode ----------
1

198 TESTS had known bugs (Test needed #3045) on ts-sim-winbuild-ba :

#3045
(This bug was triggered by text found in file 'errors' matching 'File 'net.netedit' is not accessible')
---------- New result in errors ----------
Error: File 'net.netedit' is not accessible (No such file or directory).
Quitting (on error).
demandElements flow create begin ( Last six runs Aug2019 )
demandElements flow create end ( Last six runs Aug2019 )
demandElements flow create number ( Last six runs Aug2019 )
demandElements flow create period ( Last six runs Aug2019 )
demandElements flow create probability ( Last six runs Aug2019 )
demandElements flow create vehsPerHour ( Last six runs Aug2019 )
demandElements flow fix ( Last six runs Aug2019 )
demandElements flow inspect begin ( Last six runs Aug2019 )
demandElements flow inspect end ( Last six runs Aug2019 )
demandElements flow inspect genericParameters ( Last six runs Aug2019 )
demandElements flow inspect number ( Last six runs Aug2019 )
demandElements flow inspect period ( Last six runs Aug2019 )
demandElements flow inspect probability ( Last six runs Aug2019 )
demandElements flow inspect vehsPerHour ( Last six runs Aug2019 )
demandElements flow inspect_selection begin ( Last six runs Aug2019 )
demandElements flow inspect_selection end ( Last six runs Aug2019 )
demandElements flow inspect_selection genericParameters ( Last six runs Aug2019 )
demandElements flow inspect_selection number ( Last six runs Aug2019 )
demandElements flow inspect_selection period ( Last six runs Aug2019 )
demandElements flow inspect_selection probability ( Last six runs Aug2019 )
demandElements flow inspect_selection vehsPerHour ( Last six runs Aug2019 )
demandElements flow load genericParameters ( Last six runs Aug2019 )
demandElements person fix ( Last six runs Aug2019 )
demandElements person inspect ( Last six runs Aug2019 )
demandElements person inspect_selection ( Last six runs Aug2019 )
demandElements person load ( Last six runs Aug2019 )
demandElements person volatileRecomputing ( Last six runs Aug2019 )
demandElements personFlow create begin ( Last six runs Aug2019 )
demandElements personFlow create end ( Last six runs Aug2019 )
demandElements personFlow create number ( Last six runs Aug2019 )
demandElements personFlow create period ( Last six runs Aug2019 )
demandElements personFlow create probability ( Last six runs Aug2019 )
demandElements personFlow create vehsPerHour ( Last six runs Aug2019 )
demandElements personFlow fix ( Last six runs Aug2019 )
demandElements personFlow inspect ( Last six runs Aug2019 )
demandElements personFlow inspect_selection ( Last six runs Aug2019 )
demandElements personFlow load ( Last six runs Aug2019 )
demandElements personFlow volatileRecomputing ( Last six runs Aug2019 )
demandElements routeflow create begin ( Last six runs Aug2019 )
demandElements routeflow create end ( Last six runs Aug2019 )
demandElements routeflow create number ( Last six runs Aug2019 )
demandElements routeflow create period ( Last six runs Aug2019 )
demandElements routeflow create probability ( Last six runs Aug2019 )
demandElements routeflow create vehsPerHour ( Last six runs Aug2019 )
demandElements routeflow fix ( Last six runs Aug2019 )
demandElements routeflow inspect begin ( Last six runs Aug2019 )
demandElements routeflow inspect end ( Last six runs Aug2019 )
demandElements routeflow inspect genericParameters ( Last six runs Aug2019 )
demandElements routeflow inspect number ( Last six runs Aug2019 )
demandElements routeflow inspect period ( Last six runs Aug2019 )
demandElements routeflow inspect probability ( Last six runs Aug2019 )
demandElements routeflow inspect vehsPerHour ( Last six runs Aug2019 )
demandElements routeflow inspect_selection begin ( Last six runs Aug2019 )
demandElements routeflow inspect_selection end ( Last six runs Aug2019 )
demandElements routeflow inspect_selection genericParameters ( Last six runs Aug2019 )
demandElements routeflow inspect_selection number ( Last six runs Aug2019 )
demandElements routeflow inspect_selection period ( Last six runs Aug2019 )
demandElements routeflow inspect_selection probability ( Last six runs Aug2019 )
demandElements routeflow inspect_selection vehsPerHour ( Last six runs Aug2019 )
demandElements routeflow load genericParameters ( Last six runs Aug2019 )
demandElements trip fix ( Last six runs Aug2019 )
demandElements trip inspect genericParameters ( Last six runs Aug2019 )
demandElements trip inspect_selection genericParameters ( Last six runs Aug2019 )
demandElements trip load genericParameters ( Last six runs Aug2019 )
demandElements vehicle fix ( Last six runs Aug2019 )
demandElements vehicle inspect genericParameters ( Last six runs Aug2019 )
demandElements vehicle inspect_selection genericParameters ( Last six runs Aug2019 )
demandElements vehicle load genericParameters ( Last six runs Aug2019 )
demandElements vehicletype copy ( Last six runs Aug2019 )
demandElements vehicletype create basic accel ( Last six runs Aug2019 )
demandElements vehicletype create basic color ( Last six runs Aug2019 )
demandElements vehicletype create basic decel ( Last six runs Aug2019 )
demandElements vehicletype create basic default ( Last six runs Aug2019 )
demandElements vehicletype create basic id ( Last six runs Aug2019 )
demandElements vehicletype create basic length ( Last six runs Aug2019 )
demandElements vehicletype create basic maxspeed ( Last six runs Aug2019 )
demandElements vehicletype create basic mingap ( Last six runs Aug2019 )
demandElements vehicletype create basic sigma ( Last six runs Aug2019 )
demandElements vehicletype create basic tau ( Last six runs Aug2019 )
demandElements vehicletype create basic vclass ( Last six runs Aug2019 )
demandElements vehicletype create dialog actionStepLength ( Last six runs Aug2019 )
demandElements vehicletype create dialog boardingduration ( Last six runs Aug2019 )
demandElements vehicletype create dialog carfollowingmodel ( Last six runs Aug2019 )
demandElements vehicletype create dialog carfollowingmodel_params accel ( Last six runs Aug2019 )
demandElements vehicletype create dialog carfollowingmodel_params apparentdecel ( Last six runs Aug2019 )
demandElements vehicletype create dialog carfollowingmodel_params ca_gain_gap_cacc ( Last six runs Aug2019 )
demandElements vehicletype create dialog carfollowingmodel_params ca_gain_gap_dot_cacc ( Last six runs Aug2019 )
demandElements vehicletype create dialog carfollowingmodel_params ca_gain_space ( Last six runs Aug2019 )
demandElements vehicletype create dialog carfollowingmodel_params ca_gain_speed ( Last six runs Aug2019 )
demandElements vehicletype create dialog carfollowingmodel_params cf_cc_c1 ( Last six runs Aug2019 )
demandElements vehicletype create dialog carfollowingmodel_params cf_cc_ccaccel ( Last six runs Aug2019 )
demandElements vehicletype create dialog carfollowingmodel_params cf_cc_ccdecel ( Last six runs Aug2019 )
demandElements vehicletype create dialog carfollowingmodel_params cf_cc_constspacing ( Last six runs Aug2019 )
demandElements vehicletype create dialog carfollowingmodel_params cf_cc_flatbed_d ( Last six runs Aug2019 )
demandElements vehicletype create dialog carfollowingmodel_params cf_cc_flatbed_h ( Last six runs Aug2019 )
demandElements vehicletype create dialog carfollowingmodel_params cf_cc_flatbed_ka ( Last six runs Aug2019 )
demandElements vehicletype create dialog carfollowingmodel_params cf_cc_flatbed_kp ( Last six runs Aug2019 )
demandElements vehicletype create dialog carfollowingmodel_params cf_cc_flatbed_kv ( Last six runs Aug2019 )
demandElements vehicletype create dialog carfollowingmodel_params cf_cc_kp ( Last six runs Aug2019 )
demandElements vehicletype create dialog carfollowingmodel_params cf_cc_lambda ( Last six runs Aug2019 )
demandElements vehicletype create dialog carfollowingmodel_params cf_cc_lanes_count ( Last six runs Aug2019 )
demandElements vehicletype create dialog carfollowingmodel_params cf_cc_omegan ( Last six runs Aug2019 )
demandElements vehicletype create dialog carfollowingmodel_params cf_cc_ploeg_h ( Last six runs Aug2019 )
demandElements vehicletype create dialog carfollowingmodel_params cf_cc_ploeg_kd ( Last six runs Aug2019 )
demandElements vehicletype create dialog carfollowingmodel_params cf_cc_ploeg_kp ( Last six runs Aug2019 )
demandElements vehicletype create dialog carfollowingmodel_params cf_cc_tau ( Last six runs Aug2019 )
demandElements vehicletype create dialog carfollowingmodel_params cf_cc_xi ( Last six runs Aug2019 )
demandElements vehicletype create dialog carfollowingmodel_params cf_idm_delta ( Last six runs Aug2019 )
demandElements vehicletype create dialog carfollowingmodel_params cf_idm_stepping ( Last six runs Aug2019 )
demandElements vehicletype create dialog carfollowingmodel_params cf_idmm_adapt_factor ( Last six runs Aug2019 )
demandElements vehicletype create dialog carfollowingmodel_params cf_idmm_adapt_time ( Last six runs Aug2019 )
demandElements vehicletype create dialog carfollowingmodel_params cf_kerner_phi ( Last six runs Aug2019 )
demandElements vehicletype create dialog carfollowingmodel_params cf_pwagner2009_approb ( Last six runs Aug2019 )
demandElements vehicletype create dialog carfollowingmodel_params cf_pwagner2009_taulast ( Last six runs Aug2019 )
demandElements vehicletype create dialog carfollowingmodel_params cf_w99_cc1 ( Last six runs Aug2019 )
demandElements vehicletype create dialog carfollowingmodel_params cf_w99_cc2 ( Last six runs Aug2019 )
demandElements vehicletype create dialog carfollowingmodel_params cf_w99_cc3 ( Last six runs Aug2019 )
demandElements vehicletype create dialog carfollowingmodel_params cf_w99_cc4 ( Last six runs Aug2019 )
demandElements vehicletype create dialog carfollowingmodel_params cf_w99_cc5 ( Last six runs Aug2019 )
demandElements vehicletype create dialog carfollowingmodel_params cf_w99_cc6 ( Last six runs Aug2019 )
demandElements vehicletype create dialog carfollowingmodel_params cf_w99_cc7 ( Last six runs Aug2019 )
demandElements vehicletype create dialog carfollowingmodel_params cf_w99_cc8 ( Last six runs Aug2019 )
demandElements vehicletype create dialog carfollowingmodel_params cf_w99_cc9 ( Last six runs Aug2019 )
demandElements vehicletype create dialog carfollowingmodel_params cf_wiedemann_estimation ( Last six runs Aug2019 )
demandElements vehicletype create dialog carfollowingmodel_params cf_wiedemann_security ( Last six runs Aug2019 )
demandElements vehicletype create dialog carfollowingmodel_params collision_mingap_factor ( Last six runs Aug2019 )
demandElements vehicletype create dialog carfollowingmodel_params decel ( Last six runs Aug2019 )
demandElements vehicletype create dialog carfollowingmodel_params emergencydecel ( Last six runs Aug2019 )
demandElements vehicletype create dialog carfollowingmodel_params gc_gain_gap_cacc ( Last six runs Aug2019 )
demandElements vehicletype create dialog carfollowingmodel_params gc_gain_gap_dot_cacc ( Last six runs Aug2019 )
demandElements vehicletype create dialog carfollowingmodel_params gc_gain_space ( Last six runs Aug2019 )
demandElements vehicletype create dialog carfollowingmodel_params gc_gain_speed ( Last six runs Aug2019 )
demandElements vehicletype create dialog carfollowingmodel_params gcc_gain_gap_cacc ( Last six runs Aug2019 )
demandElements vehicletype create dialog carfollowingmodel_params gcc_gain_gap_dot_cacc ( Last six runs Aug2019 )
demandElements vehicletype create dialog carfollowingmodel_params gcc_gain_space ( Last six runs Aug2019 )
demandElements vehicletype create dialog carfollowingmodel_params gcc_gain_speed ( Last six runs Aug2019 )
demandElements vehicletype create dialog carfollowingmodel_params headway_time_cacc_to_acc ( Last six runs Aug2019 )
demandElements vehicletype create dialog carfollowingmodel_params k ( Last six runs Aug2019 )
demandElements vehicletype create dialog carfollowingmodel_params sc_gain ( Last six runs Aug2019 )
demandElements vehicletype create dialog carfollowingmodel_params sc_gain_cacc ( Last six runs Aug2019 )
demandElements vehicletype create dialog carfollowingmodel_params sigma ( Last six runs Aug2019 )
demandElements vehicletype create dialog carfollowingmodel_params tau ( Last six runs Aug2019 )
demandElements vehicletype create dialog carfollowingmodel_params tmp1 ( Last six runs Aug2019 )
demandElements vehicletype create dialog carfollowingmodel_params tmp2 ( Last six runs Aug2019 )
demandElements vehicletype create dialog carfollowingmodel_params tmp3 ( Last six runs Aug2019 )
demandElements vehicletype create dialog carfollowingmodel_params tmp4 ( Last six runs Aug2019 )
demandElements vehicletype create dialog carfollowingmodel_params tmp5 ( Last six runs Aug2019 )
demandElements vehicletype create dialog carfollowingmodel_params train_type ( Last six runs Aug2019 )
demandElements vehicletype create dialog color ( Last six runs Aug2019 )
demandElements vehicletype create dialog containercapacity ( Last six runs Aug2019 )
demandElements vehicletype create dialog default ( Last six runs Aug2019 )
demandElements vehicletype create dialog emissionclass ( Last six runs Aug2019 )
demandElements vehicletype create dialog genericParameters ( Last six runs Aug2019 )
demandElements vehicletype create dialog guishape ( Last six runs Aug2019 )
demandElements vehicletype create dialog id ( Last six runs Aug2019 )
demandElements vehicletype create dialog imgfile ( Last six runs Aug2019 )
demandElements vehicletype create dialog impatience ( Last six runs Aug2019 )
demandElements vehicletype create dialog junctionmodel_params jm_crossing_gap ( Last six runs Aug2019 )
demandElements vehicletype create dialog junctionmodel_params jm_drive_after_red_time ( Last six runs Aug2019 )
demandElements vehicletype create dialog junctionmodel_params jm_drive_after_yellow_time ( Last six runs Aug2019 )
demandElements vehicletype create dialog junctionmodel_params jm_drive_red_speed ( Last six runs Aug2019 )
demandElements vehicletype create dialog junctionmodel_params jm_ignore_foe_prob ( Last six runs Aug2019 )
demandElements vehicletype create dialog junctionmodel_params jm_ignore_foe_speed ( Last six runs Aug2019 )
demandElements vehicletype create dialog junctionmodel_params jm_ignore_keep_clear_time ( Last six runs Aug2019 )
demandElements vehicletype create dialog junctionmodel_params jm_sigma_minor ( Last six runs Aug2019 )
demandElements vehicletype create dialog junctionmodel_params jm_timegap_minor ( Last six runs Aug2019 )
demandElements vehicletype create dialog lanechangemodel ( Last six runs Aug2019 )
demandElements vehicletype create dialog lanechangemodel_params lc_accel_lat ( Last six runs Aug2019 )
demandElements vehicletype create dialog lanechangemodel_params lc_assertive ( Last six runs Aug2019 )
demandElements vehicletype create dialog lanechangemodel_params lc_cooperative ( Last six runs Aug2019 )
demandElements vehicletype create dialog lanechangemodel_params lc_impatience ( Last six runs Aug2019 )
demandElements vehicletype create dialog lanechangemodel_params lc_keep_right ( Last six runs Aug2019 )
demandElements vehicletype create dialog lanechangemodel_params lc_lookahead_left ( Last six runs Aug2019 )
demandElements vehicletype create dialog lanechangemodel_params lc_max_speed_lat_factor ( Last six runs Aug2019 )
demandElements vehicletype create dialog lanechangemodel_params lc_max_speed_lat_standing ( Last six runs Aug2019 )
demandElements vehicletype create dialog lanechangemodel_params lc_opposite ( Last six runs Aug2019 )
demandElements vehicletype create dialog lanechangemodel_params lc_overtake_right ( Last six runs Aug2019 )
demandElements vehicletype create dialog lanechangemodel_params lc_pushy ( Last six runs Aug2019 )
demandElements vehicletype create dialog lanechangemodel_params lc_pushy_gap ( Last six runs Aug2019 )
demandElements vehicletype create dialog lanechangemodel_params lc_speed_gain ( Last six runs Aug2019 )
demandElements vehicletype create dialog lanechangemodel_params lc_speed_gain_right ( Last six runs Aug2019 )
demandElements vehicletype create dialog lanechangemodel_params lc_strategic ( Last six runs Aug2019 )
demandElements vehicletype create dialog lanechangemodel_params lc_sublane ( Last six runs Aug2019 )
demandElements vehicletype create dialog lanechangemodel_params lc_time_to_impatience ( Last six runs Aug2019 )
demandElements vehicletype create dialog lanechangemodel_params lc_turn_alignment_distance ( Last six runs Aug2019 )
demandElements vehicletype create dialog latalignment ( Last six runs Aug2019 )
demandElements vehicletype create dialog length ( Last six runs Aug2019 )
demandElements vehicletype create dialog loadingduration ( Last six runs Aug2019 )
demandElements vehicletype create dialog maxspeed ( Last six runs Aug2019 )
demandElements vehicletype create dialog maxspeedlat ( Last six runs Aug2019 )
demandElements vehicletype create dialog mingap ( Last six runs Aug2019 )
demandElements vehicletype create dialog mingaplat ( Last six runs Aug2019 )
demandElements vehicletype create dialog osgfile ( Last six runs Aug2019 )
demandElements vehicletype create dialog personcapacity ( Last six runs Aug2019 )
demandElements vehicletype create dialog speeddev ( Last six runs Aug2019 )
demandElements vehicletype create dialog speedfactor ( Last six runs Aug2019 )
demandElements vehicletype create dialog vclass ( Last six runs Aug2019 )
demandElements vehicletype create dialog width ( Last six runs Aug2019 )

TEST had known bugs (#5875) on ts-sim-winbuild-ba : demandElements routeflow load line ( Last six runs Aug2019 )

See #5875
(This bug was triggered by text found in file 'errors' matching 'Error: Attribute 'line' in definition of flow 'flow_1' is empty')
---------- Differences in errors ----------
0a1
> Error: Attribute 'line' in definition of flow 'flow_1' is empty.

TEST had known bugs (Generic parameters #5895) on ts-sim-winbuild-ba : demandElements vehicletype load genericParameters ( Last six runs Aug2019 )

#5895
(This bug was triggered by text found in file 'errors' matching 'Error: Attribute 'key' in definition of a param is empty.')
---------- New result in errors ----------
Error: Attribute 'key' in definition of a param is empty.
---------- New result in output ----------
Loading configuration... done.

Detailed information for the tests that were terminated before completion:

4 TESTS were terminated before completion (TIMEOUT) on ts-sim-winbuild-ba :

Test exceeded wallclock time limit of 300.0 seconds
demandElements flow create arrivalPosLat ( Last six runs Aug2019 )
demandElements flow create departPos ( Last six runs Aug2019 )
demandElements flow create departPosLat ( Last six runs Aug2019 )
demandElements flow create line ( Last six runs Aug2019 )

TEST were terminated before completion (TIMEOUT) on ts-sim-winbuild-ba : demandElements person create departPos ( Last six runs Aug2019 )

Test exceeded wallclock time limit of 300.0 seconds
---------- Differences in errors ----------
1a2,3
> Warning: Person 'person_6' is jammed on edge 'gneE2', time=302.00.
> Warning: Person 'person_4' is jammed on edge 'gneE2', time=604.00.

TEST were terminated before completion (TIMEOUT) on ts-sim-winbuild-ba : demandElements personFlow create departPos ( Last six runs Aug2019 )

Test exceeded wallclock time limit of 300.0 seconds
---------- Differences in errors ----------
1a2,652
> Warning: Person 'personFlow_6.0' is jammed on edge 'gneE2', time=302.00.
> Warning: Person 'personFlow_7.0' is jammed on edge 'gneE2', time=302.00.
> Warning: Person 'personFlow_4.1' is jammed on edge 'gneE2', time=304.00.
> Warning: Person 'personFlow_6.1' is jammed on edge 'gneE2', time=304.00.
> Warning: Person 'personFlow_7.1' is jammed on edge 'gneE2', time=304.00.
> Warning: Person 'personFlow_4.2' is jammed on edge 'gneE2', time=306.00.
> Warning: Person 'personFlow_6.2' is jammed on edge 'gneE2', time=306.00.
> Warning: Person 'personFlow_4.3' is jammed on edge 'gneE2', time=308.00.
> Warning: Person 'personFlow_6.3' is jammed on edge 'gneE2', time=308.00.
> Warning: Person 'personFlow_7.3' is jammed on edge 'gneE2', time=308.00.
> Warning: Person 'personFlow_4.4' is jammed on edge 'gneE2', time=310.00.
> Warning: Person 'personFlow_6.4' is jammed on edge 'gneE2', time=310.00.
> Warning: Person 'personFlow_7.4' is jammed on edge 'gneE2', time=310.00.
> Warning: Person 'personFlow_4.5' is jammed on edge 'gneE2', time=312.00.
> Warning: Person 'personFlow_6.5' is jammed on edge 'gneE2', time=312.00.
> Warning: Person 'personFlow_7.5' is jammed on edge 'gneE2', time=312.00.
> Warning: Person 'personFlow_4.6' is jammed on edge 'gneE2', time=314.00.
> Warning: Person 'personFlow_6.6' is jammed on edge 'gneE2', time=314.00.
> Warning: Person 'personFlow_7.6' is jammed on edge 'gneE2', time=314.00.
> Warning: Person 'personFlow_4.7' is jammed on edge 'gneE2', time=316.00.
> Warning: Person 'personFlow_6.7' is jammed on edge 'gneE2', time=316.00.
> Warning: Person 'personFlow_7.7' is jammed on edge 'gneE2', time=316.00.
> Warning: Person 'personFlow_4.8' is jammed on edge 'gneE2', time=318.00.
> Warning: Person 'personFlow_6.8' is jammed on edge 'gneE2', time=318.00.
> Warning: Person 'personFlow_7.8' is jammed on edge 'gneE2', time=318.00.
> Warning: Person 'personFlow_4.9' is jammed on edge 'gneE2', time=320.00.
> Warning: Person 'personFlow_6.9' is jammed on edge 'gneE2', time=320.00.
> Warning: Person 'personFlow_7.9' is jammed on edge 'gneE2', time=320.00.
> Warning: Person 'personFlow_4.10' is jammed on edge 'gneE2', time=322.00.
<truncated after showing first 30 lines>

17 TESTS were terminated before completion (TIMEOUT) on ts-sim-winbuild-ba :

Test exceeded wallclock time limit of 300.0 seconds
---------- Differences in errors ----------
3,10c3
< The number of lanes needs to be specified in the attributes of carFollowing-CC with the "lanesCount" attribute
< Error: The number of lanes needs to be specified in the attributes of carFollowing-CC with the "lanesCount" attribute
< The number of lanes needs to be specified in the attributes of carFollowing-CC with the "lanesCount" attribute
< Error: The number of lanes needs to be specified in the attributes of carFollowing-CC with the "lanesCount" attribute
< The number of lanes needs to be specified in the attributes of carFollowing-CC with the "lanesCount" attribute
< Error: The number of lanes needs to be specified in the attributes of carFollowing-CC with the "lanesCount" attribute
< The number of lanes needs to be specified in the attributes of carFollowing-CC with the "lanesCount" attribute
< Error: The number of lanes needs to be specified in the attributes of carFollowing-CC with the "lanesCount" attribute
---
> Assertion failed: false, file C:\Users\delphi\Code\sumo\git\src\microsim\cfmodels\MSCFModel_CC.cpp, line 66
demandElements vehicletype load carfollowingmodel_params cf_cc_c1 ( Last six runs Aug2019 )
demandElements vehicletype load carfollowingmodel_params cf_cc_ccaccel ( Last six runs Aug2019 )
demandElements vehicletype load carfollowingmodel_params cf_cc_ccdecel ( Last six runs Aug2019 )
demandElements vehicletype load carfollowingmodel_params cf_cc_constspacing ( Last six runs Aug2019 )
demandElements vehicletype load carfollowingmodel_params cf_cc_flatbed_d ( Last six runs Aug2019 )
demandElements vehicletype load carfollowingmodel_params cf_cc_flatbed_h ( Last six runs Aug2019 )
demandElements vehicletype load carfollowingmodel_params cf_cc_flatbed_ka ( Last six runs Aug2019 )
demandElements vehicletype load carfollowingmodel_params cf_cc_flatbed_kp ( Last six runs Aug2019 )
demandElements vehicletype load carfollowingmodel_params cf_cc_flatbed_kv ( Last six runs Aug2019 )
demandElements vehicletype load carfollowingmodel_params cf_cc_kp ( Last six runs Aug2019 )
demandElements vehicletype load carfollowingmodel_params cf_cc_lambda ( Last six runs Aug2019 )
demandElements vehicletype load carfollowingmodel_params cf_cc_omegan ( Last six runs Aug2019 )
demandElements vehicletype load carfollowingmodel_params cf_cc_ploeg_h ( Last six runs Aug2019 )
demandElements vehicletype load carfollowingmodel_params cf_cc_ploeg_kd ( Last six runs Aug2019 )
demandElements vehicletype load carfollowingmodel_params cf_cc_ploeg_kp ( Last six runs Aug2019 )
demandElements vehicletype load carfollowingmodel_params cf_cc_tau ( Last six runs Aug2019 )
demandElements vehicletype load carfollowingmodel_params cf_cc_xi ( Last six runs Aug2019 )

TEST were terminated before completion (TIMEOUT) on ts-sim-winbuild-ba : demandElements vehicletype load carfollowingmodel_params cf_cc_lanes_count ( Last six runs Aug2019 )

Test exceeded wallclock time limit of 300.0 seconds
---------- Differences in errors ----------
2a3
> Assertion failed: false, file C:\Users\delphi\Code\sumo\git\src\microsim\cfmodels\MSCFModel_CC.cpp, line 66

TEST were terminated before completion (TIMEOUT) on ts-sim-winbuild-ba : netElements junctions inspect type internal ( Last six runs Aug2019 )

Test exceeded wallclock time limit of 300.0 seconds
---------- Differences in errors ----------
0a1
> Assertion failed: specialLane->getLinkCont().size() == 1, file C:\Users\delphi\Code\sumo\git\src\microsim\MSInternalJunction.cpp, line 61

TEST were terminated before completion (TIMEOUT) on ts-sim-winbuild-ba : netElements junctions inspect_selected type rail_signal ( Last six runs Aug2019 )

Test exceeded wallclock time limit of 300.0 seconds
---------- Differences in errors ----------
1,2c1
< Warning: Found circular block after railSignal junction 'Center_16' (0 edges, length 12.80)
< Warning: Found circular block after railSignal junction 'Center_17' (0 edges, length 12.80)
---
> Assertion failed: myLanes.size() > 0, file C:\Users\delphi\Code\sumo\git\src\microsim\traffic_lights\MSRailSignal.cpp, line 87