23Oct19rv1_3_1+0673-8c371fdc03 - detailed test results for TRACI

To reconnect the TextTest GUI to these results, run:

texttestc.py -a traci -d C:/Users/delphi/Code/sumo/git/tests -reconnect C:/Users/delphi/Code/sumo/msvc12x64Dtexttesttmp/msvc12x64D.31Oct032441.22296 -g

To start TextTest for these tests, run:

texttestc.py -a traci -d C:/Users/delphi/Code/sumo/git/tests


default: 591 tests: 590 succeeded 1 FAILED

Detailed information for the tests that FAILED:

TEST FAILED on ts-sim-winbuild-ba : set_variable Vehicle MoveToVTD set_angle ( Last six runs Oct2019 )

---------- Differences in errors ----------
2,3d1
< Warning: Vehicle 'veh0' performs emergency braking with decel=-9.00 wished=4.50 severity=1.00, time=3.00.
< Warning: Vehicle 'veh0' performs emergency braking with decel=-9.00 wished=4.50 severity=1.00, time=4.00.