30Oct19rv1_3_1+0725-907361489d - detailed test results for COMPLEX

To reconnect the TextTest GUI to these results, run:

texttestc.py -a complex -d C:/Users/delphi/Code/sumo/git/tests -reconnect C:/Users/delphi/Code/sumo/msvc12x64texttesttmp/msvc12x64.03Nov021224.26488 -g

To start TextTest for these tests, run:

texttestc.py -a complex -d C:/Users/delphi/Code/sumo/git/tests


default: 303 tests: 277 succeeded 15 known bugs 11 FAILED

Detailed information for the tests that FAILED:

TEST FAILED on ts-sim-winbuild-ba : netconvert osm_roundtrip ( Last six runs Nov2019 Oct2019 )

---------- Differences in net ----------
22c22
<     <type id="highway.secondary" priority="11" numLanes="2" speed="27.78" disallow="tram rail_urban rail rail_electric rail_fast ship" oneway="0"/>
---
>     <type id="highway.secondary" priority="11" numLanes="1" speed="27.78" disallow="tram rail_urban rail rail_electric rail_fast ship" oneway="0"/>

TEST FAILED on ts-sim-winbuild-ba : sumo ToCDevice ToC_with_sampled_responseTime ( Last six runs Nov2019 Oct2019 )

---------- Differences in fcd ----------
648c648
<         <vehicle id="ToC_veh" x="54.37" y="1327.89" angle="162.00" type="automated@ToC_veh" speed="19.60" pos="191.19" lane="6/1to7/1_0" slope="0.00"/>
---
>         <vehicle id="ToC_veh" x="54.13" y="1328.63" angle="162.00" type="manual" speed="18.82" pos="190.41" lane="6/1to7/1_0" slope="0.00"/>
651c651
<         <vehicle id="ToC_veh" x="60.32" y="1309.59" angle="162.00" type="manual" speed="19.24" pos="210.43" lane="6/1to7/1_0" slope="0.00"/>
---
>         <vehicle id="ToC_veh" x="60.07" y="1310.33" angle="162.00" type="manual" speed="19.24" pos="209.65" lane="6/1to7/1_0" slope="0.00"/>
654c654
<         <vehicle id="ToC_veh" x="66.14" y="1291.68" angle="162.00" type="manual" speed="18.84" pos="229.26" lane="6/1to7/1_0" slope="0.00"/>
---
>         <vehicle id="ToC_veh" x="65.89" y="1292.42" angle="162.00" type="manual" speed="18.84" pos="228.48" lane="6/1to7/1_0" slope="0.00"/>
657c657
<         <vehicle id="ToC_veh" x="72.16" y="1273.12" angle="162.00" type="manual" speed="19.51" pos="248.77" lane="6/1to7/1_0" slope="0.00"/>
---
>         <vehicle id="ToC_veh" x="71.92" y="1273.87" angle="162.00" type="manual" speed="19.51" pos="247.99" lane="6/1to7/1_0" slope="0.00"/>
660c660
<         <vehicle id="ToC_veh" x="78.09" y="1254.88" angle="162.00" type="manual" speed="19.19" pos="267.96" lane="6/1to7/1_0" slope="0.00"/>
---
>         <vehicle id="ToC_veh" x="77.85" y="1255.62" angle="162.00" type="manual" speed="19.19" pos="267.17" lane="6/1to7/1_0" slope="0.00"/>
663c663
<         <vehicle id="ToC_veh" x="84.05" y="1236.55" angle="162.00" type="manual" speed="19.27" pos="287.23" lane="6/1to7/1_0" slope="0.00"/>
---
>         <vehicle id="ToC_veh" x="83.81" y="1237.29" angle="162.00" type="manual" speed="19.27" pos="286.45" lane="6/1to7/1_0" slope="0.00"/>
666c666
<         <vehicle id="ToC_veh" x="90.02" y="1218.16" angle="162.00" type="manual" speed="19.33" pos="306.56" lane="6/1to7/1_0" slope="0.00"/>
---
>         <vehicle id="ToC_veh" x="89.78" y="1218.90" angle="162.00" type="manual" speed="19.33" pos="305.78" lane="6/1to7/1_0" slope="0.00"/>
669c669
<         <vehicle id="ToC_veh" x="95.76" y="1200.50" angle="162.00" type="manual" speed="18.56" pos="325.13" lane="6/1to7/1_0" slope="0.00"/>
<truncated after showing first 30 lines>
---------- Differences in output ----------
1088,1090c1088,1090
<   currentAwareness = 1.00
<   currentSpeed = 19.6
<   state = PREPARING_TOC
---
>   currentAwareness = 0.25
>   currentSpeed = 18.8176383486
>   state = RECOVERING
1093c1093
<   currentAwareness = 0.25
---
>   currentAwareness = 0.35
1098c1098
<   currentAwareness = 0.35
---
>   currentAwareness = 0.45
1103c1103
<   currentAwareness = 0.45
---
>   currentAwareness = 0.55
1108c1108
<   currentAwareness = 0.55
---
>   currentAwareness = 0.65
1113c1113
<   currentAwareness = 0.65
---
>   currentAwareness = 0.75
1118c1118
<   currentAwareness = 0.75
<truncated after showing first 30 lines>
---------- Differences in tocs ----------
6c6
<     <ToCdown id="ToC_veh" t="215.00" lane="6/1to7/1_0" lanePos="0.19"/>
---
>     <ToCdown id="ToC_veh" t="214.00" lane="6/1to7/1_0" lanePos="0.17"/>

TEST FAILED on ts-sim-winbuild-ba : sumo ToCDevice dynamic_ToC ( Last six runs Nov2019 Oct2019 )

---------- Differences in output ----------
348,351c348,352
<   currentAwareness = 1.00
<   currentSpeed = 13.89
<   state = PREPARING_TOC
< Time 54.0: Current lane of veh 'ToC_veh': WE_1
---
>   currentAwareness = 0.25
>   currentSpeed = 13.60330855
>   state = RECOVERING
> Switched to manual mode: Allowing LCs!
> Time 54.0: Current lane of veh 'ToC_veh': WE_0
354c355
<   currentAwareness = 0.25
---
>   currentAwareness = 0.35
361,362c362,363
<   currentAwareness = 0.35
<   currentSpeed = 13.5805231258
---
>   currentAwareness = 0.45
>   currentSpeed = 13.3196243835
368,369c369,370
<   currentAwareness = 0.45
<   currentSpeed = 13.3196243835
---
>   currentAwareness = 0.55
>   currentSpeed = 13.244425754
375,376c376,377
<   currentAwareness = 0.55
<   currentSpeed = 13.244425754
<truncated after showing first 30 lines>
---------- Differences in tocs ----------
7c7
<     <ToCdown id="ToC_veh" t="53.00" lane="WE_1" lanePos="0.69"/>
---
>     <ToCdown id="ToC_veh" t="52.00" lane="WE_1" lanePos="0.68"/>

TEST FAILED on ts-sim-winbuild-ba : sumo ToCDevice dynamic_ToC_stop ( Last six runs Nov2019 Oct2019 )

---------- Differences in output ----------
556,561d555
<   currentAwareness = 1.00
<   currentSpeed = 0.0
<   state = PREPARING_TOC
< Time 90.0: Current lane of veh 'ToC_veh': WE_1
< time 90.0
< ToC device infos for vehicle 'ToC_veh'
566,567c560,561
< Time 91.0: Current lane of veh 'ToC_veh': WE_0
< time 91.0
---
> Time 90.0: Current lane of veh 'ToC_veh': WE_0
> time 90.0
573,574c567,568
< Time 92.0: Current lane of veh 'ToC_veh': :gneJ1_0_0
< time 92.0
---
> Time 91.0: Current lane of veh 'ToC_veh': :gneJ1_0_0
> time 91.0
580,581c574,575
< Time 93.0: Current lane of veh 'ToC_veh': :gneJ1_0_0
< time 93.0
---
> Time 92.0: Current lane of veh 'ToC_veh': :gneJ1_0_0
> time 92.0
587,588c581,582
< Time 94.0: Current lane of veh 'ToC_veh': NS_0
< time 94.0
---
> Time 93.0: Current lane of veh 'ToC_veh': NS_0
<truncated after showing first 30 lines>
---------- Differences in tocs ----------
7c7
<     <ToCdown id="ToC_veh" t="89.00" lane="WE_1" lanePos="0.99"/>
---
>     <ToCdown id="ToC_veh" t="88.00" lane="WE_1" lanePos="0.99"/>

TEST FAILED on ts-sim-winbuild-ba : traas webservice ( Last six runs Nov2019 Oct2019 )

---------- Differences in errors ----------
0a1,49
> Okt 30, 2019 2:21:22 AM com.sun.xml.ws.server.sei.TieHandler createResponse
> SCHWERWIEGEND: null
> java.lang.NullPointerException
> 	at de.tudresden.sumo.util.Sumo.start_ws(Sumo.java:140)
> 	at de.tudresden.ws.ServiceImpl.start(ServiceImpl.java:66)
> 	at sun.reflect.NativeMethodAccessorImpl.invoke0(Native Method)
> 	at sun.reflect.NativeMethodAccessorImpl.invoke(Unknown Source)
> 	at sun.reflect.DelegatingMethodAccessorImpl.invoke(Unknown Source)
> 	at java.lang.reflect.Method.invoke(Unknown Source)
> 	at com.sun.xml.ws.util.Trampoline.invoke(MethodUtil.java:82)
> 	at sun.reflect.NativeMethodAccessorImpl.invoke0(Native Method)
> 	at sun.reflect.NativeMethodAccessorImpl.invoke(Unknown Source)
> 	at sun.reflect.DelegatingMethodAccessorImpl.invoke(Unknown Source)
> 	at java.lang.reflect.Method.invoke(Unknown Source)
> 	at com.sun.xml.ws.util.MethodUtil.invoke(MethodUtil.java:107)
> 	at com.sun.xml.ws.api.server.MethodUtil.invoke(MethodUtil.java:64)
> 	at com.sun.xml.ws.api.server.InstanceResolver$1.invoke(InstanceResolver.java:250)
> 	at com.sun.xml.ws.server.InvokerTube$2.invoke(InvokerTube.java:149)
> 	at com.sun.xml.ws.server.sei.SEIInvokerTube.processRequest(SEIInvokerTube.java:88)
> 	at com.sun.xml.ws.api.pipe.Fiber.__doRun(Fiber.java:1136)
> 	at com.sun.xml.ws.api.pipe.Fiber._doRun(Fiber.java:1050)
> 	at com.sun.xml.ws.api.pipe.Fiber.doRun(Fiber.java:1019)
> 	at com.sun.xml.ws.api.pipe.Fiber.runSync(Fiber.java:877)
> 	at com.sun.xml.ws.server.WSEndpointImpl$2.process(WSEndpointImpl.java:419)
> 	at com.sun.xml.ws.transport.http.HttpAdapter$HttpToolkit.handle(HttpAdapter.java:868)
> 	at com.sun.xml.ws.transport.http.HttpAdapter.handle(HttpAdapter.java:422)
> 	at com.sun.xml.ws.transport.http.server.WSHttpHandler.handleExchange(WSHttpHandler.java:113)
> 	at com.sun.xml.ws.transport.http.server.WSHttpHandler.handle(WSHttpHandler.java:97)
> 	at com.sun.net.httpserver.Filter$Chain.doFilter(Unknown Source)
<truncated after showing first 30 lines>

TEST FAILED on ts-sim-winbuild-ba : traci openGap braking_leader_spaceGap ( Last six runs Nov2019 Oct2019 )

---------- Differences in errors ----------
0a1,8
> Traceback (most recent call last):
>   File "C:/Users/delphi/Code/sumo/git/tests\..\tests/complex/traci/openGap/runner.py", line 157, in <module>
>     runSingle(targetTimeHeadway, targetSpaceHeadway, duration, changeRate, maxDecel, refVehID)
>   File "C:/Users/delphi/Code/sumo/git/tests\..\tests/complex/traci/openGap/runner.py", line 67, in runSingle
>     leader = results[tc.VAR_LEADER][0]
> TypeError: 'NoneType' object has no attribute '__getitem__'
> Error: tcpip::Socket::recvAndCheck @ recv: Socket reset by peer
> Quitting (on error).
---------- Differences in output ----------
194,405c194,830
< Time 81.0: Gap 'follower'->'leader' = 1.497 (headway=170.229)
< 'follower' speed = 0.00879171239847
< Current/target headway: 170.229/5.0
< Time 82.0: Gap 'follower'->'leader' = 2.485 (headway=176.593)
< 'follower' speed = 0.0140729040965
< Current/target headway: 176.593/5.0
< Time 83.0: Gap 'follower'->'leader' = 3.470 (headway=201.193)
< 'follower' speed = 0.0172446677202
< Current/target headway: 201.193/5.0
< Time 84.0: Gap 'follower'->'leader' = 4.451 (headway=232.453)
< 'follower' speed = 0.0191493204353
< Current/target headway: 232.453/5.0
< Time 85.0: Gap 'follower'->'leader' = 5.432 (headway=267.659)
< 'follower' speed = 0.0202929842656
< Current/target headway: 267.659/5.0
< Time 86.0: Gap 'follower'->'leader' = 6.411 (headway=305.579)
< 'follower' speed = 0.0209796755018
< Current/target headway: 305.579/5.0
< Time 87.0: Gap 'follower'->'leader' = 7.390 (headway=345.446)
< 'follower' speed = 0.0213919751173
< Current/target headway: 345.446/5.0
< Time 88.0: Gap 'follower'->'leader' = 8.368 (headway=386.712)
< 'follower' speed = 0.021639521926
< Current/target headway: 386.712/5.0
< Time 89.0: Gap 'follower'->'leader' = 9.347 (headway=428.974)
< 'follower' speed = 0.0217881488595
< Current/target headway: 428.974/5.0
< Time 90.0: Gap 'follower'->'leader' = 10.325 (headway=471.935)
< 'follower' speed = 0.0218773838476
<truncated after showing first 30 lines>

TEST FAILED on ts-sim-winbuild-ba : traci openGap reference_vehicle_removed ( Last six runs Nov2019 Oct2019 )

---------- Differences in output ----------
113,121c113,121
< Time 54.0: Gap 'follower'->'merger' = 4.988 (headway=0.389)
< 'follower' speed = 12.826237305
< Current/target headway: 0.389/5.0
< Time 55.0: Gap 'follower'->'merger' = 12.577 (headway=1.123)
< 'follower' speed = 11.1962195677
< Current/target headway: 1.123/5.0
< Time 56.0: Gap 'follower'->'merger' = 21.480 (headway=2.107)
< 'follower' speed = 10.196890892
< Current/target headway: 2.107/5.0
---
> Time 54.0: Gap 'follower'->'merger' = 5.434 (headway=0.455)
> 'follower' speed = 11.9333081083
> Current/target headway: 0.455/5.0
> Time 55.0: Gap 'follower'->'merger' = 13.815 (headway=1.315)
> 'follower' speed = 10.505896221
> Current/target headway: 1.315/5.0
> Time 56.0: Gap 'follower'->'merger' = 23.265 (headway=2.375)
> 'follower' speed = 9.794292789
> Current/target headway: 2.375/5.0
123,124c123,124
< Time 57.0: Gap 'follower'->'merger' = 21.480 (headway=2.160)
< 'follower' speed = 9.9428744437
---
> Time 57.0: Gap 'follower'->'merger' = 23.265 (headway=2.388)
> 'follower' speed = 9.74342907963
126,127c126,127
< Time 58.0: Gap 'follower'->'merger' = 21.480 (headway=1.713)
< 'follower' speed = 12.5428744437
---
<truncated after showing first 30 lines>

TEST FAILED on ts-sim-winbuild-ba : traci openGap without_maxDecel_slow_spacegap ( Last six runs Nov2019 Oct2019 )

---------- Differences in errors ----------
0a1,8
> Traceback (most recent call last):
>   File "C:/Users/delphi/Code/sumo/git/tests\..\tests/complex/traci/openGap/runner.py", line 157, in <module>
>     runSingle(targetTimeHeadway, targetSpaceHeadway, duration, changeRate, maxDecel, refVehID)
>   File "C:/Users/delphi/Code/sumo/git/tests\..\tests/complex/traci/openGap/runner.py", line 67, in runSingle
>     leader = results[tc.VAR_LEADER][0]
> TypeError: 'NoneType' object has no attribute '__getitem__'
> Error: tcpip::Socket::recvAndCheck @ recv: Socket reset by peer
> Quitting (on error).
---------- Differences in output ----------
130,589c130,260700
< Time 60.0: Gap 'follower'->'leader' = 30.719 (headway=1.761)
< 'follower' speed = 17.4419792638
< Current/target headway: 1.761/-1.0
< Time 61.0: Gap 'follower'->'leader' = 32.916 (headway=1.896)
< 'follower' speed = 17.3636746672
< Current/target headway: 1.896/-1.0
< Time 62.0: Gap 'follower'->'leader' = 35.183 (headway=2.033)
< 'follower' speed = 17.3030857398
< Current/target headway: 2.033/-1.0
< Time 63.0: Gap 'follower'->'leader' = 37.503 (headway=2.173)
< 'follower' speed = 17.2562910439
< Current/target headway: 2.173/-1.0
< Time 64.0: Gap 'follower'->'leader' = 39.865 (headway=2.315)
< 'follower' speed = 17.2202021277
< Current/target headway: 2.315/-1.0
< Time 65.0: Gap 'follower'->'leader' = 42.259 (headway=2.458)
< 'follower' speed = 17.192400874
< Current/target headway: 2.458/-1.0
< Time 66.0: Gap 'follower'->'leader' = 44.677 (headway=2.602)
< 'follower' speed = 17.1710026486
< Current/target headway: 2.602/-1.0
< Time 67.0: Gap 'follower'->'leader' = 47.114 (headway=2.746)
< 'follower' speed = 17.1545437988
< Current/target headway: 2.746/-1.0
< Time 68.0: Gap 'follower'->'leader' = 49.566 (headway=2.892)
< 'follower' speed = 17.141890724
< Current/target headway: 2.892/-1.0
< Time 69.0: Gap 'follower'->'leader' = 52.029 (headway=3.037)
< 'follower' speed = 17.1321673023
<truncated after showing first 30 lines>

TEST FAILED on ts-sim-winbuild-ba : traci pythonApi gui ( Last six runs Nov2019 Oct2019 )

---------- Differences in png ----------
Binary files C:/Users/delphi/Code/sumo/msvc12x64texttesttmp/msvc12x64.30Oct021708.10168/complex/traci/pythonApi/gui/framework_tmp/png.complexorigcmp and C:/Users/delphi/Code/sumo/msvc12x64texttesttmp/msvc12x64.30Oct021708.10168/complex/traci/pythonApi/gui/framework_tmp/png.complexcmp differ

TEST FAILED on ts-sim-winbuild-ba : tutorial city_mobil ( Last six runs Nov2019 Oct2019 )

---------- Differences in output ----------
4c4
< waiting time (max, mean, dev): True True True
---
> waiting time (max, mean, dev): False True False
20c20
< ('footmainout', 'footmain7to8') True True True
---
> ('footmainout', 'footmain7to8') True True False
22c22
< waiting time (max, mean, dev): True True True
---
> waiting time (max, mean, dev): False True False
38c38
< ('footmainout', 'footmain7to8') True True True
---
> ('footmainout', 'footmain7to8') True True False

TEST FAILED on ts-sim-winbuild-ba : tutorial san_pablo_dam ( Last six runs Nov2019 Oct2019 )

---------- Differences in errors ----------
1,79c1,4
< Warning: Value of tau=0.904054570616 in car following model 'carFollowing-Krauss' lower than simulation step size may cause collisions
< Warning: Teleporting vehicle '912'; collision with vehicle '911', lane='1to7_0', gap=-0.16, time=26957.00 stage=move.
< Warning: Vehicle '912' ends teleporting on edge '7to8', time 26980.00.
< Warning: Teleporting vehicle '852'; collision with vehicle '851', lane='1to7_0', gap=-0.03, time=27110.00 stage=move.
< Warning: Vehicle '852' ends teleporting on edge '7to8', time 27110.00.
< Warning: Teleporting vehicle '938'; collision with vehicle '937', lane='1to7_0', gap=-0.05, time=27137.00 stage=move.
< Warning: Vehicle '938' ends teleporting on edge '7to8', time 27144.00.
< Warning: Teleporting vehicle '949'; collision with vehicle '948', lane='1to7_0', gap=-0.01, time=27226.00 stage=move.
< Warning: Vehicle '949' ends teleporting on edge '7to8', time 27226.00.
< Warning: Teleporting vehicle '872'; collision with vehicle '871', lane='1to7_0', gap=-0.00, time=27352.00 stage=move.
< Warning: Vehicle '872' ends teleporting on edge '7to8', time 27352.00.
< Warning: Teleporting vehicle '929'; collision with vehicle '928', lane='1to7_0', gap=-0.02, time=27379.00 stage=move.
< Warning: Vehicle '929' ends teleporting on edge '7to8', time 27379.00.
< Warning: Teleporting vehicle '977'; collision with vehicle '976', lane='1to7_0', gap=-0.10, time=27383.00 stage=move.
< Warning: Vehicle '977' ends teleporting on edge '7to8', time 27383.00.
< Warning: Teleporting vehicle '926'; collision with vehicle '925', lane='1to7_0', gap=-0.02, time=27387.00 stage=move.
< Warning: Vehicle '926' ends teleporting on edge '7to8', time 27388.00.
< Warning: Teleporting vehicle '982'; collision with vehicle '981', lane='1to7_0', gap=-0.11, time=27406.00 stage=move.
< Warning: Vehicle '982' ends teleporting on edge '7to8', time 27411.00.
< Warning: Teleporting vehicle '919'; collision with vehicle '918', lane='1to7_0', gap=-0.16, time=27417.00 stage=move.
< Warning: Vehicle '919' ends teleporting on edge '7to8', time 27418.00.
< Warning: Teleporting vehicle '958'; collision with vehicle '957', lane='1to7_0', gap=-0.01, time=27423.00 stage=move.
< Warning: Vehicle '958' ends teleporting on edge '7to8', time 27423.00.
< Warning: Teleporting vehicle '1007'; collision with vehicle '1006', lane='1to7_0', gap=-0.00, time=27428.00 stage=move.
< Warning: Teleporting vehicle '1030'; collision with vehicle '1029', lane='1to7_0', gap=-0.07, time=27429.00 stage=move.
< Warning: Vehicle '1007' ends teleporting on edge '7to8', time 27429.00.
< Warning: Vehicle '1030' ends teleporting on edge '7to8', time 27437.00.
< Warning: Teleporting vehicle '1089'; collision with vehicle '1088', lane='1to7_0', gap=-0.05, time=27482.00 stage=move.
< Warning: Vehicle '1089' ends teleporting on edge '7to8', time 27482.00.
<truncated after showing first 30 lines>
---------- Differences in output ----------
1,286d0
< Parsing nodes from (FILE)
< Parsing edges from (FILE)
<  Import done:
<    3 nodes loaded.
<    2 edges loaded.
< Removing self-loops... done ((TIME)).
< Removing empty nodes... done ((TIME)).
<    0 nodes removed.
< Moving network to origin... done ((TIME)).
< Computing turning directions... done ((TIME)).
< Assigning nodes to traffic lights... done ((TIME)).
< Sorting nodes' edges... done ((TIME)).
< Computing node shapes... done ((TIME)).
< Computing edge shapes... done ((TIME)).
< Computing node types... done ((TIME)).
< Computing priorities... done ((TIME)).
< Computing approached edges... done ((TIME)).
< Guessing and setting roundabouts... done ((TIME)).
< Computing approaching lanes... done ((TIME)).
< Dividing of lanes on approached lanes... done ((TIME)).
< Processing turnarounds... done ((TIME)).
< Rechecking of lane endings... done ((TIME)).
< Computing traffic light control information... done ((TIME)).
< Computing node logics... done ((TIME)).
< Computing traffic light logics... done ((TIME)).
<  0 traffic light(s) computed.
< Building inner edges... done ((TIME)).
< -----------------------------------------------------
< Summary:
<truncated after showing first 30 lines>
---------- Missing result in net ----------
<?xml version="1.0" encoding="UTF-8"?>


<net version="1.3" junctionCornerDetail="5" limitTurnSpeed="5.50" xmlns:xsi="http://www.w3.org/2001/XMLSchema-instance" xsi:noNamespaceSchemaLocation="http://sumo.dlr.de/xsd/net_file.xsd">

    <location netOffset="0.00,0.00" convBoundary="0.00,0.00,6039.00,0.00" origBoundary="0.00,0.00,6039.00,0.00" projParameter="!"/>

    <edge id=":obs7_0" function="internal">
        <lane id=":obs7_0_0" index="0" speed="40.00" length="0.10" shape="5713.17,-1.60 5713.17,-1.60"/>
    </edge>

    <edge id="1to7" from="obs1" to="obs7" priority="-1">
        <lane id="1to7_0" index="0" speed="40.00" length="5713.17" shape="0.00,-1.60 5713.17,-1.60"/>
    </edge>
    <edge id="7to8" from="obs7" to="obs8" priority="-1">
        <lane id="7to8_0" index="0" speed="40.00" length="325.83" shape="5713.17,-1.60 6039.00,-1.60"/>
    </edge>

    <junction id="obs1" type="dead_end" x="0.00" y="0.00" incLanes="" intLanes="" shape="0.00,0.00 0.00,-3.20"/>
    <junction id="obs7" type="priority" x="5713.17" y="0.00" incLanes="1to7_0" intLanes=":obs7_0_0" shape="5713.17,0.00 5713.17,-3.20 5713.17,0.00">
        <request index="0" response="0" foes="0" cont="0"/>
    </junction>
    <junction id="obs8" type="dead_end" x="6039.00" y="0.00" incLanes="7to8_0" intLanes="" shape="6039.00,-3.20 6039.00,0.00"/>

    <connection from="1to7" to="7to8" fromLane="0" toLane="0" via=":obs7_0_0" dir="s" state="M"/>

    <connection from=":obs7_0" to="7to8" fromLane="0" toLane="0" dir="s" state="M"/>

</net>
---------- Missing result in results ----------
22.000 2.000 2.000 5.000 0.500 1.500 254.521172884
23.000 2.000 2.000 5.000 0.500 1.500 252.187703146
23.000 3.000 2.000 5.000 0.500 1.500 300.463933337
23.000 2.000 3.000 5.000 0.500 1.500 237.227879634
23.000 2.000 3.000 6.000 0.500 1.500 250.94743721
23.000 2.000 3.000 5.000 1.500 1.500 1161.53206027
23.000 2.000 3.000 5.000 0.500 2.500 321.888011822
23.037 1.241 3.235 4.784 0.100 1.100 87.9459779998
23.043 2.239 3.279 4.744 0.100 1.100 86.5420793074
23.101 2.244 3.645 4.409 0.100 1.100 90.13106821
23.291 2.239 3.240 4.744 0.100 1.100 86.9808538177
22.945 2.274 2.866 4.482 0.100 1.100 88.4326458656
23.043 2.239 3.279 4.744 -0.077 1.277 85.2089548362
22.960 2.319 3.242 5.160 0.100 1.100 79.1583887736
22.887 2.385 3.099 5.629 0.100 1.100 68.971208791
22.891 2.426 2.878 6.075 0.100 1.100 65.1921181665
22.549 2.542 3.094 6.346 0.100 1.100 62.5333267206
22.835 2.726 3.347 6.611 0.100 1.100 63.8786397834
22.569 2.324 3.170 6.403 0.041 1.053 64.8360860592
22.476 2.993 2.909 6.260 0.100 1.100 63.6058813565
22.549 2.542 3.094 6.346 0.255 0.904 27687.5396788
22.549 2.542 3.094 6.346 0.100 1.600 203.105904424
22.274 2.374 2.917 6.684 0.100 1.100 64.5588459734
22.425 2.530 3.273 6.225 0.100 1.100 62.9929757374
22.622 2.488 3.053 6.270 0.100 1.100 63.1665708754
22.549 2.542 3.094 6.346 0.051 1.061 64.6478853192
22.549 2.542 3.094 6.346 0.100 1.225 93.2607360628
22.520 2.571 3.056 6.317 0.100 1.100 62.6161137238
22.552 2.547 3.095 6.348 0.225 1.100 100.12985119
22.584 2.589 3.113 6.335 0.097 1.100 62.8700781782
<truncated after showing first 30 lines>
---------- Missing result in vss ----------
<vss>
    <step time ="24746" speed="14.0625"/>
    <step time ="24749" speed="13.5"/>
    <step time ="24752" speed="12.9807692308"/>
    <step time ="24753" speed="12.9807692308"/>
    <step time ="24755" speed="12.9807692308"/>
    <step time ="24757" speed="12.9807692308"/>
    <step time ="24759" speed="12.9807692308"/>
    <step time ="24761" speed="13.5"/>
    <step time ="24762" speed="13.5"/>
    <step time ="24765" speed="13.5"/>
    <step time ="24767" speed="14.0625"/>
    <step time ="24768" speed="13.5"/>
    <step time ="24770" speed="12.5"/>
    <step time ="24772" speed="12.5"/>
    <step time ="24774" speed="12.0535714286"/>
    <step time ="24777" speed="12.9807692308"/>
    <step time ="24780" speed="12.9807692308"/>
    <step time ="24784" speed="12.9807692308"/>
    <step time ="24786" speed="12.9807692308"/>
    <step time ="24787" speed="12.0535714286"/>
    <step time ="24790" speed="12.5"/>
    <step time ="24792" speed="12.9807692308"/>
    <step time ="24794" speed="12.9807692308"/>
    <step time ="24796" speed="13.5"/>
    <step time ="24798" speed="13.5"/>
    <step time ="24800" speed="13.5"/>
    <step time ="24803" speed="13.5"/>
    <step time ="24805" speed="12.5"/>
    <step time ="24806" speed="11.6379310345"/>
<truncated after showing first 30 lines>

Detailed information for the tests that had known bugs:

TEST had known bugs (bug 1691 (NONEXISTENT)) on ts-sim-winbuild-ba : netconvert dlr-navteq_roundtrip ( Last six runs Nov2019 Oct2019 )

Failed to open URL 'https://sumo.dlr.de/trac.wsgi/ticket/1691?format=tab': <urlopen error [SSL: CERTIFICATE_VERIFY_FAILED] certificate verify failed (_ssl.c:590)>.

Please make sure that bug 1691 exists
and that the configuration entry 'bug_system_location' points to the correct trac instance.
The current value is 'https://sumo.dlr.de/trac.wsgi/'.
(This bug was triggered by text found in file 'net' matching '.*')
---------- Differences in net ----------
4c4
< <net version="1.1" junctionCornerDetail="5" limitTurnSpeed="5.50" xmlns:xsi="http://www.w3.org/2001/XMLSchema-instance" xsi:noNamespaceSchemaLocation="http://sumo.dlr.de/xsd/net_file.xsd">
---
> <net version="1.3" junctionCornerDetail="5" limitTurnSpeed="5.50" xmlns:xsi="http://www.w3.org/2001/XMLSchema-instance" xsi:noNamespaceSchemaLocation="http://sumo.dlr.de/xsd/net_file.xsd">
2768c2768
<     <connection from="-26816553" to="26816541" fromLane="0" toLane="0" via=":294168098_5_0" dir="L" state="="/>
---
>     <connection from="-26816553" to="26816541" fromLane="0" toLane="0" via=":294168098_5_0" dir="l" state="="/>
2975c2975
<     <connection from="27445116" to="27445117" fromLane="0" toLane="0" via=":294169338_0_0" dir="s" state="="/>
---
>     <connection from="27445116" to="27445117" fromLane="0" toLane="0" via=":294169338_0_0" dir="R" state="="/>
3216c3216
<     <connection from=":294168098_5" to="26816541" fromLane="0" toLane="0" dir="L" state="M"/>
---
>     <connection from=":294168098_5" to="26816541" fromLane="0" toLane="0" dir="l" state="M"/>
3241c3241
<     <connection from=":294169338_0" to="27445117" fromLane="0" toLane="0" dir="s" state="M"/>
---
>     <connection from=":294169338_0" to="27445117" fromLane="0" toLane="0" dir="R" state="M"/>

TEST had known bugs (bug 1691 (NONEXISTENT)) on ts-sim-winbuild-ba : netconvert matsim_roundtrip ( Last six runs Nov2019 Oct2019 )

Failed to open URL 'https://sumo.dlr.de/trac.wsgi/ticket/1691?format=tab': <urlopen error [SSL: CERTIFICATE_VERIFY_FAILED] certificate verify failed (_ssl.c:590)>.

Please make sure that bug 1691 exists
and that the configuration entry 'bug_system_location' points to the correct trac instance.
The current value is 'https://sumo.dlr.de/trac.wsgi/'.
(This bug was triggered by text found in file 'net' matching '.*')
---------- Differences in net ----------
4c4
< <net version="1.1" junctionCornerDetail="5" limitTurnSpeed="5.50" xmlns:xsi="http://www.w3.org/2001/XMLSchema-instance" xsi:noNamespaceSchemaLocation="http://sumo.dlr.de/xsd/net_file.xsd">
---
> <net version="1.3" junctionCornerDetail="5" limitTurnSpeed="5.50" xmlns:xsi="http://www.w3.org/2001/XMLSchema-instance" xsi:noNamespaceSchemaLocation="http://sumo.dlr.de/xsd/net_file.xsd">
880c880
<         <lane id=":294830184_7_0" index="0" speed="5.56" length="14.38" shape="915.07,462.77 918.06,460.17 921.14,459.20 924.29,459.87 927.52,462.17"/>
---
>         <lane id=":294830184_7_0" index="0" speed="5.56" length="13.52" shape="915.07,462.77 917.74,460.95 921.19,460.22 924.69,460.61 927.52,462.17"/>
3708c3708
<     <connection from="-26004787#2" to="26004966#2" fromLane="0" toLane="0" via=":283722837_12_0" dir="s" state="="/>
---
>     <connection from="-26004787#2" to="26004966#2" fromLane="0" toLane="0" via=":283722837_12_0" dir="R" state="="/>
3724c3724
<     <connection from="-26004868#0" to="-5198585#7" fromLane="0" toLane="0" via=":283719736_13_0" dir="R" state="m"/>
---
>     <connection from="-26004868#0" to="-5198585#7" fromLane="0" toLane="0" via=":283719736_13_0" dir="r" state="m"/>
3747c3747
<     <connection from="-26816553" to="-26816413#1" fromLane="0" toLane="0" via=":294168098_4_0" dir="R" state="="/>
---
>     <connection from="-26816553" to="-26816413#1" fromLane="0" toLane="0" via=":294168098_4_0" dir="r" state="="/>
4015c4015
<     <connection from="26816413#1" to="26816553" fromLane="0" toLane="0" via=":294168098_1_0" dir="L" state="="/>
---
>     <connection from="26816413#1" to="26816553" fromLane="0" toLane="0" via=":294168098_1_0" dir="l" state="="/>
4023c4023
<     <connection from="26816590#0" to="26816590#1" fromLane="0" toLane="0" via=":294169338_0_0" dir="s" state="="/>
---
>     <connection from="26816590#0" to="26816590#1" fromLane="0" toLane="0" via=":294169338_0_0" dir="R" state="="/>
4037c4037
<     <connection from="26843038#0" to="26843038#1" fromLane="0" toLane="0" via=":294830184_7_0" dir="L" state="="/>
<truncated after showing first 30 lines>

TEST had known bugs (see #254) on ts-sim-winbuild-ba : sumo output one_vehicle ( Last six runs Nov2019 Oct2019 )

different outputs from detectors which should detect the same
(This bug was triggered by text found in file 'output' matching 'failed')
---------- Differences in output ----------
10c10
< success 0.1 ['--step-length', '.1', '--end', '100'] ['3/1to2/1_0']
---
> failed 0.1 ['--step-length', '.1', '--end', '100'] 3/1to2/1_0 (71.3, 71.4) [('e2', 10.0), ('e3', -1.0), ('edge', -1.0), ('lane', -1.0)]
12c12
< success 1 ['--step-length', '.1', '--end', '100'] ['3/1to2/1_0']
---
> failed 1 ['--step-length', '.1', '--end', '100'] 3/1to2/1_0 (72.0, 73.0) [('e2', 10.0), ('e3', -1.0), ('edge', -1.0), ('lane', -1.0)]
14c14
< success 10 ['--step-length', '.1', '--end', '100'] ['3/1to2/1_0']
---
> failed 10 ['--step-length', '.1', '--end', '100'] 3/1to2/1_0 (80.0, 90.0) [('e2', 10.0), ('e3', -1.0), ('edge', -1.0), ('lane', -1.0)]
18c18
< success 0.1 ['--step-length', '.1', '--end', '1000'] ['3/1to2/1_0']
---
> failed 0.1 ['--step-length', '.1', '--end', '1000'] 3/1to2/1_0 (71.3, 71.4) [('e2', 10.0), ('e3', -1.0), ('edge', -1.0), ('lane', -1.0)]
20c20
< success 1 ['--step-length', '.1', '--end', '1000'] ['3/1to2/1_0']
---
> failed 1 ['--step-length', '.1', '--end', '1000'] 3/1to2/1_0 (72.0, 73.0) [('e2', 10.0), ('e3', -1.0), ('edge', -1.0), ('lane', -1.0)]
22c22
< success 10 ['--step-length', '.1', '--end', '1000'] ['3/1to2/1_0']
---
> failed 10 ['--step-length', '.1', '--end', '1000'] 3/1to2/1_0 (80.0, 90.0) [('e2', 10.0), ('e3', -1.0), ('edge', -1.0), ('lane', -1.0)]
24c24
< success 100 ['--step-length', '.1', '--end', '1000'] ['3/1to2/1_0']
---
> failed 100 ['--step-length', '.1', '--end', '1000'] 3/1to2/1_0 (100.0, 200.0) [('e1', -1.0), ('e2', 10.0), ('e3', -1.0), ('edge', -1.0), ('lane', -1.0)]
34c34
< success 0.1 ['--step-length', '1', '--end', '100'] ['3/1to2/1_0']
<truncated after showing first 30 lines>

TEST had known bugs (see #254) on ts-sim-winbuild-ba : sumo output teleport ( Last six runs Nov2019 Oct2019 )

different outputs from detectors which should detect the same
(This bug was triggered by text found in file 'output' matching 'failed')
---------- Differences in output ----------
2c2
< success ['--step-length', '.1', '--end', '51'] ['2/1to1/1_0']
---
> success 0.1 ['--step-length', '.1', '--end', '51'] ['2/1to1/1_0']
4c4
< success ['--step-length', '.1', '--end', '51'] ['2/1to1/1_0', '1/1to0/1_0']
---
> success 0.1 ['--step-length', '.1', '--end', '51'] ['2/1to1/1_0', '1/1to0/1_0']
6c6
< success ['--step-length', '.1', '--end', '51'] ['2/1to1/1_0']
---
> success 1 ['--step-length', '.1', '--end', '51'] ['2/1to1/1_0']
8c8
< success ['--step-length', '.1', '--end', '51'] ['2/1to1/1_0', '1/1to0/1_0']
---
> success 1 ['--step-length', '.1', '--end', '51'] ['2/1to1/1_0', '1/1to0/1_0']
10c10
< success ['--step-length', '.1', '--end', '51'] ['2/1to1/1_0']
---
> success 10 ['--step-length', '.1', '--end', '51'] ['2/1to1/1_0']
12c12
< success ['--step-length', '.1', '--end', '51'] ['2/1to1/1_0', '1/1to0/1_0']
---
> success 10 ['--step-length', '.1', '--end', '51'] ['2/1to1/1_0', '1/1to0/1_0']
14c14
< success ['--step-length', '.1', '--end', '51'] ['2/1to1/1_0']
---
> success 100 ['--step-length', '.1', '--end', '51'] ['2/1to1/1_0']
16c16
< success ['--step-length', '.1', '--end', '51'] ['2/1to1/1_0', '1/1to0/1_0']
<truncated after showing first 30 lines>

TEST had known bugs (see #254) on ts-sim-winbuild-ba : sumo output teleport_multihop ( Last six runs Nov2019 Oct2019 )

different outputs from detectors which should detect the same
(This bug was triggered by text found in file 'output' matching 'failed')
---------- Differences in output ----------
34c34
< success 0.1 ['--step-length', '.1', '--end', '1000'] 2/1to1/1_0 (230.0, 230.1) [('e2', 9.99), ('e3', 10.0), ('edge', 9.99), ('lane', 9.99)]
---
> failed 0.1 ['--step-length', '.1', '--end', '1000'] 2/1to1/1_0 (149.0, 149.1) [('e2', 9.99), ('e3', 10.0), ('edge', 10.0), ('lane', 10.0)]
36c36
< success 0.1 ['--step-length', '.1', '--end', '1000'] 1/1to0/1_0 (148.1, 148.2) [('e2', 9.99), ('e3', 10.0), ('edge', 9.99), ('lane', 9.99)]
---
> failed 0.1 ['--step-length', '.1', '--end', '1000'] 2/1to1/1_0 (149.0, 149.1) [('e2', 9.99), ('e3', 10.0), ('edge', 10.0), ('lane', 10.0)]
38c38
< success 1 ['--step-length', '.1', '--end', '1000'] 2/1to1/1_0 (230.0, 231.0) [('e2', 9.99), ('e3', 10.0), ('edge', 9.99), ('lane', 9.99)]
---
> failed 1 ['--step-length', '.1', '--end', '1000'] 2/1to1/1_0 (149.0, 150.0) [('e2', 9.93), ('e3', 10.0), ('edge', 10.0), ('lane', 10.0)]
40c40
< success 1 ['--step-length', '.1', '--end', '1000'] 1/1to0/1_0 (148.0, 149.0) [('e2', 9.91), ('e3', 10.0), ('edge', 9.91), ('lane', 9.91)]
---
> failed 1 ['--step-length', '.1', '--end', '1000'] 2/1to1/1_0 (149.0, 150.0) [('e2', 9.93), ('e3', 10.0), ('edge', 10.0), ('lane', 10.0)]
42c42
< success 10 ['--step-length', '.1', '--end', '1000'] 2/1to1/1_0 (230.0, 240.0) [('e2', 9.42), ('e3', 9.9), ('edge', 9.42), ('lane', 9.42)]
---
> failed 10 ['--step-length', '.1', '--end', '1000'] 2/1to1/1_0 (140.0, 150.0) [('e2', 9.99), ('e3', 10.0), ('edge', 10.0), ('lane', 10.0)]
44c44
< success 10 ['--step-length', '.1', '--end', '1000'] 1/1to0/1_0 (140.0, 150.0) [('e2', 9.96), ('e3', 9.99), ('edge', 9.96), ('lane', 9.96)]
---
> failed 10 ['--step-length', '.1', '--end', '1000'] 2/1to1/1_0 (140.0, 150.0) [('e2', 9.99), ('e3', 10.0), ('edge', 10.0), ('lane', 10.0)]
46c46
< success 100 ['--step-length', '.1', '--end', '1000'] 2/1to1/1_0 (200.0, 300.0) [('e1', 10.0), ('e2', 9.22), ('e3', 5.71), ('edge', 9.22), ('lane', 9.22)]
---
> failed 100 ['--step-length', '.1', '--end', '1000'] 2/1to1/1_0 (100.0, 200.0) [('e1', 10.0), ('e2', 7.95), ('e3', 10.0), ('edge', 10.0), ('lane', 10.0)]
48c48
< success 100 ['--step-length', '.1', '--end', '1000'] 1/1to0/1_0 (100.0, 200.0) [('e1', 9.53), ('e2', 5.82), ('e3', 6.93), ('edge', 5.82), ('lane', 5.82)]
<truncated after showing first 30 lines>

TEST had known bugs (see #254) on ts-sim-winbuild-ba : sumo output teleport_multihop_newDefaults ( Last six runs Nov2019 Oct2019 )

different outputs from detectors which should detect the same
(This bug was triggered by text found in file 'output' matching 'failed')
---------- Differences in output ----------
18c18
< success 0.1 ['--step-length', '.1', '--end', '100'] ['2/1to1/1_0']
---
> failed 0.1 ['--step-length', '.1', '--end', '100'] 2/1to1/1_0 (76.2, 76.3) [('e2', 10.49), ('e3', 10.35), ('edge', 10.49), ('lane', 10.49)]
20c20
< success 0.1 ['--step-length', '.1', '--end', '100'] ['2/1to1/1_0', '1/1to0/1_0']
---
> failed 0.1 ['--step-length', '.1', '--end', '100'] 2/1to1/1_0 (76.2, 76.3) [('e2', 10.49), ('e3', 10.35), ('edge', 10.49), ('lane', 10.49)]
22c22
< success 1 ['--step-length', '.1', '--end', '100'] ['2/1to1/1_0']
---
> failed 1 ['--step-length', '.1', '--end', '100'] 2/1to1/1_0 (76.0, 77.0) [('e2', 10.39), ('e3', 10.35), ('edge', 10.39), ('lane', 10.39)]
24c24
< success 1 ['--step-length', '.1', '--end', '100'] ['2/1to1/1_0', '1/1to0/1_0']
---
> failed 1 ['--step-length', '.1', '--end', '100'] 2/1to1/1_0 (76.0, 77.0) [('e2', 10.39), ('e3', 10.35), ('edge', 10.39), ('lane', 10.39)]
26c26
< success 10 ['--step-length', '.1', '--end', '100'] ['2/1to1/1_0']
---
> failed 10 ['--step-length', '.1', '--end', '100'] 2/1to1/1_0 (70.0, 80.0) [('e2', 10.42), ('e3', 10.25), ('edge', 10.42), ('lane', 10.42)]
28c28
< success 10 ['--step-length', '.1', '--end', '100'] ['2/1to1/1_0', '1/1to0/1_0']
---
> failed 10 ['--step-length', '.1', '--end', '100'] 2/1to1/1_0 (70.0, 80.0) [('e2', 10.42), ('e3', 10.25), ('edge', 10.42), ('lane', 10.42)]
30c30
< success 100 ['--step-length', '.1', '--end', '100'] ['2/1to1/1_0']
---
> failed 100 ['--step-length', '.1', '--end', '100'] 2/1to1/1_0 (0.0, 100.0) [('e1', 10.27), ('e2', 10.24), ('e3', 9.59), ('edge', 10.24), ('lane', 10.24)]
32c32
< success 100 ['--step-length', '.1', '--end', '100'] ['2/1to1/1_0', '1/1to0/1_0']
<truncated after showing first 30 lines>

TEST had known bugs (see #254) on ts-sim-winbuild-ba : sumo output two_same_vehicles ( Last six runs Nov2019 Oct2019 )

different outputs from detectors which should detect the same
(This bug was triggered by text found in file 'output' matching 'failed')
---------- Differences in output ----------
10c10
< success 0.1 ['--step-length', '.1', '--end', '100'] ['3/1to2/1_0']
---
> failed 0.1 ['--step-length', '.1', '--end', '100'] 3/1to2/1_0 (75.4, 75.5) [('e2', 10.0), ('e3', -1.0), ('edge', -1.0), ('lane', -1.0)]
12c12
< success 1 ['--step-length', '.1', '--end', '100'] ['3/1to2/1_0']
---
> failed 1 ['--step-length', '.1', '--end', '100'] 3/1to2/1_0 (76.0, 77.0) [('e2', 10.0), ('e3', -1.0), ('edge', -1.0), ('lane', -1.0)]
14c14
< success 10 ['--step-length', '.1', '--end', '100'] ['3/1to2/1_0']
---
> failed 10 ['--step-length', '.1', '--end', '100'] 3/1to2/1_0 (80.0, 90.0) [('e2', 10.0), ('e3', -1.0), ('edge', -1.0), ('lane', -1.0)]
18c18
< success 0.1 ['--step-length', '.1', '--end', '1000'] ['3/1to2/1_0']
---
> failed 0.1 ['--step-length', '.1', '--end', '1000'] 3/1to2/1_0 (75.4, 75.5) [('e2', 10.0), ('e3', -1.0), ('edge', -1.0), ('lane', -1.0)]
20c20
< success 1 ['--step-length', '.1', '--end', '1000'] ['3/1to2/1_0']
---
> failed 1 ['--step-length', '.1', '--end', '1000'] 3/1to2/1_0 (76.0, 77.0) [('e2', 10.0), ('e3', -1.0), ('edge', -1.0), ('lane', -1.0)]
22c22
< success 10 ['--step-length', '.1', '--end', '1000'] ['3/1to2/1_0']
---
> failed 10 ['--step-length', '.1', '--end', '1000'] 3/1to2/1_0 (80.0, 90.0) [('e2', 10.0), ('e3', -1.0), ('edge', -1.0), ('lane', -1.0)]
24c24
< success 100 ['--step-length', '.1', '--end', '1000'] ['3/1to2/1_0']
---
> failed 100 ['--step-length', '.1', '--end', '1000'] 3/1to2/1_0 (100.0, 200.0) [('e1', -1.0), ('e2', 10.0), ('e3', -1.0), ('edge', -1.0), ('lane', -1.0)]
34c34
< success 0.1 ['--step-length', '1', '--end', '100'] ['3/1to2/1_0']
<truncated after showing first 30 lines>

TEST had known bugs (see #254) on ts-sim-winbuild-ba : sumo output two_vehicles_diff_length ( Last six runs Nov2019 Oct2019 )

different outputs from detectors which should detect the same
(This bug was triggered by text found in file 'output' matching 'failed')
---------- Differences in output ----------
10c10
< success 0.1 ['--step-length', '.1', '--end', '100'] ['3/1to2/1_0']
---
> failed 0.1 ['--step-length', '.1', '--end', '100'] 3/1to2/1_0 (76.4, 76.5) [('e2', 10.0), ('e3', -1.0), ('edge', -1.0), ('lane', -1.0)]
12c12
< success 1 ['--step-length', '.1', '--end', '100'] ['3/1to2/1_0']
---
> failed 1 ['--step-length', '.1', '--end', '100'] 3/1to2/1_0 (77.0, 78.0) [('e2', 10.0), ('e3', -1.0), ('edge', -1.0), ('lane', -1.0)]
14c14
< success 10 ['--step-length', '.1', '--end', '100'] ['3/1to2/1_0']
---
> failed 10 ['--step-length', '.1', '--end', '100'] 3/1to2/1_0 (80.0, 90.0) [('e2', 10.0), ('e3', -1.0), ('edge', -1.0), ('lane', -1.0)]
18c18
< success 0.1 ['--step-length', '.1', '--end', '1000'] ['3/1to2/1_0']
---
> failed 0.1 ['--step-length', '.1', '--end', '1000'] 3/1to2/1_0 (76.4, 76.5) [('e2', 10.0), ('e3', -1.0), ('edge', -1.0), ('lane', -1.0)]
20c20
< success 1 ['--step-length', '.1', '--end', '1000'] ['3/1to2/1_0']
---
> failed 1 ['--step-length', '.1', '--end', '1000'] 3/1to2/1_0 (77.0, 78.0) [('e2', 10.0), ('e3', -1.0), ('edge', -1.0), ('lane', -1.0)]
22c22
< success 10 ['--step-length', '.1', '--end', '1000'] ['3/1to2/1_0']
---
> failed 10 ['--step-length', '.1', '--end', '1000'] 3/1to2/1_0 (80.0, 90.0) [('e2', 10.0), ('e3', -1.0), ('edge', -1.0), ('lane', -1.0)]
24c24
< success 100 ['--step-length', '.1', '--end', '1000'] ['3/1to2/1_0']
---
> failed 100 ['--step-length', '.1', '--end', '1000'] 3/1to2/1_0 (100.0, 200.0) [('e1', -1.0), ('e2', 10.0), ('e3', -1.0), ('edge', -1.0), ('lane', -1.0)]
34c34
< success 0.1 ['--step-length', '1', '--end', '100'] ['3/1to2/1_0']
<truncated after showing first 30 lines>

TEST had known bugs (see #254) on ts-sim-winbuild-ba : sumo output two_vehicles_diff_speed ( Last six runs Nov2019 Oct2019 )

different outputs from detectors which should detect the same
(This bug was triggered by text found in file 'output' matching 'failed')
---------- Differences in output ----------
0a1,48
> Loading configuration... done.
> failed 0.1 ['--step-length', '.1', '--end', '51'] 3/1to2/1_0 (38.4, 38.5) [('e2', 9.6), ('e3', 9.5), ('edge', 9.6), ('lane', 9.6)]
> Loading configuration... done.
> failed 1 ['--step-length', '.1', '--end', '51'] 3/1to2/1_0 (38.0, 39.0) [('e2', 9.64), ('e3', 9.5), ('edge', 9.64), ('lane', 9.64)]
> Loading configuration... done.
> failed 10 ['--step-length', '.1', '--end', '51'] 3/1to2/1_0 (30.0, 40.0) [('e2', 9.86), ('e3', 9.5), ('edge', 9.86), ('lane', 9.86)]
> Loading configuration... done.
> failed 100 ['--step-length', '.1', '--end', '51'] 3/1to2/1_0 (0.0, 51.0) [('e2', 9.62), ('e3', 9.5), ('edge', 9.62), ('lane', 9.62)]
> Loading configuration... done.
> failed 0.1 ['--step-length', '.1', '--end', '100'] 3/1to2/1_0 (38.4, 38.5) [('e2', 9.6), ('e3', 9.5), ('edge', 9.6), ('lane', 9.6)]
> Loading configuration... done.
> failed 1 ['--step-length', '.1', '--end', '100'] 3/1to2/1_0 (38.0, 39.0) [('e2', 9.64), ('e3', 9.5), ('edge', 9.64), ('lane', 9.64)]
> Loading configuration... done.
> failed 10 ['--step-length', '.1', '--end', '100'] 3/1to2/1_0 (30.0, 40.0) [('e2', 9.86), ('e3', 9.5), ('edge', 9.86), ('lane', 9.86)]
> Loading configuration... done.
> failed 100 ['--step-length', '.1', '--end', '100'] 3/1to2/1_0 (0.0, 100.0) [('e1', 9.5), ('e2', 9.53), ('e3', 9.5), ('edge', 9.47), ('lane', 9.47)]
> Loading configuration... done.
> failed 0.1 ['--step-length', '.1', '--end', '1000'] 3/1to2/1_0 (38.4, 38.5) [('e2', 9.6), ('e3', 9.5), ('edge', 9.6), ('lane', 9.6)]
> Loading configuration... done.
> failed 1 ['--step-length', '.1', '--end', '1000'] 3/1to2/1_0 (38.0, 39.0) [('e2', 9.64), ('e3', 9.5), ('edge', 9.64), ('lane', 9.64)]
> Loading configuration... done.
> failed 10 ['--step-length', '.1', '--end', '1000'] 3/1to2/1_0 (30.0, 40.0) [('e2', 9.86), ('e3', 9.5), ('edge', 9.86), ('lane', 9.86)]
> Loading configuration... done.
> failed 100 ['--step-length', '.1', '--end', '1000'] 3/1to2/1_0 (0.0, 100.0) [('e1', 9.5), ('e2', 9.53), ('e3', 9.5), ('edge', 9.47), ('lane', 9.47)]
> Loading configuration... done.
> failed 0.1 ['--step-length', '1', '--end', '51'] 3/1to2/1_0 (39.0, 40.0) [('e2', 9.6), ('e3', 9.5), ('edge', 9.6), ('lane', 9.6)]
> Loading configuration... done.
> failed 1 ['--step-length', '1', '--end', '51'] 3/1to2/1_0 (39.0, 40.0) [('e2', 9.6), ('e3', 9.5), ('edge', 9.6), ('lane', 9.6)]
> Loading configuration... done.
<truncated after showing first 30 lines>

TEST had known bugs (#4727) on ts-sim-winbuild-ba : traci ContextSubscriptionFilters leadFollow carFollowing ( Last six runs Nov2019 Oct2019 )

#4727
(This bug was triggered by text found in file 'output' matching '.')
---------- Differences in output ----------
4d3
< lead_straight
6d4
< [002] Context results for vehicle 'ego':
7a6
> [002] Context results for vehicle 'ego':
9d7
< [003] Context results for vehicle 'ego':
10a9
> [003] Context results for vehicle 'ego':
12d10
< [004] Context results for vehicle 'ego':
13a12
> [004] Context results for vehicle 'ego':
15d13
< [005] Context results for vehicle 'ego':
16a15
> [005] Context results for vehicle 'ego':
18d16
< [006] Context results for vehicle 'ego':
19a18
> [006] Context results for vehicle 'ego':
21d19
< [007] Context results for vehicle 'ego':
22a21
> [007] Context results for vehicle 'ego':
24d22
< [008] Context results for vehicle 'ego':
25a24
> [008] Context results for vehicle 'ego':
<truncated after showing first 30 lines>

2 TESTS had known bugs (#4727) on ts-sim-winbuild-ba :

#4727
(This bug was triggered by text found in file 'output' matching '.')
---------- Differences in output ----------
4a5
> follow_straight
7d7
< follow_straight
9a10
> follow_straight
12d12
< follow_straight
14a15
> follow_straight
17d17
< follow_straight
19a20
> follow_straight
22d22
< follow_straight
24a25
> follow_straight
27d27
< follow_straight
29a30
> follow_straight
32d32
< follow_straight
34a35
> follow_straight
37d37
< follow_straight
39a40
> follow_straight
<truncated after showing first 30 lines>
traci ContextSubscriptionFilters leadFollow laneChangeLeft ( Last six runs Nov2019 Oct2019 )
traci ContextSubscriptionFilters leadFollow laneChangeRight ( Last six runs Nov2019 Oct2019 )

TEST had known bugs (#4727) on ts-sim-winbuild-ba : traci ContextSubscriptionFilters leadFollow laneChangeNeighbors ( Last six runs Nov2019 Oct2019 )

#4727
(This bug was triggered by text found in file 'output' matching '.')
---------- Differences in output ----------
4,5d3
< follow_straight
< follow_right
6a5,7
> follow_right
> follow_straight
> lead_left
9d9
< lead_left
11,12d10
< follow_straight
< follow_right
13a12,14
> follow_right
> follow_straight
> lead_left
16d16
< lead_left
18,19d17
< follow_straight
< follow_right
20a19,21
> follow_right
> follow_straight
> lead_left
23d23
< lead_left
25,26d24
< follow_straight
< follow_right
<truncated after showing first 30 lines>

TEST had known bugs (see #3263) on ts-sim-winbuild-ba : traci pythonApi moveToXY keepRoute2 ( Last six runs Nov2019 Oct2019 )

mapping failure
(This bug was triggered by text found in file 'output' matching 'failed')
---------- Differences in output ----------
0a1,2
> internal corner (inside, segment2) failed: x=198, x2=198.0,   y=1.9, y2=1.9,   lane=middle_0, lane2=middle_0, pos=102, pos2=98.0   posLat=2.0 posLat2=1.9
> internal corner (outside, far) failed: x=203, x2=203.0,   y=-4, y2=-4.0,   lane=, lane2=middle_0, pos=-1073741824.0, pos2=100.0   posLat=-1073741824.0 posLat2=-1.41421356237

TEST had known bugs (see #5383) on ts-sim-winbuild-ba : traci pythonApi moveToXY permissions ( Last six runs Nov2019 Oct2019 )

mapping failure
(This bug was triggered by text found in file 'output' matching 'failed')
---------- Differences in output ----------
0a1,2
> shifted to left lane (permissions) failed: mode=2 x=40, x2=40.0,   y=-1.5, y2=-1.5,   lane=beg_1, lane2=, pos=40, pos2=-1073741824.0   posLat=0.0 posLat2=-1073741824.0
> right lane (ignore permissions) failed: mode=6 x=40, x2=40.0,   y=-1.6, y2=-1.6,   lane=beg_0, lane2=, pos=40, pos2=-1073741824.0   posLat=0.0 posLat2=-1073741824.0