19Aug19rv1_2_0+1635-1ac726396e - detailed test results for NETEDITCHECKOUTPUT

To reconnect the TextTest GUI to these results, run:

texttestc.py -a neteditcheckoutput -d C:/Users/delphi/Code/sumo/git/tests -reconnect C:/Users/delphi/Code/sumo/msvc12x64texttesttmp/msvc12x64.31Aug025833.3652 -g

To start TextTest for these tests, run:

texttestc.py -a neteditcheckoutput -d C:/Users/delphi/Code/sumo/git/tests


default: 2148 tests: 1909 succeeded 205 known bugs 34 FAILED

Detailed information for the tests that FAILED:

18 TESTS FAILED on ts-sim-winbuild-ba :

---------- Differences in errors ----------
3,4d2
< Warning: Teleporting vehicle 'flowA.0'; waited too long (jam), lane=':gneJ5_2_0', time=310.00.
< Warning: Vehicle 'flowA.0' ends teleporting on edge 'gneE4', time 310.00.
7,8d4
< Warning: Teleporting vehicle 'flowA.1'; waited too long (jam), lane=':gneJ5_2_0', time=615.00.
< Warning: Vehicle 'flowA.1' ends teleporting on edge 'gneE4', time 615.00.
10,11d5
< Warning: Teleporting vehicle 'flowA.2'; waited too long (jam), lane=':gneJ5_2_0', time=919.00.
< Warning: Vehicle 'flowA.2' ends teleporting on edge 'gneE4', time 919.00.
14,15d7
< Warning: Teleporting vehicle 'flowA.3'; waited too long (jam), lane=':gneJ5_2_0', time=1223.00.
< Warning: Vehicle 'flowA.3' ends teleporting on edge 'gneE4', time 1223.00.
17,18d8
< Warning: Teleporting vehicle 'flowA.4'; waited too long (jam), lane=':gneJ5_2_0', time=1528.00.
< Warning: Vehicle 'flowA.4' ends teleporting on edge 'gneE4', time 1528.00.
21,22d10
< Warning: Teleporting vehicle 'flowA.5'; waited too long (jam), lane=':gneJ5_2_0', time=1834.00.
< Warning: Vehicle 'flowA.5' ends teleporting on edge 'gneE4', time 1834.00.
24,25d11
< Warning: Teleporting vehicle 'flowA.6'; waited too long (jam), lane=':gneJ5_2_0', time=2138.00.
< Warning: Vehicle 'flowA.6' ends teleporting on edge 'gneE4', time 2138.00.
28,29d13
< Warning: Teleporting vehicle 'flowA.7'; waited too long (jam), lane=':gneJ5_2_0', time=2443.00.
< Warning: Vehicle 'flowA.7' ends teleporting on edge 'gneE4', time 2443.00.
31,32d14
< Warning: Teleporting vehicle 'flowA.8'; waited too long (jam), lane=':gneJ5_2_0', time=2747.00.
< Warning: Vehicle 'flowA.8' ends teleporting on edge 'gneE4', time 2747.00.
35,36d16
< Warning: Teleporting vehicle 'flowA.9'; waited too long (jam), lane=':gneJ5_2_0', time=3052.00.
< Warning: Vehicle 'flowA.9' ends teleporting on edge 'gneE4', time 3052.00.
<truncated after showing first 30 lines>
demandElements flow inspect_selection arrivalLane current ( Last six runs Aug2019 )
demandElements flow inspect_selection arrivalLane float ( Last six runs Aug2019 )
demandElements flow inspect_selection arrivalPos float ( Last six runs Aug2019 )
demandElements flow inspect_selection arrivalPos max ( Last six runs Aug2019 )
demandElements flow inspect_selection arrivalPos random ( Last six runs Aug2019 )
demandElements flow inspect_selection arrivalPosLat center ( Last six runs Aug2019 )
demandElements flow inspect_selection arrivalPosLat float ( Last six runs Aug2019 )
demandElements flow inspect_selection arrivalPosLat left ( Last six runs Aug2019 )
demandElements flow inspect_selection arrivalPosLat right ( Last six runs Aug2019 )
demandElements flow inspect_selection arrivalSpeed current ( Last six runs Aug2019 )
demandElements flow inspect_selection color ( Last six runs Aug2019 )
demandElements flow inspect_selection containerNumber ( Last six runs Aug2019 )
demandElements flow inspect_selection departLane first ( Last six runs Aug2019 )
demandElements flow inspect_selection departLane float ( Last six runs Aug2019 )
demandElements flow inspect_selection departLane free ( Last six runs Aug2019 )
demandElements flow inspect_selection departPosLat float ( Last six runs Aug2019 )
demandElements flow inspect_selection line ( Last six runs Aug2019 )
demandElements flow inspect_selection personNumber ( Last six runs Aug2019 )

TEST FAILED on ts-sim-winbuild-ba : demandElements flow inspect_selection arrivalSpeed float ( Last six runs Aug2019 )

---------- Differences in errors ----------
3,4d2
< Warning: Vehicle 'flowB.0' will not be able to arrive with the given speed!
< Error: Vehicle 'flowB.0' will not be able to depart using the given velocity (junction too close)!
7,10d4
< Warning: Vehicle 'flowB.1' will not be able to arrive with the given speed!
< Error: Vehicle 'flowB.1' will not be able to depart using the given velocity (junction too close)!
< Warning: Teleporting vehicle 'flowA.0'; waited too long (jam), lane=':gneJ5_2_0', time=310.00.
< Warning: Vehicle 'flowA.0' ends teleporting on edge 'gneE4', time 310.00.
13,14c7
< Warning: Vehicle 'flowB.2' will not be able to arrive with the given speed!
< Error: Vehicle 'flowB.2' will not be able to depart using the given velocity (junction too close)!
---
> Warning: Vehicle 'flowB.0' will not be able to arrive with the given speed!
17,20c10,12
< Warning: Vehicle 'flowB.3' will not be able to arrive with the given speed!
< Error: Vehicle 'flowB.3' will not be able to depart using the given velocity (junction too close)!
< Warning: Teleporting vehicle 'flowA.1'; waited too long (jam), lane=':gneJ5_2_0', time=615.00.
< Warning: Vehicle 'flowA.1' ends teleporting on edge 'gneE4', time 615.00.
---
> Error: Vehicle 'flowB.0' will not be able to depart using the given velocity (junction too close)!
> Warning: Vehicle 'flowB.1' will not be able to arrive with the given speed!
> Error: Vehicle 'flowB.1' will not be able to depart using the given velocity (junction too close)!
23,26c15,16
< Warning: Vehicle 'flowB.4' will not be able to arrive with the given speed!
< Error: Vehicle 'flowB.4' will not be able to depart using the given velocity (junction too close)!
< Warning: Teleporting vehicle 'flowA.2'; waited too long (jam), lane=':gneJ5_2_0', time=919.00.
< Warning: Vehicle 'flowA.2' ends teleporting on edge 'gneE4', time 919.00.
---
> Warning: Vehicle 'flowB.2' will not be able to arrive with the given speed!
> Error: Vehicle 'flowB.2' will not be able to depart using the given velocity (junction too close)!
<truncated after showing first 30 lines>

2 TESTS FAILED on ts-sim-winbuild-ba :

---------- Differences in errors ----------
1a2,12
> Error: Vehicle 'flowB.2' will not be able to depart using the given velocity (slow lane ahead)!
> Error: Vehicle 'flowB.5' will not be able to depart using the given velocity (slow lane ahead)!
> Error: Vehicle 'flowB.6' will not be able to depart using the given velocity (slow lane ahead)!
> Error: Vehicle 'flowB.8' will not be able to depart using the given velocity (slow lane ahead)!
> Error: Vehicle 'flowB.9' will not be able to depart using the given velocity (slow lane ahead)!
> Error: Vehicle 'flowB.10' will not be able to depart using the given velocity (slow lane ahead)!
> Error: Vehicle 'flowB.11' will not be able to depart using the given velocity (slow lane ahead)!
> Error: Vehicle 'flowB.12' will not be able to depart using the given velocity (slow lane ahead)!
> Error: Vehicle 'flowB.14' will not be able to depart using the given velocity (slow lane ahead)!
> Error: Vehicle 'flowB.15' will not be able to depart using the given velocity (slow lane ahead)!
> Error: Vehicle 'flowB.17' will not be able to depart using the given velocity (slow lane ahead)!
4d14
< Error: Vehicle 'flowB.2' will not be able to depart using the given velocity (slow lane ahead)!
7d16
< Error: Vehicle 'flowB.4' will not be able to depart using the given velocity (slow lane ahead)!
10,13c19,20
< Error: Vehicle 'flowB.6' will not be able to depart using the given velocity (slow lane ahead)!
< Warning: Teleporting vehicle 'flowA.3'; waited too long (jam), lane=':gneJ5_2_0', time=1223.00.
< Warning: Vehicle 'flowA.3' ends teleporting on edge 'gneE4', time 1223.00.
< Error: Vehicle 'flowB.7' will not be able to depart using the given velocity (slow lane ahead)!
---
> Warning: Teleporting vehicle 'flowA.3'; waited too long (jam), lane=':gneJ5_2_0', time=1224.00.
> Warning: Vehicle 'flowA.3' ends teleporting on edge 'gneE4', time 1224.00.
16,19c23,24
< Error: Vehicle 'flowB.9' will not be able to depart using the given velocity (slow lane ahead)!
< Warning: Teleporting vehicle 'flowA.5'; waited too long (jam), lane=':gneJ5_2_0', time=1834.00.
< Warning: Vehicle 'flowA.5' ends teleporting on edge 'gneE4', time 1834.00.
< Error: Vehicle 'flowB.10' will not be able to depart using the given velocity (slow lane ahead)!
---
<truncated after showing first 30 lines>
demandElements flow inspect_selection departLane allowed ( Last six runs Aug2019 )
demandElements flow inspect_selection departLane best ( Last six runs Aug2019 )

TEST FAILED on ts-sim-winbuild-ba : demandElements flow inspect_selection departLane random ( Last six runs Aug2019 )

---------- Differences in errors ----------
1c1,14
< Error: Vehicle 'flowB.1' will not be able to depart using the given velocity (junction too close)!
---
> Error: Vehicle 'flowB.0' will not be able to depart using the given velocity (junction too close)!
> Error: Vehicle 'flowB.2' will not be able to depart using the given velocity (junction too close)!
> Error: Vehicle 'flowB.3' will not be able to depart using the given velocity (junction too close)!
> Error: Vehicle 'flowB.4' will not be able to depart using the given velocity (junction too close)!
> Error: Vehicle 'flowB.5' will not be able to depart using the given velocity (junction too close)!
> Error: Vehicle 'flowB.6' will not be able to depart using the given velocity (junction too close)!
> Error: Vehicle 'flowB.7' will not be able to depart using the given velocity (junction too close)!
> Error: Vehicle 'flowB.8' will not be able to depart using the given velocity (junction too close)!
> Error: Vehicle 'flowB.9' will not be able to depart using the given velocity (junction too close)!
> Error: Vehicle 'flowB.10' will not be able to depart using the given velocity (junction too close)!
> Error: Vehicle 'flowB.11' will not be able to depart using the given velocity (junction too close)!
> Error: Vehicle 'flowB.13' will not be able to depart using the given velocity (junction too close)!
> Error: Vehicle 'flowB.15' will not be able to depart using the given velocity (junction too close)!
> Error: Vehicle 'flowB.16' will not be able to depart using the given velocity (junction too close)!
4,5d16
< Error: Vehicle 'flowB.2' will not be able to depart using the given velocity (slow lane ahead)!
< Error: Vehicle 'flowB.3' will not be able to depart using the given velocity (slow lane ahead)!
10,14c21,22
< Error: Vehicle 'flowB.5' will not be able to depart using the given velocity (junction too close)!
< Error: Vehicle 'flowB.6' will not be able to depart using the given velocity (junction too close)!
< Warning: Teleporting vehicle 'flowA.3'; waited too long (jam), lane=':gneJ5_2_0', time=1223.00.
< Warning: Vehicle 'flowA.3' ends teleporting on edge 'gneE4', time 1223.00.
< Error: Vehicle 'flowB.7' will not be able to depart using the given velocity (junction too close)!
---
> Warning: Teleporting vehicle 'flowA.3'; waited too long (jam), lane=':gneJ5_2_0', time=1224.00.
> Warning: Vehicle 'flowA.3' ends teleporting on edge 'gneE4', time 1224.00.
17,20c25,26
<truncated after showing first 30 lines>

TEST FAILED on ts-sim-winbuild-ba : demandElements flow inspect_selection departPos base ( Last six runs Aug2019 )

---------- Differences in errors ----------
3,4d2
< Warning: Teleporting vehicle 'flowA.0'; waited too long (jam), lane=':gneJ5_2_0', time=309.00.
< Warning: Vehicle 'flowA.0' ends teleporting on edge 'gneE4', time 309.00.
7,8d4
< Warning: Teleporting vehicle 'flowA.1'; waited too long (jam), lane=':gneJ5_2_0', time=614.00.
< Warning: Vehicle 'flowA.1' ends teleporting on edge 'gneE4', time 614.00.
10,11d5
< Warning: Teleporting vehicle 'flowA.2'; waited too long (jam), lane=':gneJ5_2_0', time=919.00.
< Warning: Vehicle 'flowA.2' ends teleporting on edge 'gneE4', time 919.00.
14,15d7
< Warning: Teleporting vehicle 'flowA.3'; waited too long (jam), lane=':gneJ5_2_0', time=1224.00.
< Warning: Vehicle 'flowA.3' ends teleporting on edge 'gneE4', time 1224.00.
17,18d8
< Warning: Teleporting vehicle 'flowA.4'; waited too long (jam), lane=':gneJ5_2_0', time=1528.00.
< Warning: Vehicle 'flowA.4' ends teleporting on edge 'gneE4', time 1528.00.
21,22d10
< Warning: Teleporting vehicle 'flowA.5'; waited too long (jam), lane=':gneJ5_2_0', time=1833.00.
< Warning: Vehicle 'flowA.5' ends teleporting on edge 'gneE4', time 1833.00.
24,25d11
< Warning: Teleporting vehicle 'flowA.6'; waited too long (jam), lane=':gneJ5_2_0', time=2138.00.
< Warning: Vehicle 'flowA.6' ends teleporting on edge 'gneE4', time 2138.00.
28,29d13
< Warning: Teleporting vehicle 'flowA.7'; waited too long (jam), lane=':gneJ5_2_0', time=2445.00.
< Warning: Vehicle 'flowA.7' ends teleporting on edge 'gneE4', time 2445.00.
31,32d14
< Warning: Teleporting vehicle 'flowA.8'; waited too long (jam), lane=':gneJ5_2_0', time=2750.00.
< Warning: Vehicle 'flowA.8' ends teleporting on edge 'gneE4', time 2750.00.
35,36d16
< Warning: Teleporting vehicle 'flowA.9'; waited too long (jam), lane=':gneJ5_2_0', time=3055.00.
< Warning: Vehicle 'flowA.9' ends teleporting on edge 'gneE4', time 3055.00.
<truncated after showing first 30 lines>

TEST FAILED on ts-sim-winbuild-ba : demandElements flow inspect_selection departPos float ( Last six runs Aug2019 )

---------- Differences in errors ----------
3,4d2
< Warning: Teleporting vehicle 'flowA.0'; waited too long (jam), lane=':gneJ5_2_0', time=307.00.
< Warning: Vehicle 'flowA.0' ends teleporting on edge 'gneE4', time 307.00.
7,8d4
< Warning: Teleporting vehicle 'flowA.1'; waited too long (jam), lane=':gneJ5_2_0', time=611.00.
< Warning: Vehicle 'flowA.1' ends teleporting on edge 'gneE4', time 611.00.
10,11d5
< Warning: Teleporting vehicle 'flowA.2'; waited too long (jam), lane=':gneJ5_2_0', time=916.00.
< Warning: Vehicle 'flowA.2' ends teleporting on edge 'gneE4', time 916.00.
14,15d7
< Warning: Teleporting vehicle 'flowA.3'; waited too long (jam), lane=':gneJ5_2_0', time=1221.00.
< Warning: Vehicle 'flowA.3' ends teleporting on edge 'gneE4', time 1221.00.
17,18d8
< Warning: Teleporting vehicle 'flowA.4'; waited too long (jam), lane=':gneJ5_2_0', time=1526.00.
< Warning: Vehicle 'flowA.4' ends teleporting on edge 'gneE4', time 1526.00.
21,22d10
< Warning: Teleporting vehicle 'flowA.5'; waited too long (jam), lane=':gneJ5_2_0', time=1830.00.
< Warning: Vehicle 'flowA.5' ends teleporting on edge 'gneE4', time 1830.00.
24,25d11
< Warning: Teleporting vehicle 'flowA.6'; waited too long (jam), lane=':gneJ5_2_0', time=2134.00.
< Warning: Vehicle 'flowA.6' ends teleporting on edge 'gneE4', time 2134.00.
28,29d13
< Warning: Teleporting vehicle 'flowA.7'; waited too long (jam), lane=':gneJ5_2_0', time=2440.00.
< Warning: Vehicle 'flowA.7' ends teleporting on edge 'gneE4', time 2440.00.
31,32d14
< Warning: Teleporting vehicle 'flowA.8'; waited too long (jam), lane=':gneJ5_2_0', time=2744.00.
< Warning: Vehicle 'flowA.8' ends teleporting on edge 'gneE4', time 2744.00.
35,36d16
< Warning: Teleporting vehicle 'flowA.9'; waited too long (jam), lane=':gneJ5_2_0', time=3049.00.
< Warning: Vehicle 'flowA.9' ends teleporting on edge 'gneE4', time 3049.00.
<truncated after showing first 30 lines>

TEST FAILED on ts-sim-winbuild-ba : demandElements flow inspect_selection departPos free ( Last six runs Aug2019 )

---------- Differences in errors ----------
1,28c1,28
< Warning: Teleporting vehicle 'flowA.0'; waited too long (jam), lane=':gneJ5_2_0', time=309.00.
< Warning: Vehicle 'flowA.0' ends teleporting on edge 'gneE4', time 309.00.
< Warning: Teleporting vehicle 'flowA.1'; waited too long (jam), lane=':gneJ5_2_0', time=613.00.
< Warning: Vehicle 'flowA.1' ends teleporting on edge 'gneE4', time 613.00.
< Warning: Teleporting vehicle 'flowA.2'; waited too long (jam), lane=':gneJ5_2_0', time=919.00.
< Warning: Vehicle 'flowA.2' ends teleporting on edge 'gneE4', time 919.00.
< Warning: Teleporting vehicle 'flowA.3'; waited too long (jam), lane=':gneJ5_2_0', time=1225.00.
< Warning: Vehicle 'flowA.3' ends teleporting on edge 'gneE4', time 1225.00.
< Warning: Teleporting vehicle 'flowA.4'; waited too long (jam), lane=':gneJ5_2_0', time=1530.00.
< Warning: Vehicle 'flowA.4' ends teleporting on edge 'gneE4', time 1530.00.
< Warning: Teleporting vehicle 'flowA.5'; waited too long (jam), lane=':gneJ5_2_0', time=1836.00.
< Warning: Vehicle 'flowA.5' ends teleporting on edge 'gneE4', time 1836.00.
< Warning: Teleporting vehicle 'flowA.6'; waited too long (jam), lane=':gneJ5_2_0', time=2140.00.
< Warning: Vehicle 'flowA.6' ends teleporting on edge 'gneE4', time 2140.00.
< Warning: Teleporting vehicle 'flowA.7'; waited too long (jam), lane=':gneJ5_2_0', time=2445.00.
< Warning: Vehicle 'flowA.7' ends teleporting on edge 'gneE4', time 2445.00.
< Warning: Teleporting vehicle 'flowA.8'; waited too long (jam), lane=':gneJ5_2_0', time=2749.00.
< Warning: Vehicle 'flowA.8' ends teleporting on edge 'gneE4', time 2749.00.
< Warning: Teleporting vehicle 'flowA.9'; waited too long (jam), lane=':gneJ5_2_0', time=3054.00.
< Warning: Vehicle 'flowA.9' ends teleporting on edge 'gneE4', time 3054.00.
< Warning: Teleporting vehicle 'flowA.10'; waited too long (jam), lane=':gneJ5_2_0', time=3359.00.
< Warning: Vehicle 'flowA.10' ends teleporting on edge 'gneE4', time 3359.00.
< Warning: Teleporting vehicle 'flowA.11'; waited too long (jam), lane=':gneJ5_2_0', time=3664.00.
< Warning: Vehicle 'flowA.11' ends teleporting on edge 'gneE4', time 3664.00.
< Warning: Teleporting vehicle 'flowA.12'; waited too long (jam), lane=':gneJ5_2_0', time=3969.00.
< Warning: Vehicle 'flowA.12' ends teleporting on edge 'gneE4', time 3969.00.
< Warning: Teleporting vehicle 'flowA.13'; waited too long (jam), lane=':gneJ5_2_0', time=4274.00.
< Warning: Vehicle 'flowA.13' ends teleporting on edge 'gneE4', time 4274.00.
---
<truncated after showing first 30 lines>

TEST FAILED on ts-sim-winbuild-ba : demandElements flow inspect_selection departPos last ( Last six runs Aug2019 )

---------- Differences in errors ----------
2d1
< Error: Vehicle 'flowB.0' will not be able to depart using the given velocity (junction too close)!
4d2
< Error: Vehicle 'flowB.1' will not be able to depart using the given velocity (junction too close)!
6d3
< Error: Vehicle 'flowB.2' will not be able to depart using the given velocity (junction too close)!
8c5,6
< Error: Vehicle 'flowB.3' will not be able to depart using the given velocity (junction too close)!
---
> Error: Vehicle 'flowB.0' will not be able to depart using the given velocity (junction too close)!
> Error: Vehicle 'flowB.1' will not be able to depart using the given velocity (junction too close)!
10c8
< Error: Vehicle 'flowB.4' will not be able to depart using the given velocity (junction too close)!
---
> Error: Vehicle 'flowB.2' will not be able to depart using the given velocity (junction too close)!
12c10
< Error: Vehicle 'flowB.5' will not be able to depart using the given velocity (junction too close)!
---
> Error: Vehicle 'flowB.3' will not be able to depart using the given velocity (junction too close)!
14c12
< Error: Vehicle 'flowB.6' will not be able to depart using the given velocity (junction too close)!
---
> Error: Vehicle 'flowB.4' will not be able to depart using the given velocity (junction too close)!
16c14
< Error: Vehicle 'flowB.7' will not be able to depart using the given velocity (junction too close)!
---
> Error: Vehicle 'flowB.5' will not be able to depart using the given velocity (junction too close)!
18c16
< Error: Vehicle 'flowB.8' will not be able to depart using the given velocity (junction too close)!
---
<truncated after showing first 30 lines>

TEST FAILED on ts-sim-winbuild-ba : demandElements flow inspect_selection departPos random ( Last six runs Aug2019 )

---------- Differences in errors ----------
5,6d4
< Warning: Teleporting vehicle 'flowA.1'; waited too long (jam), lane=':gneJ5_2_0', time=492.00.
< Warning: Vehicle 'flowA.1' ends teleporting on edge 'gneE4', time 492.00.
8,9d5
< Warning: Teleporting vehicle 'flowA.2'; waited too long (jam), lane=':gneJ5_2_0', time=796.00.
< Warning: Vehicle 'flowA.2' ends teleporting on edge 'gneE4', time 796.00.
12,13d7
< Warning: Teleporting vehicle 'flowA.3'; waited too long (jam), lane=':gneJ5_2_0', time=1100.00.
< Warning: Vehicle 'flowA.3' ends teleporting on edge 'gneE4', time 1100.00.
16,17d9
< Warning: Teleporting vehicle 'flowA.4'; waited too long (jam), lane=':gneJ5_2_0', time=1406.00.
< Warning: Vehicle 'flowA.4' ends teleporting on edge 'gneE4', time 1406.00.
19,20d10
< Warning: Teleporting vehicle 'flowA.5'; waited too long (jam), lane=':gneJ5_2_0', time=1710.00.
< Warning: Vehicle 'flowA.5' ends teleporting on edge 'gneE4', time 1710.00.
23,24d12
< Warning: Teleporting vehicle 'flowA.6'; waited too long (jam), lane=':gneJ5_2_0', time=2015.00.
< Warning: Vehicle 'flowA.6' ends teleporting on edge 'gneE4', time 2015.00.
26,27d13
< Warning: Teleporting vehicle 'flowA.7'; waited too long (jam), lane=':gneJ5_2_0', time=2320.00.
< Warning: Vehicle 'flowA.7' ends teleporting on edge 'gneE4', time 2320.00.
30,31d15
< Warning: Teleporting vehicle 'flowA.8'; waited too long (jam), lane=':gneJ5_2_0', time=2625.00.
< Warning: Vehicle 'flowA.8' ends teleporting on edge 'gneE4', time 2625.00.
33,34d16
< Warning: Teleporting vehicle 'flowA.9'; waited too long (jam), lane=':gneJ5_2_0', time=2929.00.
< Warning: Vehicle 'flowA.9' ends teleporting on edge 'gneE4', time 2929.00.
37,38d18
< Warning: Teleporting vehicle 'flowA.10'; waited too long (jam), lane=':gneJ5_2_0', time=3233.00.
< Warning: Vehicle 'flowA.10' ends teleporting on edge 'gneE4', time 3233.00.
<truncated after showing first 30 lines>

TEST FAILED on ts-sim-winbuild-ba : demandElements flow inspect_selection departPos random_free ( Last six runs Aug2019 )

---------- Differences in errors ----------
22,45d21
< Warning: Teleporting vehicle 'flowA.0'; waited too long (jam), lane=':gneJ5_2_0', time=306.00.
< Warning: Vehicle 'flowA.0' ends teleporting on edge 'gneE4', time 306.00.
< Error: Vehicle 'flowB.2' will not be able to depart using the given velocity (junction too close)!
< Error: Vehicle 'flowB.2' will not be able to depart using the given velocity (junction too close)!
< Error: Vehicle 'flowB.2' will not be able to depart using the given velocity (junction too close)!
< Error: Vehicle 'flowB.2' will not be able to depart using the given velocity (junction too close)!
< Error: Vehicle 'flowB.2' will not be able to depart using the given velocity (junction too close)!
< Error: Vehicle 'flowB.2' will not be able to depart using the given velocity (junction too close)!
< Error: Vehicle 'flowB.2' will not be able to depart using the given velocity (junction too close)!
< Error: Vehicle 'flowB.2' will not be able to depart using the given velocity (junction too close)!
< Error: Vehicle 'flowB.2' will not be able to depart using the given velocity (junction too close)!
< Error: Vehicle 'flowB.2' will not be able to depart using the given velocity (junction too close)!
< Error: Vehicle 'flowB.3' will not be able to depart using the given velocity (junction too close)!
< Error: Vehicle 'flowB.3' will not be able to depart using the given velocity (junction too close)!
< Error: Vehicle 'flowB.3' will not be able to depart using the given velocity (junction too close)!
< Error: Vehicle 'flowB.3' will not be able to depart using the given velocity (junction too close)!
< Error: Vehicle 'flowB.3' will not be able to depart using the given velocity (junction too close)!
< Error: Vehicle 'flowB.3' will not be able to depart using the given velocity (junction too close)!
< Error: Vehicle 'flowB.3' will not be able to depart using the given velocity (junction too close)!
< Error: Vehicle 'flowB.3' will not be able to depart using the given velocity (junction too close)!
< Error: Vehicle 'flowB.3' will not be able to depart using the given velocity (junction too close)!
< Error: Vehicle 'flowB.3' will not be able to depart using the given velocity (junction too close)!
< Warning: Teleporting vehicle 'flowA.1'; waited too long (jam), lane=':gneJ5_2_0', time=611.00.
< Warning: Vehicle 'flowA.1' ends teleporting on edge 'gneE4', time 611.00.
56,57d31
< Warning: Teleporting vehicle 'flowA.2'; waited too long (jam), lane=':gneJ5_2_0', time=916.00.
< Warning: Vehicle 'flowA.2' ends teleporting on edge 'gneE4', time 916.00.
78,91d51
< Warning: Teleporting vehicle 'flowA.3'; waited too long (jam), lane=':gneJ5_2_0', time=1222.00.
<truncated after showing first 30 lines>

TEST FAILED on ts-sim-winbuild-ba : demandElements flow inspect_selection departSpeed desired ( Last six runs Aug2019 )

---------- Differences in errors ----------
3,4d2
< Warning: Teleporting vehicle 'flowA.0'; waited too long (jam), lane=':gneJ5_2_0', time=310.00.
< Warning: Vehicle 'flowA.0' ends teleporting on edge 'gneE4', time 310.00.
6,7d3
< Warning: Teleporting vehicle 'flowA.1'; waited too long (jam), lane=':gneJ5_2_0', time=615.00.
< Warning: Vehicle 'flowA.1' ends teleporting on edge 'gneE4', time 615.00.
9,10d4
< Warning: Teleporting vehicle 'flowA.2'; waited too long (jam), lane=':gneJ5_2_0', time=919.00.
< Warning: Vehicle 'flowA.2' ends teleporting on edge 'gneE4', time 919.00.
13,14d6
< Warning: Teleporting vehicle 'flowA.3'; waited too long (jam), lane=':gneJ5_2_0', time=1223.00.
< Warning: Vehicle 'flowA.3' ends teleporting on edge 'gneE4', time 1223.00.
16,17d7
< Warning: Teleporting vehicle 'flowA.4'; waited too long (jam), lane=':gneJ5_2_0', time=1528.00.
< Warning: Vehicle 'flowA.4' ends teleporting on edge 'gneE4', time 1528.00.
20,21d9
< Warning: Teleporting vehicle 'flowA.5'; waited too long (jam), lane=':gneJ5_2_0', time=1834.00.
< Warning: Vehicle 'flowA.5' ends teleporting on edge 'gneE4', time 1834.00.
23,24d10
< Warning: Teleporting vehicle 'flowA.6'; waited too long (jam), lane=':gneJ5_2_0', time=2138.00.
< Warning: Vehicle 'flowA.6' ends teleporting on edge 'gneE4', time 2138.00.
26,27d11
< Warning: Vehicle 'flowA.12' will not be able to arrive with the given speed!
< Warning: Vehicle 'flowA.12' will not be able to arrive with the given speed!
29,30d12
< Warning: Teleporting vehicle 'flowA.7'; waited too long (jam), lane=':gneJ5_2_0', time=2443.00.
< Warning: Vehicle 'flowA.7' ends teleporting on edge 'gneE4', time 2443.00.
32,33d13
< Warning: Teleporting vehicle 'flowA.8'; waited too long (jam), lane=':gneJ5_2_0', time=2747.00.
< Warning: Vehicle 'flowA.8' ends teleporting on edge 'gneE4', time 2747.00.
<truncated after showing first 30 lines>

TEST FAILED on ts-sim-winbuild-ba : demandElements flow inspect_selection departSpeed float ( Last six runs Aug2019 )

---------- Differences in errors ----------
1a2,4
> Warning: Choosing new speed factor 1.44 for vehicle 'flowA.1' to match departure speed.
> Warning: Choosing new speed factor 1.44 for vehicle 'flowA.2' to match departure speed.
> Warning: Choosing new speed factor 1.44 for vehicle 'flowA.3' to match departure speed.
4d6
< Warning: Choosing new speed factor 1.44 for vehicle 'flowA.1' to match departure speed.
7,9c9
< Warning: Teleporting vehicle 'flowA.0'; waited too long (jam), lane=':gneJ5_2_0', time=309.00.
< Warning: Vehicle 'flowA.0' ends teleporting on edge 'gneE4', time 309.00.
< Warning: Choosing new speed factor 1.44 for vehicle 'flowA.2' to match departure speed.
---
> Warning: Choosing new speed factor 1.44 for vehicle 'flowA.4' to match departure speed.
12c12
< Warning: Choosing new speed factor 1.44 for vehicle 'flowA.3' to match departure speed.
---
> Warning: Choosing new speed factor 1.44 for vehicle 'flowA.5' to match departure speed.
15,17c15
< Warning: Teleporting vehicle 'flowA.1'; waited too long (jam), lane=':gneJ5_2_0', time=614.00.
< Warning: Vehicle 'flowA.1' ends teleporting on edge 'gneE4', time 614.00.
< Warning: Choosing new speed factor 1.44 for vehicle 'flowA.4' to match departure speed.
---
> Warning: Choosing new speed factor 1.44 for vehicle 'flowA.6' to match departure speed.
20,22c18
< Warning: Teleporting vehicle 'flowA.2'; waited too long (jam), lane=':gneJ5_2_0', time=919.00.
< Warning: Vehicle 'flowA.2' ends teleporting on edge 'gneE4', time 919.00.
< Warning: Choosing new speed factor 1.44 for vehicle 'flowA.5' to match departure speed.
---
> Warning: Choosing new speed factor 1.44 for vehicle 'flowA.7' to match departure speed.
25c21
< Warning: Choosing new speed factor 1.44 for vehicle 'flowA.6' to match departure speed.
<truncated after showing first 30 lines>

TEST FAILED on ts-sim-winbuild-ba : demandElements flow inspect_selection departSpeed max ( Last six runs Aug2019 )

---------- Differences in errors ----------
1,2c1,2
< Warning: Teleporting vehicle 'flowA.0'; waited too long (jam), lane=':gneJ5_2_0', time=310.00.
< Warning: Vehicle 'flowA.0' ends teleporting on edge 'gneE4', time 310.00.
---
> Warning: Teleporting vehicle 'flowA.0'; waited too long (jam), lane=':gneJ5_2_0', time=309.00.
> Warning: Vehicle 'flowA.0' ends teleporting on edge 'gneE4', time 309.00.
5,30c5,28
< Warning: Teleporting vehicle 'flowA.2'; waited too long (jam), lane=':gneJ5_2_0', time=919.00.
< Warning: Vehicle 'flowA.2' ends teleporting on edge 'gneE4', time 919.00.
< Warning: Teleporting vehicle 'flowA.3'; waited too long (jam), lane=':gneJ5_2_0', time=1223.00.
< Warning: Vehicle 'flowA.3' ends teleporting on edge 'gneE4', time 1223.00.
< Warning: Teleporting vehicle 'flowA.4'; waited too long (jam), lane=':gneJ5_2_0', time=1528.00.
< Warning: Vehicle 'flowA.4' ends teleporting on edge 'gneE4', time 1528.00.
< Warning: Teleporting vehicle 'flowA.5'; waited too long (jam), lane=':gneJ5_2_0', time=1834.00.
< Warning: Vehicle 'flowA.5' ends teleporting on edge 'gneE4', time 1834.00.
< Warning: Teleporting vehicle 'flowA.6'; waited too long (jam), lane=':gneJ5_2_0', time=2138.00.
< Warning: Vehicle 'flowA.6' ends teleporting on edge 'gneE4', time 2138.00.
< Warning: Vehicle 'flowA.12' will not be able to arrive with the given speed!
< Warning: Vehicle 'flowA.12' will not be able to arrive with the given speed!
< Warning: Teleporting vehicle 'flowA.7'; waited too long (jam), lane=':gneJ5_2_0', time=2443.00.
< Warning: Vehicle 'flowA.7' ends teleporting on edge 'gneE4', time 2443.00.
< Warning: Teleporting vehicle 'flowA.8'; waited too long (jam), lane=':gneJ5_2_0', time=2747.00.
< Warning: Vehicle 'flowA.8' ends teleporting on edge 'gneE4', time 2747.00.
< Warning: Teleporting vehicle 'flowA.9'; waited too long (jam), lane=':gneJ5_2_0', time=3052.00.
< Warning: Vehicle 'flowA.9' ends teleporting on edge 'gneE4', time 3052.00.
< Warning: Teleporting vehicle 'flowA.10'; waited too long (jam), lane=':gneJ5_2_0', time=3357.00.
< Warning: Vehicle 'flowA.10' ends teleporting on edge 'gneE4', time 3357.00.
< Warning: Teleporting vehicle 'flowA.11'; waited too long (jam), lane=':gneJ5_2_0', time=3662.00.
< Warning: Vehicle 'flowA.11' ends teleporting on edge 'gneE4', time 3662.00.
< Warning: Teleporting vehicle 'flowA.12'; waited too long (jam), lane=':gneJ5_2_0', time=3967.00.
<truncated after showing first 30 lines>

TEST FAILED on ts-sim-winbuild-ba : demandElements flow inspect_selection departSpeed random ( Last six runs Aug2019 )

---------- Differences in errors ----------
1,6c1,6
< Warning: Teleporting vehicle 'flowA.0'; waited too long (jam), lane=':gneJ5_2_0', time=310.00.
< Warning: Vehicle 'flowA.0' ends teleporting on edge 'gneE4', time 310.00.
< Warning: Teleporting vehicle 'flowA.1'; waited too long (jam), lane=':gneJ5_2_0', time=615.00.
< Warning: Vehicle 'flowA.1' ends teleporting on edge 'gneE4', time 615.00.
< Warning: Teleporting vehicle 'flowA.2'; waited too long (jam), lane=':gneJ5_2_0', time=920.00.
< Warning: Vehicle 'flowA.2' ends teleporting on edge 'gneE4', time 920.00.
---
> Warning: Teleporting vehicle 'flowA.0'; waited too long (jam), lane=':gneJ5_2_0', time=309.00.
> Warning: Vehicle 'flowA.0' ends teleporting on edge 'gneE4', time 309.00.
> Warning: Teleporting vehicle 'flowA.1'; waited too long (jam), lane=':gneJ5_2_0', time=614.00.
> Warning: Vehicle 'flowA.1' ends teleporting on edge 'gneE4', time 614.00.
> Warning: Teleporting vehicle 'flowA.2'; waited too long (jam), lane=':gneJ5_2_0', time=919.00.
> Warning: Vehicle 'flowA.2' ends teleporting on edge 'gneE4', time 919.00.
9,30c9,28
< Warning: Teleporting vehicle 'flowA.4'; waited too long (jam), lane=':gneJ5_2_0', time=1529.00.
< Warning: Vehicle 'flowA.4' ends teleporting on edge 'gneE4', time 1529.00.
< Warning: Teleporting vehicle 'flowA.5'; waited too long (jam), lane=':gneJ5_2_0', time=1834.00.
< Warning: Vehicle 'flowA.5' ends teleporting on edge 'gneE4', time 1834.00.
< Warning: Teleporting vehicle 'flowA.6'; waited too long (jam), lane=':gneJ5_2_0', time=2139.00.
< Warning: Vehicle 'flowA.6' ends teleporting on edge 'gneE4', time 2139.00.
< Warning: Vehicle 'flowA.12' will not be able to arrive with the given speed!
< Warning: Vehicle 'flowA.12' will not be able to arrive with the given speed!
< Warning: Teleporting vehicle 'flowA.7'; waited too long (jam), lane=':gneJ5_2_0', time=2444.00.
< Warning: Vehicle 'flowA.7' ends teleporting on edge 'gneE4', time 2444.00.
< Warning: Teleporting vehicle 'flowA.8'; waited too long (jam), lane=':gneJ5_2_0', time=2749.00.
< Warning: Vehicle 'flowA.8' ends teleporting on edge 'gneE4', time 2749.00.
< Warning: Teleporting vehicle 'flowA.9'; waited too long (jam), lane=':gneJ5_2_0', time=3053.00.
< Warning: Vehicle 'flowA.9' ends teleporting on edge 'gneE4', time 3053.00.
< Warning: Teleporting vehicle 'flowA.10'; waited too long (jam), lane=':gneJ5_2_0', time=3359.00.
<truncated after showing first 30 lines>

TEST FAILED on ts-sim-winbuild-ba : demandElements flow inspect_selection departSpeed speedLimit ( Last six runs Aug2019 )

---------- Differences in errors ----------
3,4d2
< Warning: Teleporting vehicle 'flowA.0'; waited too long (jam), lane=':gneJ5_2_0', time=310.00.
< Warning: Vehicle 'flowA.0' ends teleporting on edge 'gneE4', time 310.00.
7,8d4
< Warning: Teleporting vehicle 'flowA.1'; waited too long (jam), lane=':gneJ5_2_0', time=615.00.
< Warning: Vehicle 'flowA.1' ends teleporting on edge 'gneE4', time 615.00.
10,11d5
< Warning: Teleporting vehicle 'flowA.2'; waited too long (jam), lane=':gneJ5_2_0', time=919.00.
< Warning: Vehicle 'flowA.2' ends teleporting on edge 'gneE4', time 919.00.
14,15d7
< Warning: Teleporting vehicle 'flowA.3'; waited too long (jam), lane=':gneJ5_2_0', time=1223.00.
< Warning: Vehicle 'flowA.3' ends teleporting on edge 'gneE4', time 1223.00.
17,18d8
< Warning: Teleporting vehicle 'flowA.4'; waited too long (jam), lane=':gneJ5_2_0', time=1528.00.
< Warning: Vehicle 'flowA.4' ends teleporting on edge 'gneE4', time 1528.00.
21,22d10
< Warning: Teleporting vehicle 'flowA.5'; waited too long (jam), lane=':gneJ5_2_0', time=1834.00.
< Warning: Vehicle 'flowA.5' ends teleporting on edge 'gneE4', time 1834.00.
24,25d11
< Warning: Teleporting vehicle 'flowA.6'; waited too long (jam), lane=':gneJ5_2_0', time=2138.00.
< Warning: Vehicle 'flowA.6' ends teleporting on edge 'gneE4', time 2138.00.
27,30d12
< Warning: Vehicle 'flowA.12' will not be able to arrive with the given speed!
< Warning: Vehicle 'flowA.12' will not be able to arrive with the given speed!
< Warning: Vehicle 'flowA.12' will not be able to arrive with the given speed!
< Warning: Vehicle 'flowA.12' will not be able to arrive with the given speed!
32,34d13
< Warning: Vehicle 'flowA.12' will not be able to arrive with the given speed!
< Warning: Teleporting vehicle 'flowA.7'; waited too long (jam), lane=':gneJ5_2_0', time=2443.00.
< Warning: Vehicle 'flowA.7' ends teleporting on edge 'gneE4', time 2443.00.
<truncated after showing first 30 lines>

TEST FAILED on ts-sim-winbuild-ba : netElements junctions inspect pos ( Last six runs Aug2019 )

---------- Differences in errors ----------
0a1,3
> Error: Invalid position for busStop 'busStop_7_0_1'.
> Error: Could not end a stopping place that is not opened.
> Quitting (on error).
---------- New result in exitcode ----------
1

Detailed information for the tests that had known bugs:

TEST had known bugs (#5893) on ts-sim-winbuild-ba : additionalElements access volatileRecomputing ( Last six runs Aug2019 )

See #5893
(This bug was triggered by text found in file 'errors' matching 'Warning: Ignoring invalid access from non-pedestrian lane')
---------- Differences in errors ----------
0a1,9
> Warning: Ignoring invalid access from non-pedestrian lane 'gneE2_1' in busStop 'busStop_gneE1_0_2'.
> Warning: Ignoring invalid access from non-pedestrian lane 'gneE1_1' in busStop 'busStop_gneE1_0_2'.
> Warning: Ignoring invalid access from non-pedestrian lane 'gneE0_1' in busStop 'busStop_gneE1_0_2'.
> Warning: Ignoring invalid access from non-pedestrian lane 'gneE2_3' in busStop 'busStop_gneE2_0_5'.
> Warning: Ignoring invalid access from non-pedestrian lane 'gneE1_1' in busStop 'busStop_gneE2_0_5'.
> Warning: Ignoring invalid access from non-pedestrian lane 'gneE0_1' in busStop 'busStop_gneE2_0_5'.
> Warning: Ignoring invalid access from non-pedestrian lane 'gneE2_3' in busStop 'busStop_gneE4_0_0'.
> Warning: Ignoring invalid access from non-pedestrian lane 'gneE1_1' in busStop 'busStop_gneE4_0_0'.
> Warning: Ignoring invalid access from non-pedestrian lane 'gneE0_1' in busStop 'busStop_gneE4_0_0'.

TEST had known bugs (Routeprobes #5941) on ts-sim-winbuild-ba : additionalElements calibrator inspect routeprobe ( Last six runs Aug2019 )

#5941
(This bug was triggered by text found in file 'errors' matching 'is not known')
---------- Differences in errors ----------
1c1,2
< Warning: No flow intervals in calibrator 'calibrator_gneE2_0'.
---
> Error: The routeProbe 'customRouteProbeName' to use within the calibrator 'calibrator_gneE2_0' is not known.
> Quitting (on error).
---------- New result in exitcode ----------
1

TEST had known bugs (Routeprobes #5941) on ts-sim-winbuild-ba : additionalElements calibrator load routeProbe ( Last six runs Aug2019 )

#5941
(This bug was triggered by text found in file 'errors' matching 'is not known')
---------- Differences in errors ----------
1c1
< Warning: No flow intervals in calibrator 'calibrator01'.
---
> Error: The routeProbe '%%$%$$$' to use within the calibrator 'calibrator01' is not known.
3a4
> Quitting (on error).
---------- New result in exitcode ----------
1

TEST had known bugs (Routeprobes #5941) on ts-sim-winbuild-ba : additionalElements lanecalibrator inspect routeprobe ( Last six runs Aug2019 )

#5941
(This bug was triggered by text found in file 'errors' matching 'is not known')
---------- Differences in errors ----------
1c1,2
< Warning: No flow intervals in calibrator 'laneCalibrator_gneE2_1_0'.
---
> Error: The routeProbe 'customRouteProbeName' to use within the calibrator 'laneCalibrator_gneE3_1_0' is not known.
> Quitting (on error).
---------- New result in exitcode ----------
1

TEST had known bugs (Routeprobes #5941) on ts-sim-winbuild-ba : additionalElements lanecalibrator load routeProbe ( Last six runs Aug2019 )

#5941
(This bug was triggered by text found in file 'errors' matching 'is not known')
---------- Differences in errors ----------
1c1
< Warning: No flow intervals in calibrator 'calibrator01'.
---
> Error: The routeProbe '%%$%$$$' to use within the calibrator 'calibrator01' is not known.
3c3,4
< Warning: No flow intervals in calibrator 'calibrator03'.
---
> Error: The routeProbe 'myRouteProbe' to use within the calibrator 'calibrator03' is not known.
> Quitting (on error).
---------- New result in exitcode ----------
1

198 TESTS had known bugs (Test needed #3045) on ts-sim-winbuild-ba :

#3045
(This bug was triggered by text found in file 'errors' matching 'File 'net.netedit' is not accessible')
---------- New result in errors ----------
Error: File 'net.netedit' is not accessible (No such file or directory).
Quitting (on error).
demandElements flow create begin ( Last six runs Aug2019 )
demandElements flow create end ( Last six runs Aug2019 )
demandElements flow create number ( Last six runs Aug2019 )
demandElements flow create period ( Last six runs Aug2019 )
demandElements flow create probability ( Last six runs Aug2019 )
demandElements flow create vehsPerHour ( Last six runs Aug2019 )
demandElements flow fix ( Last six runs Aug2019 )
demandElements flow inspect begin ( Last six runs Aug2019 )
demandElements flow inspect end ( Last six runs Aug2019 )
demandElements flow inspect genericParameters ( Last six runs Aug2019 )
demandElements flow inspect number ( Last six runs Aug2019 )
demandElements flow inspect period ( Last six runs Aug2019 )
demandElements flow inspect probability ( Last six runs Aug2019 )
demandElements flow inspect vehsPerHour ( Last six runs Aug2019 )
demandElements flow inspect_selection begin ( Last six runs Aug2019 )
demandElements flow inspect_selection end ( Last six runs Aug2019 )
demandElements flow inspect_selection genericParameters ( Last six runs Aug2019 )
demandElements flow inspect_selection number ( Last six runs Aug2019 )
demandElements flow inspect_selection period ( Last six runs Aug2019 )
demandElements flow inspect_selection probability ( Last six runs Aug2019 )
demandElements flow inspect_selection vehsPerHour ( Last six runs Aug2019 )
demandElements flow load genericParameters ( Last six runs Aug2019 )
demandElements person fix ( Last six runs Aug2019 )
demandElements person inspect ( Last six runs Aug2019 )
demandElements person inspect_selection ( Last six runs Aug2019 )
demandElements person load ( Last six runs Aug2019 )
demandElements person volatileRecomputing ( Last six runs Aug2019 )
demandElements personFlow create begin ( Last six runs Aug2019 )
demandElements personFlow create end ( Last six runs Aug2019 )
demandElements personFlow create number ( Last six runs Aug2019 )
demandElements personFlow create period ( Last six runs Aug2019 )
demandElements personFlow create probability ( Last six runs Aug2019 )
demandElements personFlow create vehsPerHour ( Last six runs Aug2019 )
demandElements personFlow fix ( Last six runs Aug2019 )
demandElements personFlow inspect ( Last six runs Aug2019 )
demandElements personFlow inspect_selection ( Last six runs Aug2019 )
demandElements personFlow load ( Last six runs Aug2019 )
demandElements personFlow volatileRecomputing ( Last six runs Aug2019 )
demandElements routeflow create begin ( Last six runs Aug2019 )
demandElements routeflow create end ( Last six runs Aug2019 )
demandElements routeflow create number ( Last six runs Aug2019 )
demandElements routeflow create period ( Last six runs Aug2019 )
demandElements routeflow create probability ( Last six runs Aug2019 )
demandElements routeflow create vehsPerHour ( Last six runs Aug2019 )
demandElements routeflow fix ( Last six runs Aug2019 )
demandElements routeflow inspect begin ( Last six runs Aug2019 )
demandElements routeflow inspect end ( Last six runs Aug2019 )
demandElements routeflow inspect genericParameters ( Last six runs Aug2019 )
demandElements routeflow inspect number ( Last six runs Aug2019 )
demandElements routeflow inspect period ( Last six runs Aug2019 )
demandElements routeflow inspect probability ( Last six runs Aug2019 )
demandElements routeflow inspect vehsPerHour ( Last six runs Aug2019 )
demandElements routeflow inspect_selection begin ( Last six runs Aug2019 )
demandElements routeflow inspect_selection end ( Last six runs Aug2019 )
demandElements routeflow inspect_selection genericParameters ( Last six runs Aug2019 )
demandElements routeflow inspect_selection number ( Last six runs Aug2019 )
demandElements routeflow inspect_selection period ( Last six runs Aug2019 )
demandElements routeflow inspect_selection probability ( Last six runs Aug2019 )
demandElements routeflow inspect_selection vehsPerHour ( Last six runs Aug2019 )
demandElements routeflow load genericParameters ( Last six runs Aug2019 )
demandElements trip fix ( Last six runs Aug2019 )
demandElements trip inspect genericParameters ( Last six runs Aug2019 )
demandElements trip inspect_selection genericParameters ( Last six runs Aug2019 )
demandElements trip load genericParameters ( Last six runs Aug2019 )
demandElements vehicle fix ( Last six runs Aug2019 )
demandElements vehicle inspect genericParameters ( Last six runs Aug2019 )
demandElements vehicle inspect_selection genericParameters ( Last six runs Aug2019 )
demandElements vehicle load genericParameters ( Last six runs Aug2019 )
demandElements vehicletype copy ( Last six runs Aug2019 )
demandElements vehicletype create basic accel ( Last six runs Aug2019 )
demandElements vehicletype create basic color ( Last six runs Aug2019 )
demandElements vehicletype create basic decel ( Last six runs Aug2019 )
demandElements vehicletype create basic default ( Last six runs Aug2019 )
demandElements vehicletype create basic id ( Last six runs Aug2019 )
demandElements vehicletype create basic length ( Last six runs Aug2019 )
demandElements vehicletype create basic maxspeed ( Last six runs Aug2019 )
demandElements vehicletype create basic mingap ( Last six runs Aug2019 )
demandElements vehicletype create basic sigma ( Last six runs Aug2019 )
demandElements vehicletype create basic tau ( Last six runs Aug2019 )
demandElements vehicletype create basic vclass ( Last six runs Aug2019 )
demandElements vehicletype create dialog actionStepLength ( Last six runs Aug2019 )
demandElements vehicletype create dialog boardingduration ( Last six runs Aug2019 )
demandElements vehicletype create dialog carfollowingmodel ( Last six runs Aug2019 )
demandElements vehicletype create dialog carfollowingmodel_params accel ( Last six runs Aug2019 )
demandElements vehicletype create dialog carfollowingmodel_params apparentdecel ( Last six runs Aug2019 )
demandElements vehicletype create dialog carfollowingmodel_params ca_gain_gap_cacc ( Last six runs Aug2019 )
demandElements vehicletype create dialog carfollowingmodel_params ca_gain_gap_dot_cacc ( Last six runs Aug2019 )
demandElements vehicletype create dialog carfollowingmodel_params ca_gain_space ( Last six runs Aug2019 )
demandElements vehicletype create dialog carfollowingmodel_params ca_gain_speed ( Last six runs Aug2019 )
demandElements vehicletype create dialog carfollowingmodel_params cf_cc_c1 ( Last six runs Aug2019 )
demandElements vehicletype create dialog carfollowingmodel_params cf_cc_ccaccel ( Last six runs Aug2019 )
demandElements vehicletype create dialog carfollowingmodel_params cf_cc_ccdecel ( Last six runs Aug2019 )
demandElements vehicletype create dialog carfollowingmodel_params cf_cc_constspacing ( Last six runs Aug2019 )
demandElements vehicletype create dialog carfollowingmodel_params cf_cc_flatbed_d ( Last six runs Aug2019 )
demandElements vehicletype create dialog carfollowingmodel_params cf_cc_flatbed_h ( Last six runs Aug2019 )
demandElements vehicletype create dialog carfollowingmodel_params cf_cc_flatbed_ka ( Last six runs Aug2019 )
demandElements vehicletype create dialog carfollowingmodel_params cf_cc_flatbed_kp ( Last six runs Aug2019 )
demandElements vehicletype create dialog carfollowingmodel_params cf_cc_flatbed_kv ( Last six runs Aug2019 )
demandElements vehicletype create dialog carfollowingmodel_params cf_cc_kp ( Last six runs Aug2019 )
demandElements vehicletype create dialog carfollowingmodel_params cf_cc_lambda ( Last six runs Aug2019 )
demandElements vehicletype create dialog carfollowingmodel_params cf_cc_lanes_count ( Last six runs Aug2019 )
demandElements vehicletype create dialog carfollowingmodel_params cf_cc_omegan ( Last six runs Aug2019 )
demandElements vehicletype create dialog carfollowingmodel_params cf_cc_ploeg_h ( Last six runs Aug2019 )
demandElements vehicletype create dialog carfollowingmodel_params cf_cc_ploeg_kd ( Last six runs Aug2019 )
demandElements vehicletype create dialog carfollowingmodel_params cf_cc_ploeg_kp ( Last six runs Aug2019 )
demandElements vehicletype create dialog carfollowingmodel_params cf_cc_tau ( Last six runs Aug2019 )
demandElements vehicletype create dialog carfollowingmodel_params cf_cc_xi ( Last six runs Aug2019 )
demandElements vehicletype create dialog carfollowingmodel_params cf_idm_delta ( Last six runs Aug2019 )
demandElements vehicletype create dialog carfollowingmodel_params cf_idm_stepping ( Last six runs Aug2019 )
demandElements vehicletype create dialog carfollowingmodel_params cf_idmm_adapt_factor ( Last six runs Aug2019 )
demandElements vehicletype create dialog carfollowingmodel_params cf_idmm_adapt_time ( Last six runs Aug2019 )
demandElements vehicletype create dialog carfollowingmodel_params cf_kerner_phi ( Last six runs Aug2019 )
demandElements vehicletype create dialog carfollowingmodel_params cf_pwagner2009_approb ( Last six runs Aug2019 )
demandElements vehicletype create dialog carfollowingmodel_params cf_pwagner2009_taulast ( Last six runs Aug2019 )
demandElements vehicletype create dialog carfollowingmodel_params cf_w99_cc1 ( Last six runs Aug2019 )
demandElements vehicletype create dialog carfollowingmodel_params cf_w99_cc2 ( Last six runs Aug2019 )
demandElements vehicletype create dialog carfollowingmodel_params cf_w99_cc3 ( Last six runs Aug2019 )
demandElements vehicletype create dialog carfollowingmodel_params cf_w99_cc4 ( Last six runs Aug2019 )
demandElements vehicletype create dialog carfollowingmodel_params cf_w99_cc5 ( Last six runs Aug2019 )
demandElements vehicletype create dialog carfollowingmodel_params cf_w99_cc6 ( Last six runs Aug2019 )
demandElements vehicletype create dialog carfollowingmodel_params cf_w99_cc7 ( Last six runs Aug2019 )
demandElements vehicletype create dialog carfollowingmodel_params cf_w99_cc8 ( Last six runs Aug2019 )
demandElements vehicletype create dialog carfollowingmodel_params cf_w99_cc9 ( Last six runs Aug2019 )
demandElements vehicletype create dialog carfollowingmodel_params cf_wiedemann_estimation ( Last six runs Aug2019 )
demandElements vehicletype create dialog carfollowingmodel_params cf_wiedemann_security ( Last six runs Aug2019 )
demandElements vehicletype create dialog carfollowingmodel_params collision_mingap_factor ( Last six runs Aug2019 )
demandElements vehicletype create dialog carfollowingmodel_params decel ( Last six runs Aug2019 )
demandElements vehicletype create dialog carfollowingmodel_params emergencydecel ( Last six runs Aug2019 )
demandElements vehicletype create dialog carfollowingmodel_params gc_gain_gap_cacc ( Last six runs Aug2019 )
demandElements vehicletype create dialog carfollowingmodel_params gc_gain_gap_dot_cacc ( Last six runs Aug2019 )
demandElements vehicletype create dialog carfollowingmodel_params gc_gain_space ( Last six runs Aug2019 )
demandElements vehicletype create dialog carfollowingmodel_params gc_gain_speed ( Last six runs Aug2019 )
demandElements vehicletype create dialog carfollowingmodel_params gcc_gain_gap_cacc ( Last six runs Aug2019 )
demandElements vehicletype create dialog carfollowingmodel_params gcc_gain_gap_dot_cacc ( Last six runs Aug2019 )
demandElements vehicletype create dialog carfollowingmodel_params gcc_gain_space ( Last six runs Aug2019 )
demandElements vehicletype create dialog carfollowingmodel_params gcc_gain_speed ( Last six runs Aug2019 )
demandElements vehicletype create dialog carfollowingmodel_params headway_time_cacc_to_acc ( Last six runs Aug2019 )
demandElements vehicletype create dialog carfollowingmodel_params k ( Last six runs Aug2019 )
demandElements vehicletype create dialog carfollowingmodel_params sc_gain ( Last six runs Aug2019 )
demandElements vehicletype create dialog carfollowingmodel_params sc_gain_cacc ( Last six runs Aug2019 )
demandElements vehicletype create dialog carfollowingmodel_params sigma ( Last six runs Aug2019 )
demandElements vehicletype create dialog carfollowingmodel_params tau ( Last six runs Aug2019 )
demandElements vehicletype create dialog carfollowingmodel_params tmp1 ( Last six runs Aug2019 )
demandElements vehicletype create dialog carfollowingmodel_params tmp2 ( Last six runs Aug2019 )
demandElements vehicletype create dialog carfollowingmodel_params tmp3 ( Last six runs Aug2019 )
demandElements vehicletype create dialog carfollowingmodel_params tmp4 ( Last six runs Aug2019 )
demandElements vehicletype create dialog carfollowingmodel_params tmp5 ( Last six runs Aug2019 )
demandElements vehicletype create dialog carfollowingmodel_params train_type ( Last six runs Aug2019 )
demandElements vehicletype create dialog color ( Last six runs Aug2019 )
demandElements vehicletype create dialog containercapacity ( Last six runs Aug2019 )
demandElements vehicletype create dialog default ( Last six runs Aug2019 )
demandElements vehicletype create dialog emissionclass ( Last six runs Aug2019 )
demandElements vehicletype create dialog genericParameters ( Last six runs Aug2019 )
demandElements vehicletype create dialog guishape ( Last six runs Aug2019 )
demandElements vehicletype create dialog id ( Last six runs Aug2019 )
demandElements vehicletype create dialog imgfile ( Last six runs Aug2019 )
demandElements vehicletype create dialog impatience ( Last six runs Aug2019 )
demandElements vehicletype create dialog junctionmodel_params jm_crossing_gap ( Last six runs Aug2019 )
demandElements vehicletype create dialog junctionmodel_params jm_drive_after_red_time ( Last six runs Aug2019 )
demandElements vehicletype create dialog junctionmodel_params jm_drive_after_yellow_time ( Last six runs Aug2019 )
demandElements vehicletype create dialog junctionmodel_params jm_drive_red_speed ( Last six runs Aug2019 )
demandElements vehicletype create dialog junctionmodel_params jm_ignore_foe_prob ( Last six runs Aug2019 )
demandElements vehicletype create dialog junctionmodel_params jm_ignore_foe_speed ( Last six runs Aug2019 )
demandElements vehicletype create dialog junctionmodel_params jm_ignore_keep_clear_time ( Last six runs Aug2019 )
demandElements vehicletype create dialog junctionmodel_params jm_sigma_minor ( Last six runs Aug2019 )
demandElements vehicletype create dialog junctionmodel_params jm_timegap_minor ( Last six runs Aug2019 )
demandElements vehicletype create dialog lanechangemodel ( Last six runs Aug2019 )
demandElements vehicletype create dialog lanechangemodel_params lc_accel_lat ( Last six runs Aug2019 )
demandElements vehicletype create dialog lanechangemodel_params lc_assertive ( Last six runs Aug2019 )
demandElements vehicletype create dialog lanechangemodel_params lc_cooperative ( Last six runs Aug2019 )
demandElements vehicletype create dialog lanechangemodel_params lc_impatience ( Last six runs Aug2019 )
demandElements vehicletype create dialog lanechangemodel_params lc_keep_right ( Last six runs Aug2019 )
demandElements vehicletype create dialog lanechangemodel_params lc_lookahead_left ( Last six runs Aug2019 )
demandElements vehicletype create dialog lanechangemodel_params lc_max_speed_lat_factor ( Last six runs Aug2019 )
demandElements vehicletype create dialog lanechangemodel_params lc_max_speed_lat_standing ( Last six runs Aug2019 )
demandElements vehicletype create dialog lanechangemodel_params lc_opposite ( Last six runs Aug2019 )
demandElements vehicletype create dialog lanechangemodel_params lc_overtake_right ( Last six runs Aug2019 )
demandElements vehicletype create dialog lanechangemodel_params lc_pushy ( Last six runs Aug2019 )
demandElements vehicletype create dialog lanechangemodel_params lc_pushy_gap ( Last six runs Aug2019 )
demandElements vehicletype create dialog lanechangemodel_params lc_speed_gain ( Last six runs Aug2019 )
demandElements vehicletype create dialog lanechangemodel_params lc_speed_gain_right ( Last six runs Aug2019 )
demandElements vehicletype create dialog lanechangemodel_params lc_strategic ( Last six runs Aug2019 )
demandElements vehicletype create dialog lanechangemodel_params lc_sublane ( Last six runs Aug2019 )
demandElements vehicletype create dialog lanechangemodel_params lc_time_to_impatience ( Last six runs Aug2019 )
demandElements vehicletype create dialog lanechangemodel_params lc_turn_alignment_distance ( Last six runs Aug2019 )
demandElements vehicletype create dialog latalignment ( Last six runs Aug2019 )
demandElements vehicletype create dialog length ( Last six runs Aug2019 )
demandElements vehicletype create dialog loadingduration ( Last six runs Aug2019 )
demandElements vehicletype create dialog maxspeed ( Last six runs Aug2019 )
demandElements vehicletype create dialog maxspeedlat ( Last six runs Aug2019 )
demandElements vehicletype create dialog mingap ( Last six runs Aug2019 )
demandElements vehicletype create dialog mingaplat ( Last six runs Aug2019 )
demandElements vehicletype create dialog osgfile ( Last six runs Aug2019 )
demandElements vehicletype create dialog personcapacity ( Last six runs Aug2019 )
demandElements vehicletype create dialog speeddev ( Last six runs Aug2019 )
demandElements vehicletype create dialog speedfactor ( Last six runs Aug2019 )
demandElements vehicletype create dialog vclass ( Last six runs Aug2019 )
demandElements vehicletype create dialog width ( Last six runs Aug2019 )

TEST had known bugs (#5875) on ts-sim-winbuild-ba : demandElements routeflow load line ( Last six runs Aug2019 )

See #5875
(This bug was triggered by text found in file 'errors' matching 'Error: Attribute 'line' in definition of flow 'flow_1' is empty')
---------- Differences in errors ----------
0a1
> Error: Attribute 'line' in definition of flow 'flow_1' is empty.

TEST had known bugs (Generic parameters #5895) on ts-sim-winbuild-ba : demandElements vehicletype load genericParameters ( Last six runs Aug2019 )

#5895
(This bug was triggered by text found in file 'errors' matching 'Error: Attribute 'key' in definition of a param is empty.')
---------- New result in errors ----------
Error: Attribute 'key' in definition of a param is empty.
---------- New result in output ----------
Loading configuration... done.