31Aug19rv1_3_1+0068-6b9b87bc7e - detailed test results for NETEDITCHECKOUTPUT

To reconnect the TextTest GUI to these results, run:

texttestc.py -a neteditcheckoutput -d C:/Users/delphi/Code/sumo/git/tests -reconnect C:/Users/delphi/Code/sumo/msvc12x64texttesttmp/msvc12x64.05Sep024018.3012 -g

To start TextTest for these tests, run:

texttestc.py -a neteditcheckoutput -d C:/Users/delphi/Code/sumo/git/tests


default: 2375 tests: 2082 succeeded 262 known bugs 21 FAILED 10 killed

Detailed information for the tests that FAILED:

TEST FAILED on ts-sim-winbuild-ba : demandElements flow create arrivalLane ( Last six runs Sep2019 Aug2019 )

---------- Differences in errors ----------
181d180
< Warning: Vehicle 'flow_0.60' will not be able to arrive at the given lane 'gneE5_20'!
184d182
< Warning: Vehicle 'flow_0.61' will not be able to arrive at the given lane 'gneE5_20'!
187d184
< Warning: Vehicle 'flow_0.62' will not be able to arrive at the given lane 'gneE5_20'!
190d186
< Warning: Vehicle 'flow_0.63' will not be able to arrive at the given lane 'gneE5_20'!
193d188
< Warning: Vehicle 'flow_0.64' will not be able to arrive at the given lane 'gneE5_20'!
196d190
< Warning: Vehicle 'flow_0.65' will not be able to arrive at the given lane 'gneE5_20'!
199d192
< Warning: Vehicle 'flow_0.66' will not be able to arrive at the given lane 'gneE5_20'!
202d194
< Warning: Vehicle 'flow_0.67' will not be able to arrive at the given lane 'gneE5_20'!
205d196
< Warning: Vehicle 'flow_0.68' will not be able to arrive at the given lane 'gneE5_20'!
208d198
< Warning: Vehicle 'flow_0.69' will not be able to arrive at the given lane 'gneE5_20'!
211d200
< Warning: Vehicle 'flow_0.70' will not be able to arrive at the given lane 'gneE5_20'!
214d202
< Warning: Vehicle 'flow_0.71' will not be able to arrive at the given lane 'gneE5_20'!
217d204
< Warning: Vehicle 'flow_0.72' will not be able to arrive at the given lane 'gneE5_20'!
220d206
< Warning: Vehicle 'flow_0.73' will not be able to arrive at the given lane 'gneE5_20'!
223d208
< Warning: Vehicle 'flow_0.74' will not be able to arrive at the given lane 'gneE5_20'!
<truncated after showing first 30 lines>

TEST FAILED on ts-sim-winbuild-ba : demandElements flow create arrivalSpeed ( Last six runs Sep2019 Aug2019 )

---------- Differences in errors ----------
181d180
< Warning: Vehicle 'flow_0.60' will not be able to arrive with the given speed!
184d182
< Warning: Vehicle 'flow_0.61' will not be able to arrive with the given speed!
187d184
< Warning: Vehicle 'flow_0.62' will not be able to arrive with the given speed!
190d186
< Warning: Vehicle 'flow_0.63' will not be able to arrive with the given speed!
193d188
< Warning: Vehicle 'flow_0.64' will not be able to arrive with the given speed!
196d190
< Warning: Vehicle 'flow_0.65' will not be able to arrive with the given speed!
199d192
< Warning: Vehicle 'flow_0.66' will not be able to arrive with the given speed!
202d194
< Warning: Vehicle 'flow_0.67' will not be able to arrive with the given speed!
205d196
< Warning: Vehicle 'flow_0.68' will not be able to arrive with the given speed!
208d198
< Warning: Vehicle 'flow_0.69' will not be able to arrive with the given speed!
211d200
< Warning: Vehicle 'flow_0.70' will not be able to arrive with the given speed!
214d202
< Warning: Vehicle 'flow_0.71' will not be able to arrive with the given speed!
217d204
< Warning: Vehicle 'flow_0.72' will not be able to arrive with the given speed!
220d206
< Warning: Vehicle 'flow_0.73' will not be able to arrive with the given speed!
223d208
< Warning: Vehicle 'flow_0.74' will not be able to arrive with the given speed!
<truncated after showing first 30 lines>

TEST FAILED on ts-sim-winbuild-ba : demandElements flow inspect arrivalSpeed float ( Last six runs Sep2019 Aug2019 )

---------- Differences in errors ----------
159d158
< Warning: Vehicle 'flow_0.60' will not be able to arrive with the given speed!
164d162
< Warning: Vehicle 'flow_0.62' will not be able to arrive with the given speed!
167d164
< Warning: Vehicle 'flow_0.63' will not be able to arrive with the given speed!
170d166
< Warning: Vehicle 'flow_0.64' will not be able to arrive with the given speed!
173d168
< Warning: Vehicle 'flow_0.65' will not be able to arrive with the given speed!
176d170
< Warning: Vehicle 'flow_0.66' will not be able to arrive with the given speed!
179d172
< Warning: Vehicle 'flow_0.67' will not be able to arrive with the given speed!
182,183d174
< Warning: Vehicle 'flow_0.68' will not be able to arrive with the given speed!
< Warning: Vehicle 'flow_0.69' will not be able to arrive with the given speed!
186d176
< Warning: Vehicle 'flow_0.70' will not be able to arrive with the given speed!
189d178
< Warning: Vehicle 'flow_0.71' will not be able to arrive with the given speed!
192d180
< Warning: Vehicle 'flow_0.72' will not be able to arrive with the given speed!
195d182
< Warning: Vehicle 'flow_0.73' will not be able to arrive with the given speed!
198d184
< Warning: Vehicle 'flow_0.74' will not be able to arrive with the given speed!
201d186
< Warning: Vehicle 'flow_0.75' will not be able to arrive with the given speed!
204d188
<truncated after showing first 30 lines>

TEST FAILED on ts-sim-winbuild-ba : demandElements flow inspect_selection arrivalSpeed float ( Last six runs Sep2019 Aug2019 )

---------- Differences in errors ----------
60,91d59
< Warning: Vehicle 'flowA.6' will not be able to arrive with the given speed!
< Warning: Vehicle 'flowA.7' will not be able to arrive with the given speed!
< Warning: Vehicle 'flowA.8' will not be able to arrive with the given speed!
< Warning: Vehicle 'flowA.9' will not be able to arrive with the given speed!
< Warning: Vehicle 'flowA.10' will not be able to arrive with the given speed!
< Warning: Vehicle 'flowA.11' will not be able to arrive with the given speed!
< Warning: Vehicle 'flowA.12' will not be able to arrive with the given speed!
< Warning: Vehicle 'flowA.13' will not be able to arrive with the given speed!
< Warning: Vehicle 'flowA.6' will not be able to arrive with the given speed!
< Warning: Vehicle 'flowA.7' will not be able to arrive with the given speed!
< Warning: Vehicle 'flowA.8' will not be able to arrive with the given speed!
< Warning: Vehicle 'flowA.9' will not be able to arrive with the given speed!
< Warning: Vehicle 'flowA.10' will not be able to arrive with the given speed!
< Warning: Vehicle 'flowA.11' will not be able to arrive with the given speed!
< Warning: Vehicle 'flowA.12' will not be able to arrive with the given speed!
< Warning: Vehicle 'flowA.13' will not be able to arrive with the given speed!
< Warning: Vehicle 'flowA.6' will not be able to arrive with the given speed!
< Warning: Vehicle 'flowA.7' will not be able to arrive with the given speed!
< Warning: Vehicle 'flowA.8' will not be able to arrive with the given speed!
< Warning: Vehicle 'flowA.9' will not be able to arrive with the given speed!
< Warning: Vehicle 'flowA.10' will not be able to arrive with the given speed!
< Warning: Vehicle 'flowA.11' will not be able to arrive with the given speed!
< Warning: Vehicle 'flowA.12' will not be able to arrive with the given speed!
< Warning: Vehicle 'flowA.13' will not be able to arrive with the given speed!
< Warning: Vehicle 'flowA.6' will not be able to arrive with the given speed!
< Warning: Vehicle 'flowA.7' will not be able to arrive with the given speed!
< Warning: Vehicle 'flowA.8' will not be able to arrive with the given speed!
< Warning: Vehicle 'flowA.9' will not be able to arrive with the given speed!
< Warning: Vehicle 'flowA.10' will not be able to arrive with the given speed!
<truncated after showing first 30 lines>

TEST FAILED on ts-sim-winbuild-ba : demandElements flow inspect_selection departPos random_free ( Last six runs Sep2019 Aug2019 )

---------- Differences in errors ----------
111a112,121
> Error: Vehicle 'flowB.14' will not be able to depart using the given velocity (junction too close)!
> Error: Vehicle 'flowB.14' will not be able to depart using the given velocity (junction too close)!
> Error: Vehicle 'flowB.14' will not be able to depart using the given velocity (junction too close)!
> Error: Vehicle 'flowB.14' will not be able to depart using the given velocity (junction too close)!
> Error: Vehicle 'flowB.14' will not be able to depart using the given velocity (junction too close)!
> Error: Vehicle 'flowB.14' will not be able to depart using the given velocity (junction too close)!
> Error: Vehicle 'flowB.14' will not be able to depart using the given velocity (junction too close)!
> Error: Vehicle 'flowB.14' will not be able to depart using the given velocity (junction too close)!
> Error: Vehicle 'flowB.14' will not be able to depart using the given velocity (junction too close)!
> Error: Vehicle 'flowB.14' will not be able to depart using the given velocity (junction too close)!
122,131d131
< Error: Vehicle 'flowB.16' will not be able to depart using the given velocity (junction too close)!
< Error: Vehicle 'flowB.16' will not be able to depart using the given velocity (junction too close)!
< Error: Vehicle 'flowB.16' will not be able to depart using the given velocity (junction too close)!
< Error: Vehicle 'flowB.16' will not be able to depart using the given velocity (junction too close)!
< Error: Vehicle 'flowB.16' will not be able to depart using the given velocity (junction too close)!
< Error: Vehicle 'flowB.16' will not be able to depart using the given velocity (junction too close)!
< Error: Vehicle 'flowB.16' will not be able to depart using the given velocity (junction too close)!
< Error: Vehicle 'flowB.16' will not be able to depart using the given velocity (junction too close)!
< Error: Vehicle 'flowB.16' will not be able to depart using the given velocity (junction too close)!
< Error: Vehicle 'flowB.16' will not be able to depart using the given velocity (junction too close)!
154,155c154,159
< Warning: Teleporting vehicle 'flowA.13'; waited too long (jam), lane=':gneJ5_2_0', time=3663.00.
< Warning: Vehicle 'flowA.13' ends teleporting on edge 'gneE4', time 3663.00.
---
> Warning: Teleporting vehicle 'flowA.11'; waited too long (jam), lane=':gneJ5_2_0', time=3663.00.
> Warning: Vehicle 'flowA.11' ends teleporting on edge 'gneE4', time 3663.00.
> Warning: Teleporting vehicle 'flowA.12'; waited too long (jam), lane=':gneJ5_2_0', time=3969.00.
> Warning: Vehicle 'flowA.12' ends teleporting on edge 'gneE4', time 3969.00.
<truncated after showing first 30 lines>

TEST FAILED on ts-sim-winbuild-ba : demandElements flow load arrivalLane ( Last six runs Sep2019 Aug2019 )

---------- Differences in errors ----------
201,1386d200
< Warning: Vehicle 'flow_3.4' will not be able to arrive at the given lane 'gneE5_500'!
< Warning: Vehicle 'flow_3.5' will not be able to arrive at the given lane 'gneE5_500'!
< Warning: Vehicle 'flow_3.6' will not be able to arrive at the given lane 'gneE5_500'!
< Warning: Vehicle 'flow_3.7' will not be able to arrive at the given lane 'gneE5_500'!
< Warning: Vehicle 'flow_3.8' will not be able to arrive at the given lane 'gneE5_500'!
< Warning: Vehicle 'flow_3.9' will not be able to arrive at the given lane 'gneE5_500'!
< Warning: Vehicle 'flow_3.10' will not be able to arrive at the given lane 'gneE5_500'!
< Warning: Vehicle 'flow_3.11' will not be able to arrive at the given lane 'gneE5_500'!
< Warning: Vehicle 'flow_3.12' will not be able to arrive at the given lane 'gneE5_500'!
< Warning: Vehicle 'flow_3.13' will not be able to arrive at the given lane 'gneE5_500'!
< Warning: Vehicle 'flow_3.14' will not be able to arrive at the given lane 'gneE5_500'!
< Warning: Vehicle 'flow_3.15' will not be able to arrive at the given lane 'gneE5_500'!
< Warning: Vehicle 'flow_3.16' will not be able to arrive at the given lane 'gneE5_500'!
< Warning: Vehicle 'flow_3.17' will not be able to arrive at the given lane 'gneE5_500'!
< Warning: Vehicle 'flow_3.18' will not be able to arrive at the given lane 'gneE5_500'!
< Warning: Vehicle 'flow_3.19' will not be able to arrive at the given lane 'gneE5_500'!
< Warning: Vehicle 'flow_3.20' will not be able to arrive at the given lane 'gneE5_500'!
< Warning: Vehicle 'flow_3.21' will not be able to arrive at the given lane 'gneE5_500'!
< Warning: Vehicle 'flow_3.22' will not be able to arrive at the given lane 'gneE5_500'!
< Warning: Vehicle 'flow_3.23' will not be able to arrive at the given lane 'gneE5_500'!
< Warning: Vehicle 'flow_3.24' will not be able to arrive at the given lane 'gneE5_500'!
< Warning: Vehicle 'flow_3.25' will not be able to arrive at the given lane 'gneE5_500'!
< Warning: Vehicle 'flow_3.26' will not be able to arrive at the given lane 'gneE5_500'!
< Warning: Vehicle 'flow_3.27' will not be able to arrive at the given lane 'gneE5_500'!
< Warning: Vehicle 'flow_3.28' will not be able to arrive at the given lane 'gneE5_500'!
< Warning: Vehicle 'flow_3.29' will not be able to arrive at the given lane 'gneE5_500'!
< Warning: Vehicle 'flow_3.30' will not be able to arrive at the given lane 'gneE5_500'!
< Warning: Vehicle 'flow_3.31' will not be able to arrive at the given lane 'gneE5_500'!
< Warning: Vehicle 'flow_3.32' will not be able to arrive at the given lane 'gneE5_500'!
<truncated after showing first 30 lines>

TEST FAILED on ts-sim-winbuild-ba : demandElements flow load arrivalPos ( Last six runs Sep2019 Aug2019 )

---------- Differences in errors ----------
201,1879d200
< Warning: Vehicle 'flow_3.3' will not be able to arrive at the given position!
< Warning: Vehicle 'flow_3.4' will not be able to arrive at the given position!
< Warning: Vehicle 'flow_3.5' will not be able to arrive at the given position!
< Warning: Vehicle 'flow_3.6' will not be able to arrive at the given position!
< Warning: Vehicle 'flow_3.7' will not be able to arrive at the given position!
< Warning: Vehicle 'flow_3.8' will not be able to arrive at the given position!
< Warning: Vehicle 'flow_3.9' will not be able to arrive at the given position!
< Warning: Vehicle 'flow_3.10' will not be able to arrive at the given position!
< Warning: Vehicle 'flow_3.11' will not be able to arrive at the given position!
< Warning: Vehicle 'flow_3.12' will not be able to arrive at the given position!
< Warning: Vehicle 'flow_3.13' will not be able to arrive at the given position!
< Warning: Vehicle 'flow_3.14' will not be able to arrive at the given position!
< Warning: Vehicle 'flow_3.15' will not be able to arrive at the given position!
< Warning: Vehicle 'flow_3.16' will not be able to arrive at the given position!
< Warning: Vehicle 'flow_3.17' will not be able to arrive at the given position!
< Warning: Vehicle 'flow_3.18' will not be able to arrive at the given position!
< Warning: Vehicle 'flow_3.19' will not be able to arrive at the given position!
< Warning: Vehicle 'flow_3.20' will not be able to arrive at the given position!
< Warning: Vehicle 'flow_3.21' will not be able to arrive at the given position!
< Warning: Vehicle 'flow_3.22' will not be able to arrive at the given position!
< Warning: Vehicle 'flow_3.23' will not be able to arrive at the given position!
< Warning: Vehicle 'flow_3.24' will not be able to arrive at the given position!
< Warning: Vehicle 'flow_3.25' will not be able to arrive at the given position!
< Warning: Vehicle 'flow_3.26' will not be able to arrive at the given position!
< Warning: Vehicle 'flow_3.27' will not be able to arrive at the given position!
< Warning: Vehicle 'flow_3.28' will not be able to arrive at the given position!
< Warning: Vehicle 'flow_3.29' will not be able to arrive at the given position!
< Warning: Vehicle 'flow_3.30' will not be able to arrive at the given position!
< Warning: Vehicle 'flow_3.31' will not be able to arrive at the given position!
<truncated after showing first 30 lines>

TEST FAILED on ts-sim-winbuild-ba : demandElements flow load arrivalSpeed ( Last six runs Sep2019 Aug2019 )

---------- Differences in errors ----------
201,1631d200
< Warning: Vehicle 'flow_3.3' will not be able to arrive with the given speed!
< Warning: Vehicle 'flow_3.4' will not be able to arrive with the given speed!
< Warning: Vehicle 'flow_3.5' will not be able to arrive with the given speed!
< Warning: Vehicle 'flow_3.6' will not be able to arrive with the given speed!
< Warning: Vehicle 'flow_3.7' will not be able to arrive with the given speed!
< Warning: Vehicle 'flow_3.8' will not be able to arrive with the given speed!
< Warning: Vehicle 'flow_3.9' will not be able to arrive with the given speed!
< Warning: Vehicle 'flow_3.10' will not be able to arrive with the given speed!
< Warning: Vehicle 'flow_3.11' will not be able to arrive with the given speed!
< Warning: Vehicle 'flow_3.12' will not be able to arrive with the given speed!
< Warning: Vehicle 'flow_3.13' will not be able to arrive with the given speed!
< Warning: Vehicle 'flow_3.14' will not be able to arrive with the given speed!
< Warning: Vehicle 'flow_3.15' will not be able to arrive with the given speed!
< Warning: Vehicle 'flow_3.16' will not be able to arrive with the given speed!
< Warning: Vehicle 'flow_3.17' will not be able to arrive with the given speed!
< Warning: Vehicle 'flow_3.18' will not be able to arrive with the given speed!
< Warning: Vehicle 'flow_3.19' will not be able to arrive with the given speed!
< Warning: Vehicle 'flow_3.20' will not be able to arrive with the given speed!
< Warning: Vehicle 'flow_3.21' will not be able to arrive with the given speed!
< Warning: Vehicle 'flow_3.22' will not be able to arrive with the given speed!
< Warning: Vehicle 'flow_3.23' will not be able to arrive with the given speed!
< Warning: Vehicle 'flow_3.24' will not be able to arrive with the given speed!
< Warning: Vehicle 'flow_3.25' will not be able to arrive with the given speed!
< Warning: Vehicle 'flow_3.26' will not be able to arrive with the given speed!
< Warning: Vehicle 'flow_3.27' will not be able to arrive with the given speed!
< Warning: Vehicle 'flow_3.28' will not be able to arrive with the given speed!
< Warning: Vehicle 'flow_3.29' will not be able to arrive with the given speed!
< Warning: Vehicle 'flow_3.30' will not be able to arrive with the given speed!
< Warning: Vehicle 'flow_3.31' will not be able to arrive with the given speed!
<truncated after showing first 30 lines>

TEST FAILED on ts-sim-winbuild-ba : demandElements stop stopBusStop load expected ( Last six runs Sep2019 Aug2019 )

---------- New result in errors ----------
Error: Attribute 'expected' in definition of a stop is empty.
---------- Missing result in exitcode ----------
1

TEST FAILED on ts-sim-winbuild-ba : demandElements stop stopChargingStation volatileRecomputing ( Last six runs Sep2019 Aug2019 )

---------- Differences in errors ----------
0a1,3
> Warning: No connection between edge 'gneE0' and edge 'gneE4' found.
> Error: Vehicle 'flow_0.0' has no valid route from edge 'gneE0' to stop edge 'gneE4'.
> Quitting (on error).
---------- New result in exitcode ----------
1

5 TESTS FAILED on ts-sim-winbuild-ba :

---------- Differences in errors ----------
0a1
> Warning: Vehicle trip_1 aborted waiting for a person or a container that will never come.
demandElements stop stopContainerStop load actType ( Last six runs Sep2019 Aug2019 )
demandElements stop stopContainerStop load default ( Last six runs Sep2019 Aug2019 )
demandElements stop stopContainerStop load index ( Last six runs Sep2019 Aug2019 )
demandElements stop stopContainerStop load parking ( Last six runs Sep2019 Aug2019 )
demandElements stop stopContainerStop load triggered ( Last six runs Sep2019 Aug2019 )

2 TESTS FAILED on ts-sim-winbuild-ba :

---------- Differences in errors ----------
0a1,2
> Warning: Vehicle 'trip_1' ignores container triggered stop on lane 'gneE0_0' due to capacity constraints.
> Warning: Vehicle trip_1 aborted waiting for a person or a container that will never come.
demandElements stop stopContainerStop load containerTrigger ( Last six runs Sep2019 Aug2019 )
demandElements stop stopContainerStop load expectedContainer ( Last six runs Sep2019 Aug2019 )

TEST FAILED on ts-sim-winbuild-ba : demandElements stop stopContainerStop load expected ( Last six runs Sep2019 Aug2019 )

---------- New result in errors ----------
Error: Attribute 'expected' in definition of a stop is empty.
Warning: Vehicle trip_1 aborted waiting for a person or a container that will never come.
---------- Missing result in exitcode ----------
1

TEST FAILED on ts-sim-winbuild-ba : demandElements stop stopContainerStop volatileRecomputing ( Last six runs Sep2019 Aug2019 )

---------- Differences in errors ----------
0a1,3
> Warning: No connection between edge 'gneE0' and edge 'gneE4' found.
> Error: Vehicle 'trip_0' has no valid route from edge 'gneE0' to stop edge 'gneE4'.
> Quitting (on error).
---------- New result in exitcode ----------
1

TEST FAILED on ts-sim-winbuild-ba : demandElements stop stopParkingArea volatileRecomputing ( Last six runs Sep2019 Aug2019 )

---------- Differences in errors ----------
0a1,2
> Error: parkingArea 'parkingArea_gneE2_4_3' for vehicle 'vehicle_0' on lane 'gneE2_5' is not downstream the current route.
> Quitting (on error).
---------- New result in exitcode ----------
1

TEST FAILED on ts-sim-winbuild-ba : netElements junctions inspect pos ( Last six runs Sep2019 Aug2019 )

---------- Differences in errors ----------
0a1,3
> Error: Invalid position for busStop 'busStop_7_0_1'.
> Error: Could not end a stopping place that is not opened.
> Quitting (on error).
---------- New result in exitcode ----------
1

Detailed information for the tests that had known bugs:

TEST had known bugs (#5893) on ts-sim-winbuild-ba : additionalElements access volatileRecomputing ( Last six runs Sep2019 Aug2019 )

See #5893
(This bug was triggered by text found in file 'errors' matching 'Warning: Ignoring invalid access from non-pedestrian lane')
---------- Differences in errors ----------
0a1,9
> Warning: Ignoring invalid access from non-pedestrian lane 'gneE2_1' in busStop 'busStop_gneE1_0_2'.
> Warning: Ignoring invalid access from non-pedestrian lane 'gneE1_1' in busStop 'busStop_gneE1_0_2'.
> Warning: Ignoring invalid access from non-pedestrian lane 'gneE0_1' in busStop 'busStop_gneE1_0_2'.
> Warning: Ignoring invalid access from non-pedestrian lane 'gneE2_3' in busStop 'busStop_gneE2_0_5'.
> Warning: Ignoring invalid access from non-pedestrian lane 'gneE1_1' in busStop 'busStop_gneE2_0_5'.
> Warning: Ignoring invalid access from non-pedestrian lane 'gneE0_1' in busStop 'busStop_gneE2_0_5'.
> Warning: Ignoring invalid access from non-pedestrian lane 'gneE2_3' in busStop 'busStop_gneE4_0_0'.
> Warning: Ignoring invalid access from non-pedestrian lane 'gneE1_1' in busStop 'busStop_gneE4_0_0'.
> Warning: Ignoring invalid access from non-pedestrian lane 'gneE0_1' in busStop 'busStop_gneE4_0_0'.

TEST had known bugs (Routeprobes #5941) on ts-sim-winbuild-ba : additionalElements calibrator inspect routeprobe ( Last six runs Sep2019 Aug2019 )

#5941
(This bug was triggered by text found in file 'errors' matching 'is not known')
---------- Differences in errors ----------
1c1,2
< Warning: No flow intervals in calibrator 'calibrator_gneE2_0'.
---
> Error: The routeProbe 'customRouteProbeName' to use within the calibrator 'calibrator_gneE2_0' is not known.
> Quitting (on error).
---------- New result in exitcode ----------
1

TEST had known bugs (Routeprobes #5941) on ts-sim-winbuild-ba : additionalElements calibrator load routeProbe ( Last six runs Sep2019 Aug2019 )

#5941
(This bug was triggered by text found in file 'errors' matching 'is not known')
---------- Differences in errors ----------
1c1
< Warning: No flow intervals in calibrator 'calibrator01'.
---
> Error: The routeProbe '%%$%$$$' to use within the calibrator 'calibrator01' is not known.
3a4
> Quitting (on error).
---------- New result in exitcode ----------
1

TEST had known bugs (Routeprobes #5941) on ts-sim-winbuild-ba : additionalElements lanecalibrator inspect routeprobe ( Last six runs Sep2019 Aug2019 )

#5941
(This bug was triggered by text found in file 'errors' matching 'is not known')
---------- Differences in errors ----------
1c1,2
< Warning: No flow intervals in calibrator 'laneCalibrator_gneE2_1_0'.
---
> Error: The routeProbe 'customRouteProbeName' to use within the calibrator 'laneCalibrator_gneE3_1_0' is not known.
> Quitting (on error).
---------- New result in exitcode ----------
1

TEST had known bugs (Routeprobes #5941) on ts-sim-winbuild-ba : additionalElements lanecalibrator load routeProbe ( Last six runs Sep2019 Aug2019 )

#5941
(This bug was triggered by text found in file 'errors' matching 'is not known')
---------- Differences in errors ----------
1c1
< Warning: No flow intervals in calibrator 'calibrator01'.
---
> Error: The routeProbe '%%$%$$$' to use within the calibrator 'calibrator01' is not known.
3c3,4
< Warning: No flow intervals in calibrator 'calibrator03'.
---
> Error: The routeProbe 'myRouteProbe' to use within the calibrator 'calibrator03' is not known.
> Quitting (on error).
---------- New result in exitcode ----------
1

254 TESTS had known bugs (Test needed #3045) on ts-sim-winbuild-ba :

#3045
(This bug was triggered by text found in file 'errors' matching 'File 'net.netedit' is not accessible')
---------- New result in errors ----------
Error: File 'net.netedit' is not accessible (No such file or directory).
Quitting (on error).
demandElements flow create begin ( Last six runs Sep2019 Aug2019 )
demandElements flow create end ( Last six runs Sep2019 Aug2019 )
demandElements flow create number ( Last six runs Sep2019 Aug2019 )
demandElements flow create period ( Last six runs Sep2019 Aug2019 )
demandElements flow create probability ( Last six runs Sep2019 Aug2019 )
demandElements flow create vehsPerHour ( Last six runs Sep2019 Aug2019 )
demandElements flow fix ( Last six runs Sep2019 Aug2019 )
demandElements flow inspect begin ( Last six runs Sep2019 Aug2019 )
demandElements flow inspect end ( Last six runs Sep2019 Aug2019 )
demandElements flow inspect genericParameters ( Last six runs Sep2019 Aug2019 )
demandElements flow inspect number ( Last six runs Sep2019 Aug2019 )
demandElements flow inspect period ( Last six runs Sep2019 Aug2019 )
demandElements flow inspect probability ( Last six runs Sep2019 Aug2019 )
demandElements flow inspect vehsPerHour ( Last six runs Sep2019 Aug2019 )
demandElements flow inspect_selection begin ( Last six runs Sep2019 Aug2019 )
demandElements flow inspect_selection end ( Last six runs Sep2019 Aug2019 )
demandElements flow inspect_selection genericParameters ( Last six runs Sep2019 Aug2019 )
demandElements flow inspect_selection number ( Last six runs Sep2019 Aug2019 )
demandElements flow inspect_selection period ( Last six runs Sep2019 Aug2019 )
demandElements flow inspect_selection probability ( Last six runs Sep2019 Aug2019 )
demandElements flow inspect_selection vehsPerHour ( Last six runs Sep2019 Aug2019 )
demandElements flow load genericParameters ( Last six runs Sep2019 Aug2019 )
demandElements person fix ( Last six runs Sep2019 Aug2019 )
demandElements person inspect ( Last six runs Sep2019 Aug2019 )
demandElements person inspect_selection ( Last six runs Sep2019 Aug2019 )
demandElements person load ( Last six runs Sep2019 Aug2019 )
demandElements person volatileRecomputing ( Last six runs Sep2019 Aug2019 )
demandElements personFlow create begin ( Last six runs Sep2019 Aug2019 )
demandElements personFlow create end ( Last six runs Sep2019 Aug2019 )
demandElements personFlow create number ( Last six runs Sep2019 Aug2019 )
demandElements personFlow create period ( Last six runs Sep2019 Aug2019 )
demandElements personFlow create probability ( Last six runs Sep2019 Aug2019 )
demandElements personFlow create vehsPerHour ( Last six runs Sep2019 Aug2019 )
demandElements personFlow fix ( Last six runs Sep2019 Aug2019 )
demandElements personFlow inspect ( Last six runs Sep2019 Aug2019 )
demandElements personFlow inspect_selection ( Last six runs Sep2019 Aug2019 )
demandElements personFlow load ( Last six runs Sep2019 Aug2019 )
demandElements personFlow volatileRecomputing ( Last six runs Sep2019 Aug2019 )
demandElements routeflow create begin ( Last six runs Sep2019 Aug2019 )
demandElements routeflow create end ( Last six runs Sep2019 Aug2019 )
demandElements routeflow create number ( Last six runs Sep2019 Aug2019 )
demandElements routeflow create period ( Last six runs Sep2019 Aug2019 )
demandElements routeflow create probability ( Last six runs Sep2019 Aug2019 )
demandElements routeflow create vehsPerHour ( Last six runs Sep2019 Aug2019 )
demandElements routeflow fix ( Last six runs Sep2019 Aug2019 )
demandElements routeflow inspect begin ( Last six runs Sep2019 Aug2019 )
demandElements routeflow inspect end ( Last six runs Sep2019 Aug2019 )
demandElements routeflow inspect genericParameters ( Last six runs Sep2019 Aug2019 )
demandElements routeflow inspect number ( Last six runs Sep2019 Aug2019 )
demandElements routeflow inspect period ( Last six runs Sep2019 Aug2019 )
demandElements routeflow inspect probability ( Last six runs Sep2019 Aug2019 )
demandElements routeflow inspect vehsPerHour ( Last six runs Sep2019 Aug2019 )
demandElements routeflow inspect_selection begin ( Last six runs Sep2019 Aug2019 )
demandElements routeflow inspect_selection end ( Last six runs Sep2019 Aug2019 )
demandElements routeflow inspect_selection genericParameters ( Last six runs Sep2019 Aug2019 )
demandElements routeflow inspect_selection number ( Last six runs Sep2019 Aug2019 )
demandElements routeflow inspect_selection period ( Last six runs Sep2019 Aug2019 )
demandElements routeflow inspect_selection probability ( Last six runs Sep2019 Aug2019 )
demandElements routeflow inspect_selection vehsPerHour ( Last six runs Sep2019 Aug2019 )
demandElements routeflow load genericParameters ( Last six runs Sep2019 Aug2019 )
demandElements stop stopLane create actType ( Last six runs Sep2019 Aug2019 )
demandElements stop stopLane create containerTrigger ( Last six runs Sep2019 Aug2019 )
demandElements stop stopLane create default ( Last six runs Sep2019 Aug2019 )
demandElements stop stopLane create duration ( Last six runs Sep2019 Aug2019 )
demandElements stop stopLane create expected ( Last six runs Sep2019 Aug2019 )
demandElements stop stopLane create expectedContainer ( Last six runs Sep2019 Aug2019 )
demandElements stop stopLane create friendlyPos ( Last six runs Sep2019 Aug2019 )
demandElements stop stopLane create index ( Last six runs Sep2019 Aug2019 )
demandElements stop stopLane create no_parent ( Last six runs Sep2019 Aug2019 )
demandElements stop stopLane create parking ( Last six runs Sep2019 Aug2019 )
demandElements stop stopLane create triggered ( Last six runs Sep2019 Aug2019 )
demandElements stop stopLane create tripID ( Last six runs Sep2019 Aug2019 )
demandElements stop stopLane create until ( Last six runs Sep2019 Aug2019 )
demandElements stop stopLane delete ( Last six runs Sep2019 Aug2019 )
demandElements stop stopLane inspect actType ( Last six runs Sep2019 Aug2019 )
demandElements stop stopLane inspect containerTrigger ( Last six runs Sep2019 Aug2019 )
demandElements stop stopLane inspect duration ( Last six runs Sep2019 Aug2019 )
demandElements stop stopLane inspect endPos ( Last six runs Sep2019 Aug2019 )
demandElements stop stopLane inspect expected ( Last six runs Sep2019 Aug2019 )
demandElements stop stopLane inspect expectedContainer ( Last six runs Sep2019 Aug2019 )
demandElements stop stopLane inspect friendlyPos ( Last six runs Sep2019 Aug2019 )
demandElements stop stopLane inspect genericParameters ( Last six runs Sep2019 Aug2019 )
demandElements stop stopLane inspect index ( Last six runs Sep2019 Aug2019 )
demandElements stop stopLane inspect lane ( Last six runs Sep2019 Aug2019 )
demandElements stop stopLane inspect parking ( Last six runs Sep2019 Aug2019 )
demandElements stop stopLane inspect startPos ( Last six runs Sep2019 Aug2019 )
demandElements stop stopLane inspect triggered ( Last six runs Sep2019 Aug2019 )
demandElements stop stopLane inspect tripID ( Last six runs Sep2019 Aug2019 )
demandElements stop stopLane inspect until ( Last six runs Sep2019 Aug2019 )
demandElements stop stopLane inspect_selection actType ( Last six runs Sep2019 Aug2019 )
demandElements stop stopLane inspect_selection containerTrigger ( Last six runs Sep2019 Aug2019 )
demandElements stop stopLane inspect_selection duration ( Last six runs Sep2019 Aug2019 )
demandElements stop stopLane inspect_selection expected ( Last six runs Sep2019 Aug2019 )
demandElements stop stopLane inspect_selection expectedContainer ( Last six runs Sep2019 Aug2019 )
demandElements stop stopLane inspect_selection friendlyPos ( Last six runs Sep2019 Aug2019 )
demandElements stop stopLane inspect_selection genericParameters ( Last six runs Sep2019 Aug2019 )
demandElements stop stopLane inspect_selection index ( Last six runs Sep2019 Aug2019 )
demandElements stop stopLane inspect_selection parking ( Last six runs Sep2019 Aug2019 )
demandElements stop stopLane inspect_selection triggered ( Last six runs Sep2019 Aug2019 )
demandElements stop stopLane inspect_selection tripID ( Last six runs Sep2019 Aug2019 )
demandElements stop stopLane inspect_selection until ( Last six runs Sep2019 Aug2019 )
demandElements stop stopLane load actType ( Last six runs Sep2019 Aug2019 )
demandElements stop stopLane load containerTrigger ( Last six runs Sep2019 Aug2019 )
demandElements stop stopLane load duration ( Last six runs Sep2019 Aug2019 )
demandElements stop stopLane load endPos ( Last six runs Sep2019 Aug2019 )
demandElements stop stopLane load expected ( Last six runs Sep2019 Aug2019 )
demandElements stop stopLane load expectedContainer ( Last six runs Sep2019 Aug2019 )
demandElements stop stopLane load friendlyPos ( Last six runs Sep2019 Aug2019 )
demandElements stop stopLane load genericParameters ( Last six runs Sep2019 Aug2019 )
demandElements stop stopLane load index ( Last six runs Sep2019 Aug2019 )
demandElements stop stopLane load parking ( Last six runs Sep2019 Aug2019 )
demandElements stop stopLane load startPos ( Last six runs Sep2019 Aug2019 )
demandElements stop stopLane load triggered ( Last six runs Sep2019 Aug2019 )
demandElements stop stopLane load tripID ( Last six runs Sep2019 Aug2019 )
demandElements stop stopLane load until ( Last six runs Sep2019 Aug2019 )
demandElements stop stopLane move ( Last six runs Sep2019 Aug2019 )
demandElements trip fix ( Last six runs Sep2019 Aug2019 )
demandElements trip inspect genericParameters ( Last six runs Sep2019 Aug2019 )
demandElements trip inspect_selection genericParameters ( Last six runs Sep2019 Aug2019 )
demandElements trip load genericParameters ( Last six runs Sep2019 Aug2019 )
demandElements vehicle fix ( Last six runs Sep2019 Aug2019 )
demandElements vehicle inspect genericParameters ( Last six runs Sep2019 Aug2019 )
demandElements vehicle inspect_selection genericParameters ( Last six runs Sep2019 Aug2019 )
demandElements vehicle load genericParameters ( Last six runs Sep2019 Aug2019 )
demandElements vehicletype copy ( Last six runs Sep2019 Aug2019 )
demandElements vehicletype create basic accel ( Last six runs Sep2019 Aug2019 )
demandElements vehicletype create basic color ( Last six runs Sep2019 Aug2019 )
demandElements vehicletype create basic decel ( Last six runs Sep2019 Aug2019 )
demandElements vehicletype create basic default ( Last six runs Sep2019 Aug2019 )
demandElements vehicletype create basic id ( Last six runs Sep2019 Aug2019 )
demandElements vehicletype create basic length ( Last six runs Sep2019 Aug2019 )
demandElements vehicletype create basic maxspeed ( Last six runs Sep2019 Aug2019 )
demandElements vehicletype create basic mingap ( Last six runs Sep2019 Aug2019 )
demandElements vehicletype create basic sigma ( Last six runs Sep2019 Aug2019 )
demandElements vehicletype create basic tau ( Last six runs Sep2019 Aug2019 )
demandElements vehicletype create basic vclass ( Last six runs Sep2019 Aug2019 )
demandElements vehicletype create dialog actionStepLength ( Last six runs Sep2019 Aug2019 )
demandElements vehicletype create dialog boardingduration ( Last six runs Sep2019 Aug2019 )
demandElements vehicletype create dialog carfollowingmodel ( Last six runs Sep2019 Aug2019 )
demandElements vehicletype create dialog carfollowingmodel_params accel ( Last six runs Sep2019 Aug2019 )
demandElements vehicletype create dialog carfollowingmodel_params apparentdecel ( Last six runs Sep2019 Aug2019 )
demandElements vehicletype create dialog carfollowingmodel_params ca_gain_gap_cacc ( Last six runs Sep2019 Aug2019 )
demandElements vehicletype create dialog carfollowingmodel_params ca_gain_gap_dot_cacc ( Last six runs Sep2019 Aug2019 )
demandElements vehicletype create dialog carfollowingmodel_params ca_gain_space ( Last six runs Sep2019 Aug2019 )
demandElements vehicletype create dialog carfollowingmodel_params ca_gain_speed ( Last six runs Sep2019 Aug2019 )
demandElements vehicletype create dialog carfollowingmodel_params cf_cc_c1 ( Last six runs Sep2019 Aug2019 )
demandElements vehicletype create dialog carfollowingmodel_params cf_cc_ccaccel ( Last six runs Sep2019 Aug2019 )
demandElements vehicletype create dialog carfollowingmodel_params cf_cc_ccdecel ( Last six runs Sep2019 Aug2019 )
demandElements vehicletype create dialog carfollowingmodel_params cf_cc_constspacing ( Last six runs Sep2019 Aug2019 )
demandElements vehicletype create dialog carfollowingmodel_params cf_cc_flatbed_d ( Last six runs Sep2019 Aug2019 )
demandElements vehicletype create dialog carfollowingmodel_params cf_cc_flatbed_h ( Last six runs Sep2019 Aug2019 )
demandElements vehicletype create dialog carfollowingmodel_params cf_cc_flatbed_ka ( Last six runs Sep2019 Aug2019 )
demandElements vehicletype create dialog carfollowingmodel_params cf_cc_flatbed_kp ( Last six runs Sep2019 Aug2019 )
demandElements vehicletype create dialog carfollowingmodel_params cf_cc_flatbed_kv ( Last six runs Sep2019 Aug2019 )
demandElements vehicletype create dialog carfollowingmodel_params cf_cc_kp ( Last six runs Sep2019 Aug2019 )
demandElements vehicletype create dialog carfollowingmodel_params cf_cc_lambda ( Last six runs Sep2019 Aug2019 )
demandElements vehicletype create dialog carfollowingmodel_params cf_cc_lanes_count ( Last six runs Sep2019 Aug2019 )
demandElements vehicletype create dialog carfollowingmodel_params cf_cc_omegan ( Last six runs Sep2019 Aug2019 )
demandElements vehicletype create dialog carfollowingmodel_params cf_cc_ploeg_h ( Last six runs Sep2019 Aug2019 )
demandElements vehicletype create dialog carfollowingmodel_params cf_cc_ploeg_kd ( Last six runs Sep2019 Aug2019 )
demandElements vehicletype create dialog carfollowingmodel_params cf_cc_ploeg_kp ( Last six runs Sep2019 Aug2019 )
demandElements vehicletype create dialog carfollowingmodel_params cf_cc_tau ( Last six runs Sep2019 Aug2019 )
demandElements vehicletype create dialog carfollowingmodel_params cf_cc_xi ( Last six runs Sep2019 Aug2019 )
demandElements vehicletype create dialog carfollowingmodel_params cf_idm_delta ( Last six runs Sep2019 Aug2019 )
demandElements vehicletype create dialog carfollowingmodel_params cf_idm_stepping ( Last six runs Sep2019 Aug2019 )
demandElements vehicletype create dialog carfollowingmodel_params cf_idmm_adapt_factor ( Last six runs Sep2019 Aug2019 )
demandElements vehicletype create dialog carfollowingmodel_params cf_idmm_adapt_time ( Last six runs Sep2019 Aug2019 )
demandElements vehicletype create dialog carfollowingmodel_params cf_kerner_phi ( Last six runs Sep2019 Aug2019 )
demandElements vehicletype create dialog carfollowingmodel_params cf_pwagner2009_approb ( Last six runs Sep2019 Aug2019 )
demandElements vehicletype create dialog carfollowingmodel_params cf_pwagner2009_taulast ( Last six runs Sep2019 Aug2019 )
demandElements vehicletype create dialog carfollowingmodel_params cf_w99_cc1 ( Last six runs Sep2019 Aug2019 )
demandElements vehicletype create dialog carfollowingmodel_params cf_w99_cc2 ( Last six runs Sep2019 Aug2019 )
demandElements vehicletype create dialog carfollowingmodel_params cf_w99_cc3 ( Last six runs Sep2019 Aug2019 )
demandElements vehicletype create dialog carfollowingmodel_params cf_w99_cc4 ( Last six runs Sep2019 Aug2019 )
demandElements vehicletype create dialog carfollowingmodel_params cf_w99_cc5 ( Last six runs Sep2019 Aug2019 )
demandElements vehicletype create dialog carfollowingmodel_params cf_w99_cc6 ( Last six runs Sep2019 Aug2019 )
demandElements vehicletype create dialog carfollowingmodel_params cf_w99_cc7 ( Last six runs Sep2019 Aug2019 )
demandElements vehicletype create dialog carfollowingmodel_params cf_w99_cc8 ( Last six runs Sep2019 Aug2019 )
demandElements vehicletype create dialog carfollowingmodel_params cf_w99_cc9 ( Last six runs Sep2019 Aug2019 )
demandElements vehicletype create dialog carfollowingmodel_params cf_wiedemann_estimation ( Last six runs Sep2019 Aug2019 )
demandElements vehicletype create dialog carfollowingmodel_params cf_wiedemann_security ( Last six runs Sep2019 Aug2019 )
demandElements vehicletype create dialog carfollowingmodel_params collision_mingap_factor ( Last six runs Sep2019 Aug2019 )
demandElements vehicletype create dialog carfollowingmodel_params decel ( Last six runs Sep2019 Aug2019 )
demandElements vehicletype create dialog carfollowingmodel_params emergencydecel ( Last six runs Sep2019 Aug2019 )
demandElements vehicletype create dialog carfollowingmodel_params gc_gain_gap_cacc ( Last six runs Sep2019 Aug2019 )
demandElements vehicletype create dialog carfollowingmodel_params gc_gain_gap_dot_cacc ( Last six runs Sep2019 Aug2019 )
demandElements vehicletype create dialog carfollowingmodel_params gc_gain_space ( Last six runs Sep2019 Aug2019 )
demandElements vehicletype create dialog carfollowingmodel_params gc_gain_speed ( Last six runs Sep2019 Aug2019 )
demandElements vehicletype create dialog carfollowingmodel_params gcc_gain_gap_cacc ( Last six runs Sep2019 Aug2019 )
demandElements vehicletype create dialog carfollowingmodel_params gcc_gain_gap_dot_cacc ( Last six runs Sep2019 Aug2019 )
demandElements vehicletype create dialog carfollowingmodel_params gcc_gain_space ( Last six runs Sep2019 Aug2019 )
demandElements vehicletype create dialog carfollowingmodel_params gcc_gain_speed ( Last six runs Sep2019 Aug2019 )
demandElements vehicletype create dialog carfollowingmodel_params headway_time_cacc_to_acc ( Last six runs Sep2019 Aug2019 )
demandElements vehicletype create dialog carfollowingmodel_params k ( Last six runs Sep2019 Aug2019 )
demandElements vehicletype create dialog carfollowingmodel_params sc_gain ( Last six runs Sep2019 Aug2019 )
demandElements vehicletype create dialog carfollowingmodel_params sc_gain_cacc ( Last six runs Sep2019 Aug2019 )
demandElements vehicletype create dialog carfollowingmodel_params sigma ( Last six runs Sep2019 Aug2019 )
demandElements vehicletype create dialog carfollowingmodel_params tau ( Last six runs Sep2019 Aug2019 )
demandElements vehicletype create dialog carfollowingmodel_params tmp1 ( Last six runs Sep2019 Aug2019 )
demandElements vehicletype create dialog carfollowingmodel_params tmp2 ( Last six runs Sep2019 Aug2019 )
demandElements vehicletype create dialog carfollowingmodel_params tmp3 ( Last six runs Sep2019 Aug2019 )
demandElements vehicletype create dialog carfollowingmodel_params tmp4 ( Last six runs Sep2019 Aug2019 )
demandElements vehicletype create dialog carfollowingmodel_params tmp5 ( Last six runs Sep2019 Aug2019 )
demandElements vehicletype create dialog carfollowingmodel_params train_type ( Last six runs Sep2019 Aug2019 )
demandElements vehicletype create dialog color ( Last six runs Sep2019 Aug2019 )
demandElements vehicletype create dialog containercapacity ( Last six runs Sep2019 Aug2019 )
demandElements vehicletype create dialog default ( Last six runs Sep2019 Aug2019 )
demandElements vehicletype create dialog emissionclass ( Last six runs Sep2019 Aug2019 )
demandElements vehicletype create dialog genericParameters ( Last six runs Sep2019 Aug2019 )
demandElements vehicletype create dialog guishape ( Last six runs Sep2019 Aug2019 )
demandElements vehicletype create dialog id ( Last six runs Sep2019 Aug2019 )
demandElements vehicletype create dialog imgfile ( Last six runs Sep2019 Aug2019 )
demandElements vehicletype create dialog impatience ( Last six runs Sep2019 Aug2019 )
demandElements vehicletype create dialog junctionmodel_params jm_crossing_gap ( Last six runs Sep2019 Aug2019 )
demandElements vehicletype create dialog junctionmodel_params jm_drive_after_red_time ( Last six runs Sep2019 Aug2019 )
demandElements vehicletype create dialog junctionmodel_params jm_drive_after_yellow_time ( Last six runs Sep2019 Aug2019 )
demandElements vehicletype create dialog junctionmodel_params jm_drive_red_speed ( Last six runs Sep2019 Aug2019 )
demandElements vehicletype create dialog junctionmodel_params jm_ignore_foe_prob ( Last six runs Sep2019 Aug2019 )
demandElements vehicletype create dialog junctionmodel_params jm_ignore_foe_speed ( Last six runs Sep2019 Aug2019 )
demandElements vehicletype create dialog junctionmodel_params jm_ignore_keep_clear_time ( Last six runs Sep2019 Aug2019 )
demandElements vehicletype create dialog junctionmodel_params jm_sigma_minor ( Last six runs Sep2019 Aug2019 )
demandElements vehicletype create dialog junctionmodel_params jm_timegap_minor ( Last six runs Sep2019 Aug2019 )
demandElements vehicletype create dialog lanechangemodel ( Last six runs Sep2019 Aug2019 )
demandElements vehicletype create dialog lanechangemodel_params lc_accel_lat ( Last six runs Sep2019 Aug2019 )
demandElements vehicletype create dialog lanechangemodel_params lc_assertive ( Last six runs Sep2019 Aug2019 )
demandElements vehicletype create dialog lanechangemodel_params lc_cooperative ( Last six runs Sep2019 Aug2019 )
demandElements vehicletype create dialog lanechangemodel_params lc_impatience ( Last six runs Sep2019 Aug2019 )
demandElements vehicletype create dialog lanechangemodel_params lc_keep_right ( Last six runs Sep2019 Aug2019 )
demandElements vehicletype create dialog lanechangemodel_params lc_lookahead_left ( Last six runs Sep2019 Aug2019 )
demandElements vehicletype create dialog lanechangemodel_params lc_max_speed_lat_factor ( Last six runs Sep2019 Aug2019 )
demandElements vehicletype create dialog lanechangemodel_params lc_max_speed_lat_standing ( Last six runs Sep2019 Aug2019 )
demandElements vehicletype create dialog lanechangemodel_params lc_opposite ( Last six runs Sep2019 Aug2019 )
demandElements vehicletype create dialog lanechangemodel_params lc_overtake_right ( Last six runs Sep2019 Aug2019 )
demandElements vehicletype create dialog lanechangemodel_params lc_pushy ( Last six runs Sep2019 Aug2019 )
demandElements vehicletype create dialog lanechangemodel_params lc_pushy_gap ( Last six runs Sep2019 Aug2019 )
demandElements vehicletype create dialog lanechangemodel_params lc_speed_gain ( Last six runs Sep2019 Aug2019 )
demandElements vehicletype create dialog lanechangemodel_params lc_speed_gain_right ( Last six runs Sep2019 Aug2019 )
demandElements vehicletype create dialog lanechangemodel_params lc_strategic ( Last six runs Sep2019 Aug2019 )
demandElements vehicletype create dialog lanechangemodel_params lc_sublane ( Last six runs Sep2019 Aug2019 )
demandElements vehicletype create dialog lanechangemodel_params lc_time_to_impatience ( Last six runs Sep2019 Aug2019 )
demandElements vehicletype create dialog lanechangemodel_params lc_turn_alignment_distance ( Last six runs Sep2019 Aug2019 )
demandElements vehicletype create dialog latalignment ( Last six runs Sep2019 Aug2019 )
demandElements vehicletype create dialog length ( Last six runs Sep2019 Aug2019 )
demandElements vehicletype create dialog loadingduration ( Last six runs Sep2019 Aug2019 )
demandElements vehicletype create dialog maxspeed ( Last six runs Sep2019 Aug2019 )
demandElements vehicletype create dialog maxspeedlat ( Last six runs Sep2019 Aug2019 )
demandElements vehicletype create dialog mingap ( Last six runs Sep2019 Aug2019 )
demandElements vehicletype create dialog mingaplat ( Last six runs Sep2019 Aug2019 )
demandElements vehicletype create dialog osgfile ( Last six runs Sep2019 Aug2019 )
demandElements vehicletype create dialog personcapacity ( Last six runs Sep2019 Aug2019 )
demandElements vehicletype create dialog speeddev ( Last six runs Sep2019 Aug2019 )
demandElements vehicletype create dialog speedfactor ( Last six runs Sep2019 Aug2019 )
demandElements vehicletype create dialog vclass ( Last six runs Sep2019 Aug2019 )
demandElements vehicletype create dialog width ( Last six runs Sep2019 Aug2019 )

2 TESTS had known bugs (Generic parameters #5895) on ts-sim-winbuild-ba :

#5895
(This bug was triggered by text found in file 'errors' matching 'Error: Attribute 'key' in definition of a param is empty.')
---------- New result in errors ----------
Error: Attribute 'key' in definition of a param is empty.
---------- New result in output ----------
Loading configuration... done.
demandElements route load genericparameters ( Last six runs Sep2019 Aug2019 )
demandElements vehicletype load genericParameters ( Last six runs Sep2019 Aug2019 )

TEST had known bugs (#5875) on ts-sim-winbuild-ba : demandElements routeflow load line ( Last six runs Sep2019 Aug2019 )

See #5875
(This bug was triggered by text found in file 'errors' matching 'Error: Attribute 'line' in definition of flow 'flow_1' is empty')
---------- Differences in errors ----------
0a1
> Error: Attribute 'line' in definition of flow 'flow_1' is empty.

Detailed information for the tests that were terminated before completion:

TEST were terminated before completion (TIMEOUT) on ts-sim-winbuild-ba : demandElements stop stopChargingStation load parking ( Last six runs Sep2019 Aug2019 )

Test exceeded wallclock time limit of 300.0 seconds

9 TESTS were terminated before completion (TIMEOUT) on ts-sim-winbuild-ba :

Test exceeded wallclock time limit of 300.0 seconds
---------- New result in errors ----------
Warning: Vehicle 'trip_0' ignores container triggered stop on lane 'gneE0_0' due to capacity constraints.
---------- Missing result in exitcode ----------
1
demandElements stop stopContainerStop inspect_selection actType ( Last six runs Sep2019 Aug2019 )
demandElements stop stopContainerStop inspect_selection containerTrigger ( Last six runs Sep2019 Aug2019 )
demandElements stop stopContainerStop inspect_selection duration ( Last six runs Sep2019 Aug2019 )
demandElements stop stopContainerStop inspect_selection expected ( Last six runs Sep2019 Aug2019 )
demandElements stop stopContainerStop inspect_selection expectedContainer ( Last six runs Sep2019 Aug2019 )
demandElements stop stopContainerStop inspect_selection index ( Last six runs Sep2019 Aug2019 )
demandElements stop stopContainerStop inspect_selection parking ( Last six runs Sep2019 Aug2019 )
demandElements stop stopContainerStop inspect_selection triggered ( Last six runs Sep2019 Aug2019 )
demandElements stop stopContainerStop inspect_selection until ( Last six runs Sep2019 Aug2019 )