08Oct20rv1_7_0+0541-53431a797a - detailed test results for DUAROUTER

To reconnect the TextTest GUI to these results, run:

texttest.exe -a duarouter -d C:\Users\delphi\testreports\sumo\git\tests -reconnect C:\Users\delphi\testreports\sumo\msvc16Win32texttesttmp\msvc16Win32.01Oct015602.5376 -g

To start TextTest for these tests, run:

texttest.exe -a duarouter -d C:\Users\delphi\testreports\sumo\git\tests


default: 510 tests: 505 succeeded 2 known bugs 2 FAILED 1 killed

Detailed information for the tests that FAILED:

TEST FAILED on ts-sim-wintest-ba : person personTrip taxi transfer_allJunctions_shared_space ( Last six runs Oct2020 )

---------- Differences in additional ----------
96,105d95
<     <edge id="-138624477#0_car-1.00:138624477#0_fwd-1.00" line="!access" length="255.75" successors="138624477#0_fwd-1.00"/>
<     <edge id="-138624477#0_car-1.00:-138624477#0_bwd-1.00" line="!access" length="255.79" successors="-138624477#0_bwd-1.00"/>
<     <edge id="-138624477#1_car-1.00::456813380_w0-1.00" line="!access" length="10.03" successors=":456813380_w0-1.00"/>
<     <edge id="-138624477#1_car-1.00:-138624477#0_fwd-1.00" line="!access" length="255.79" successors="-138624477#0_fwd-1.00"/>
<     <edge id="-138624477#1_car-1.00:138624477#1_fwd-1.00" line="!access" length="55.81" successors="138624477#1_fwd-1.00"/>
<     <edge id="-138624477#1_car-1.00:38568632#0_fwd-1.00" line="!access" length="45.22" successors="38568632#0_fwd-1.00"/>
<     <edge id="-138624477#1_car-1.00::456813380_w0-1.00" line="!access" length="10.03" successors=":456813380_w0-1.00"/>
<     <edge id="-138624477#1_car-1.00:-138624477#1_bwd-1.00" line="!access" length="55.81" successors="-138624477#1_bwd-1.00"/>
<     <edge id="-138624477#1_car-1.00:-38568632#0_bwd-1.00" line="!access" length="44.60" successors="-38568632#0_bwd-1.00"/>
<     <edge id="-138624477#1_car-1.00:138624477#0_bwd-1.00" line="!access" length="255.75" successors="138624477#0_bwd-1.00"/>
122,123d111
<     <edge id="138624477#1_car-1.00:-138624477#1_fwd-1.00" line="!access" length="55.81" successors="-138624477#1_fwd-1.00"/>
<     <edge id="138624477#1_car-1.00:138624477#1_bwd-1.00" line="!access" length="55.81" successors="138624477#1_bwd-1.00"/>
125a114,125
>     <edge id="138624477#1_car-1.00:-138624477#1_fwd-1.00" line="!access" length="55.81" successors="-138624477#1_fwd-1.00"/>
>     <edge id="138624477#1_car-1.00:138624477#1_bwd-1.00" line="!access" length="55.81" successors="138624477#1_bwd-1.00"/>
>     <edge id="-138624477#0_car-1.00:138624477#0_fwd-1.00" line="!access" length="255.75" successors="138624477#0_fwd-1.00"/>
>     <edge id="-138624477#0_car-1.00:-138624477#0_bwd-1.00" line="!access" length="255.79" successors="-138624477#0_bwd-1.00"/>
>     <edge id="-138624477#1_car-1.00::456813380_w0-1.00" line="!access" length="10.03" successors=":456813380_w0-1.00"/>
>     <edge id="-138624477#1_car-1.00:-138624477#0_fwd-1.00" line="!access" length="255.79" successors="-138624477#0_fwd-1.00"/>
>     <edge id="-138624477#1_car-1.00:138624477#1_fwd-1.00" line="!access" length="55.81" successors="138624477#1_fwd-1.00"/>
>     <edge id="-138624477#1_car-1.00:38568632#0_fwd-1.00" line="!access" length="45.22" successors="38568632#0_fwd-1.00"/>
>     <edge id="-138624477#1_car-1.00::456813380_w0-1.00" line="!access" length="10.03" successors=":456813380_w0-1.00"/>
>     <edge id="-138624477#1_car-1.00:-138624477#1_bwd-1.00" line="!access" length="55.81" successors="-138624477#1_bwd-1.00"/>
>     <edge id="-138624477#1_car-1.00:-38568632#0_bwd-1.00" line="!access" length="44.60" successors="-38568632#0_bwd-1.00"/>
>     <edge id="-138624477#1_car-1.00:138624477#0_bwd-1.00" line="!access" length="255.75" successors="138624477#0_bwd-1.00"/>

TEST FAILED on ts-sim-wintest-ba : person personTrip walk_via_trainStop_ride_taxi ( Last six runs Oct2020 )

---------- Differences in routes ----------
8d7
<         <walk edges="A0A1"/>

Detailed information for the tests that had known bugs:

TEST had known bugs (see #6113) on ts-sim-wintest-ba : errors skip_new_routes_defect ( Last six runs Oct2020 )

Error not found
(This bug was triggered by FAILING to find text in file 'errors' matching 'Error')
---------- Differences in alts ----------
13c13
<             <route cost="125.90" probability="1.00000000" edges="beg middle end rend"/>
---
>             <route cost="53.96" probability="1.00000000" edges="beg end rend"/>
---------- Differences in errors ----------
1d0
< Error: Vehicle '9' has no valid route. No connection between edge 'beg' and edge 'end'.
---------- Differences in routes ----------
10c10
<         <route edges="beg middle end rend"/>
---
>         <route edges="beg end rend"/>

TEST had known bugs (see #5821) on ts-sim-wintest-ba : person personTrip ride_trip_access ( Last six runs Oct2020 )

inconsistent input handling
(This bug was triggered by text found in file 'errors' matching 'No route')
---------- Differences in alts ----------
5,12c5
< <routes xmlns:xsi="http://www.w3.org/2001/XMLSchema-instance" xsi:noNamespaceSchemaLocation="http://sumo.dlr.de/xsd/routes_file.xsd">
<     <person id="p0" depart="400.00">
<         <stop busStop="stopB_S" duration="0.10"/>
<         <ride cost="138.90" busStop="stopA_S" lines="tBA" intended="trainBA.0" depart="439.00"/> <!-- A -->
<         <walk cost="29.31" edges="accessA" departPos="800.00" busStop="stopA_E"/> <!-- A -->
<         <walk cost="1150.53" edges="accessA A0B0 accessC" departPos="300.00" busStop="stopC_E"/> <!-- C -->
<     </person>
< </routes>
---
> <routes xmlns:xsi="http://www.w3.org/2001/XMLSchema-instance" xsi:noNamespaceSchemaLocation="http://sumo.dlr.de/xsd/routes_file.xsd"/>
---------- Differences in errors ----------
0a1,3
> Warning: No connection between edge 'stopA_E' and edge 'accessC_arrival_connector' found.
> Error: No route for trip in person 'p0'.
> Quitting (on error).
---------- Differences in output ----------
1d0
< Success.
---------- Differences in routes ----------
5,12c5
< <routes xmlns:xsi="http://www.w3.org/2001/XMLSchema-instance" xsi:noNamespaceSchemaLocation="http://sumo.dlr.de/xsd/routes_file.xsd">
<     <person id="p0" depart="400.00">
<         <stop busStop="stopB_S" duration="0.10"/>
<         <ride busStop="stopA_S" lines="tBA" intended="trainBA.0" depart="439.00"/> <!-- A -->
<         <walk edges="accessA" departPos="800.00" busStop="stopA_E"/> <!-- A -->
<         <walk edges="accessA A0B0 accessC" departPos="300.00" busStop="stopC_E"/> <!-- C -->
<     </person>
< </routes>
---
> <routes xmlns:xsi="http://www.w3.org/2001/XMLSchema-instance" xsi:noNamespaceSchemaLocation="http://sumo.dlr.de/xsd/routes_file.xsd"/>
---------- New result in exitcode ----------
1

Detailed information for the tests that were terminated before completion:

TEST were terminated before completion (TIMEOUT) on ts-sim-wintest-ba : routes embedded with_stops_on_junction ( Last six runs Oct2020 )

Test exceeded wallclock time limit of 300.0 seconds
---------- Differences in output ----------
1d0
< Success.
---------- Missing result in alts ----------
<?xml version="1.0" encoding="UTF-8"?>

-->

<routes xmlns:xsi="http://www.w3.org/2001/XMLSchema-instance" xsi:noNamespaceSchemaLocation="http://sumo.dlr.de/xsd/routes_file.xsd">
    <vehicle id="0" depart="0.00" departPos="10.00">
        <routeDistribution last="0">
            <route cost="4.83" probability="1.00000000" edges="A0toB0 B0toC0"/>
        </routeDistribution>
        <stop lane=":B0_4_0" endPos="2.00" duration="5.00"/>
    </vehicle>
</routes>
---------- Missing result in routes ----------
<?xml version="1.0" encoding="UTF-8"?>

-->

<routes xmlns:xsi="http://www.w3.org/2001/XMLSchema-instance" xsi:noNamespaceSchemaLocation="http://sumo.dlr.de/xsd/routes_file.xsd">
    <vehicle id="0" depart="0.00" departPos="10.00">
        <route edges="A0toB0 B0toC0"/>
        <stop lane=":B0_4_0" endPos="2.00" duration="5.00"/>
    </vehicle>
</routes>