06Apr24rv1_19_0+1713-444e81c5c23 - detailed test results for COMPLEX

To reconnect the TextTest GUI to these results, run:

texttest.exe -a complex -d C:\Users\delphi\testreports\sumo\git\tests -reconnect C:\Users\delphi\testreports\sumo\msvc16x64Dtexttesttmp\msvc16x64D.30Apr030023.7900 -g

To start TextTest for these tests, run:

texttest.exe -a complex -d C:\Users\delphi\testreports\sumo\git\tests


default: 743 tests: 726 succeeded 9 known bugs 5 FAILED 3 killed

Detailed information for the tests that FAILED:

TEST FAILED on ts-sim-wintest-ba : sumo gui ( Last six runs Apr2024 )

---------- Differences in errors ----------
0a1,18
> Traceback (most recent call last):
>   File "C:/Users/delphi/testreports/sumo/git/tests/../tests/complex/sumo/gui/runner.py", line 47, in <module>
>     findAndClick(PLAY)
>   File "C:/Users/delphi/testreports/sumo/git/tests/../tests/complex/sumo/gui/runner.py", line 38, in findAndClick
>     positionOnScreen = pyautogui.locateOnScreen(obj, minSearchTime=3)
>   File "C:/Program Files/Python38/lib/site-packages/pyautogui/__init__.py", line 175, in wrapper
>     return wrappedFunction(*args, **kwargs)
>   File "C:/Program Files/Python38/lib/site-packages/pyautogui/__init__.py", line 213, in locateOnScreen
>     return pyscreeze.locateOnScreen(*args, **kwargs)
>   File "C:/Program Files/Python38/lib/site-packages/pyscreeze/__init__.py", line 371, in locateOnScreen
>     screenshotIm = screenshot(region=None) # the locateAll() function must handle cropping to return accurate coordinates, so don't pass a region here.
>   File "C:/Program Files/Python38/lib/site-packages/pyscreeze/__init__.py", line 144, in wrapper
>     return wrappedFunction(*args, **kwargs)
>   File "C:/Program Files/Python38/lib/site-packages/pyscreeze/__init__.py", line 456, in _screenshot_win32
>     im = ImageGrab.grab()
>   File "C:/Program Files/Python38/lib/site-packages/PIL/ImageGrab.py", line 43, in grab
>     offset, size, data = Image.core.grabscreen_win32(
> OSError: screen grab failed
---------- New result in vehroutes ----------
<?xml version="1.0" encoding="UTF-8"?>

<!-- generated on 2024-04-06 02:52:00 by Eclipse SUMO GUI Version v1_19_0+1713-444e81c5c23
<configuration xmlns:xsi="http://www.w3.org/2001/XMLSchema-instance" xsi:noNamespaceSchemaLocation="http://sumo.dlr.de/xsd/sumoConfiguration.xsd">

    <input>
        <net-file value="input_net.net.xml"/>
        <route-files value="input_routes.rou.xml"/>
    </input>

    <output>
        <vehroute-output value="vehroutes.xml"/>
    </output>

    <report>
        <duration-log.disable value="true"/>
        <no-step-log value="true"/>
    </report>

    <gui_only>
        <gui-settings-file value="settings.xml"/>
        <quit-on-end value="true"/>
    </gui_only>

</configuration>

TEST FAILED on ts-sim-wintest-ba : sumo protobuf ( Last six runs Apr2024 )

---------- Differences in errors ----------
0a1,30
> Traceback (most recent call last):
>   File "C:/Users/delphi/testreports/sumo/git/tools/xml/protobuf2xml.py", line 32, in <module>
>     import google.protobuf.descriptor  # we need to do this late because the xml2protobuf import modifies sys.path
> ImportError: bad magic number in 'google': b'/x03/xf3/r/n'
> Traceback (most recent call last):
>   File "C:/Users/delphi/testreports/sumo/git/tools/xml/xml2protobuf.py", line 208, in <module>
>     main()
>   File "C:/Users/delphi/testreports/sumo/git/tools/xml/xml2protobuf.py", line 194, in main
>     module = generateProto(attrFinder.tagAttrs, attrFinder.depthTags,
>   File "C:/Users/delphi/testreports/sumo/git/tools/xml/xml2protobuf.py", line 185, in generateProto
>     return importlib.import_module("%s_pb2" % base)
>   File "C:/Program Files/Python38/lib/importlib/__init__.py", line 127, in import_module
>     return _bootstrap._gcd_import(name[level:], package, level)
>   File "<frozen importlib._bootstrap>", line 1014, in _gcd_import
>   File "<frozen importlib._bootstrap>", line 991, in _find_and_load
>   File "<frozen importlib._bootstrap>", line 975, in _find_and_load_unlocked
>   File "<frozen importlib._bootstrap>", line 671, in _load_unlocked
>   File "<frozen importlib._bootstrap_external>", line 783, in exec_module
>   File "<frozen importlib._bootstrap>", line 219, in _call_with_frames_removed
>   File "C:/Users/delphi/testreports/sumo/msvc16x64Dtexttesttmp/msvc16x64D.06Apr024842.6096/complex/sumo/protobuf/trajectories_pb2.py", line 5, in <module>
>     from google.protobuf.internal import builder as _builder
> ImportError: bad magic number in 'google': b'/x03/xf3/r/n'
> Error: send failed: Software caused tcpip::Socket abort
> Quitting (on error).
> Traceback (most recent call last):
>   File "C:/Users/delphi/testreports/sumo/git/tests/../tests/complex/sumo/protobuf/runner.py", line 80, in <module>
>     connect(IN_PORT, OUT_PORT)
>   File "C:/Users/delphi/testreports/sumo/git/tests/../tests/complex/sumo/protobuf/runner.py", line 37, in connect
>     i.connect(("localhost", inPort))
<truncated after showing first 30 lines>
---------- Differences in output ----------
1,5d0
< --- 
< +++ 
< -
< -<trajectories xmlns:xsi="http://www.w3.org/2001/XMLSchema-instance" xsi:noNamespaceSchemaLocation="http://sumo.dlr.de/xsd/amitran/trajectories.xsd" timeStepSize="1000">
< +<trajectories timeStepSize="1000">

TEST FAILED on ts-sim-wintest-ba : sumo xmlValidation ( Last six runs Apr2024 )

---------- Differences in output ----------
6a7,11
> Error: unable to open file 'https://sumo.dlr.de/xsd/routes_file.xsd'
>  In file 'routes.rou.xml'
>  At line/column 1/0.
> 
> Quitting (on error).
8a14,18
> Error: unable to open file 'https://sumo.dlr.de/xsd/routes_file.xsd'
>  In file 'routes.rou.xml'
>  At line/column 1/0.
> 
> Quitting (on error).
18a29,33
> Error: unable to open file 'https://sumo.dlr.de/xsd/routes_file.xsd'
>  In file 'routes.rou.xml'
>  At line/column 1/0.
> 
> Quitting (on error).
21a37,41
> Error: unable to open file 'https://sumo.dlr.de/xsd/routes_file.xsd'
>  In file 'routes.rou.xml'
>  At line/column 1/0.
> 
> Quitting (on error).
27a48,52
> Error: unable to open file 'https://sumo.dlr.de/xsd/routes_file.xsd'
>  In file 'routes.rou.xml'
>  At line/column 1/0.
> 
> Quitting (on error).
<truncated after showing first 30 lines>

TEST FAILED on ts-sim-wintest-ba : traas api ( Last six runs Apr2024 )

---------- Differences in errors ----------
1,2c1,2
< Note: data/APITest.java uses unchecked or unsafe operations.
< Note: Recompile with -Xlint:unchecked for details.
---
> Hinweis: data/APITest.java verwendet nicht geprüfte oder unsichere Vorgänge.
> Hinweis: Wiederholen Sie die Kompilierung mit -Xlint:unchecked, um Details zu erhalten.

TEST FAILED on ts-sim-wintest-ba : traci misc signature ( Last six runs Apr2024 )

---------- Differences in output ----------
5c5
< Domain.setParameter() got an unexpected keyword argument 'oID'
---
> setParameter() got an unexpected keyword argument 'oID'

Detailed information for the tests that had known bugs:

TEST had known bugs (see #8973) on ts-sim-wintest-ba : sumo ToCDevice dynamic_ToC_stop ( Last six runs Apr2024 )

dynamic ToC triggered despite stop present on vehicle's lane continuation
(This bug was triggered by text found in file 'tocs' matching 'DYNTOR')

TEST had known bugs (see #254) on ts-sim-wintest-ba : sumo output one_vehicle ( Last six runs Apr2024 )

different outputs from detectors which should detect the same
(This bug was triggered by text found in file 'output' matching 'failed')
---------- Differences in output ----------
5,7c5,7
< success 0.1 ['--step-length', '.1', '--end', '100'] ['3/1to2/1_0']
< success 1 ['--step-length', '.1', '--end', '100'] ['3/1to2/1_0']
< success 10 ['--step-length', '.1', '--end', '100'] ['3/1to2/1_0']
---
> failed 0.1 ['--step-length', '.1', '--end', '100'] 3/1to2/1_0 (71.4, 71.5) <zip object at 0x0000022B5F9E34C0>
> failed 1 ['--step-length', '.1', '--end', '100'] 3/1to2/1_0 (72.0, 73.0) <zip object at 0x0000022B5F9C5B00>
> failed 10 ['--step-length', '.1', '--end', '100'] 3/1to2/1_0 (80.0, 90.0) <zip object at 0x0000022B5F9C5400>
9,12c9,12
< success 0.1 ['--step-length', '.1', '--end', '1000'] ['3/1to2/1_0']
< success 1 ['--step-length', '.1', '--end', '1000'] ['3/1to2/1_0']
< success 10 ['--step-length', '.1', '--end', '1000'] ['3/1to2/1_0']
< success 100 ['--step-length', '.1', '--end', '1000'] ['3/1to2/1_0']
---
> failed 0.1 ['--step-length', '.1', '--end', '1000'] 3/1to2/1_0 (71.4, 71.5) <zip object at 0x0000022B604A81C0>
> failed 1 ['--step-length', '.1', '--end', '1000'] 3/1to2/1_0 (72.0, 73.0) <zip object at 0x0000022B5F9E34C0>
> failed 10 ['--step-length', '.1', '--end', '1000'] 3/1to2/1_0 (80.0, 90.0) <zip object at 0x0000022B5F9BE840>
> failed 100 ['--step-length', '.1', '--end', '1000'] 3/1to2/1_0 (100.0, 200.0) <zip object at 0x0000022B5F9A8B00>
17,19c17,19
< success 0.1 ['--step-length', '1', '--end', '100'] ['3/1to2/1_0']
< success 1 ['--step-length', '1', '--end', '100'] ['3/1to2/1_0']
< success 10 ['--step-length', '1', '--end', '100'] ['3/1to2/1_0']
---
> failed 0.1 ['--step-length', '1', '--end', '100'] 3/1to2/1_0 (73.0, 74.0) <zip object at 0x0000022B5F9E30C0>
> failed 1 ['--step-length', '1', '--end', '100'] 3/1to2/1_0 (73.0, 74.0) <zip object at 0x0000022B5F9E30C0>
> failed 10 ['--step-length', '1', '--end', '100'] 3/1to2/1_0 (80.0, 90.0) <zip object at 0x0000022B5F9E38C0>
21,50c21,24
< success 0.1 ['--step-length', '1', '--end', '1000'] ['3/1to2/1_0']
< success 1 ['--step-length', '1', '--end', '1000'] ['3/1to2/1_0']
< success 10 ['--step-length', '1', '--end', '1000'] ['3/1to2/1_0']
<truncated after showing first 30 lines>

TEST had known bugs (see #254) on ts-sim-wintest-ba : sumo output teleport ( Last six runs Apr2024 )

different outputs from detectors which should detect the same
(This bug was triggered by text found in file 'output' matching 'failed')
---------- Differences in output ----------
1,98c1,48
< success ['--step-length', '.1', '--end', '51'] ['2/1to1/1_0']
< success ['--step-length', '.1', '--end', '51'] ['2/1to1/1_0', '1/1to0/1_0']
< success ['--step-length', '.1', '--end', '51'] ['2/1to1/1_0']
< success ['--step-length', '.1', '--end', '51'] ['2/1to1/1_0', '1/1to0/1_0']
< success ['--step-length', '.1', '--end', '51'] ['2/1to1/1_0']
< success ['--step-length', '.1', '--end', '51'] ['2/1to1/1_0', '1/1to0/1_0']
< success ['--step-length', '.1', '--end', '51'] ['2/1to1/1_0']
< success ['--step-length', '.1', '--end', '51'] ['2/1to1/1_0', '1/1to0/1_0']
< success ['--step-length', '.1', '--end', '100'] ['2/1to1/1_0']
< success ['--step-length', '.1', '--end', '100'] ['2/1to1/1_0', '1/1to0/1_0']
< success ['--step-length', '.1', '--end', '100'] ['2/1to1/1_0']
< success ['--step-length', '.1', '--end', '100'] ['2/1to1/1_0', '1/1to0/1_0']
< success ['--step-length', '.1', '--end', '100'] ['2/1to1/1_0']
< success ['--step-length', '.1', '--end', '100'] ['2/1to1/1_0', '1/1to0/1_0']
< success ['--step-length', '.1', '--end', '100'] ['2/1to1/1_0']
< success ['--step-length', '.1', '--end', '100'] ['2/1to1/1_0', '1/1to0/1_0']
< failed ['--step-length', '.1', '--end', '1000'] 2/1to1/1_0 (108.6, 108.7) [9.9, 10.0, 9.9, 9.9]
< failed ['--step-length', '.1', '--end', '1000'] 2/1to1/1_0 (108.6, 108.7) [9.9, 10.0, 9.9, 9.9]
< failed ['--step-length', '.1', '--end', '1000'] 2/1to1/1_0 (108.0, 109.0) [9.87, 10.0, 9.87, 9.87]
< failed ['--step-length', '.1', '--end', '1000'] 2/1to1/1_0 (108.0, 109.0) [9.87, 10.0, 9.87, 9.87]
< failed ['--step-length', '.1', '--end', '1000'] 2/1to1/1_0 (100.0, 110.0) [9.85, 9.96, 9.85, 9.85]
< failed ['--step-length', '.1', '--end', '1000'] 2/1to1/1_0 (100.0, 110.0) [9.85, 9.96, 9.85, 9.85]
< failed ['--step-length', '.1', '--end', '1000'] 2/1to1/1_0 (100.0, 200.0) [-1.0, 2.26, 3.2, 2.27, 2.27]
< failed ['--step-length', '.1', '--end', '1000'] 2/1to1/1_0 (100.0, 200.0) [-1.0, 2.26, 3.2, 2.27, 2.27]
< success ['--step-length', '1', '--end', '51'] ['2/1to1/1_0']
< success ['--step-length', '1', '--end', '51'] ['2/1to1/1_0', '1/1to0/1_0']
< success ['--step-length', '1', '--end', '51'] ['2/1to1/1_0']
< success ['--step-length', '1', '--end', '51'] ['2/1to1/1_0', '1/1to0/1_0']
< success ['--step-length', '1', '--end', '51'] ['2/1to1/1_0']
<truncated after showing first 30 lines>

TEST had known bugs (see #254) on ts-sim-wintest-ba : sumo output teleport_multihop ( Last six runs Apr2024 )

different outputs from detectors which should detect the same
(This bug was triggered by text found in file 'output' matching 'failed')
---------- Differences in output ----------
17,24c17,24
< success 0.1 ['--step-length', '.1', '--end', '1000'] 2/1to1/1_0 (230.0, 230.1) [('e2', 9.99), ('e3', 10.0), ('edge', 9.99), ('lane', 9.99)]
< success 0.1 ['--step-length', '.1', '--end', '1000'] 1/1to0/1_0 (148.1, 148.2) [('e2', 9.99), ('e3', 10.0), ('edge', 9.99), ('lane', 9.99)]
< success 1 ['--step-length', '.1', '--end', '1000'] 2/1to1/1_0 (230.0, 231.0) [('e2', 9.99), ('e3', 10.0), ('edge', 9.99), ('lane', 9.99)]
< success 1 ['--step-length', '.1', '--end', '1000'] 1/1to0/1_0 (148.0, 149.0) [('e2', 9.91), ('e3', 10.0), ('edge', 9.91), ('lane', 9.91)]
< success 10 ['--step-length', '.1', '--end', '1000'] 2/1to1/1_0 (230.0, 240.0) [('e2', 9.42), ('e3', 9.9), ('edge', 9.42), ('lane', 9.42)]
< success 10 ['--step-length', '.1', '--end', '1000'] 1/1to0/1_0 (140.0, 150.0) [('e2', 9.96), ('e3', 9.99), ('edge', 9.96), ('lane', 9.96)]
< success 100 ['--step-length', '.1', '--end', '1000'] 2/1to1/1_0 (200.0, 300.0) [('e1', 10.0), ('e2', 9.22), ('e3', 5.71), ('edge', 9.22), ('lane', 9.22)]
< success 100 ['--step-length', '.1', '--end', '1000'] 1/1to0/1_0 (100.0, 200.0) [('e1', 9.53), ('e2', 5.82), ('e3', 6.93), ('edge', 5.82), ('lane', 5.82)]
---
> failed 0.1 ['--step-length', '.1', '--end', '1000'] 2/1to1/1_0 (148.9, 149.0) <zip object at 0x000002D18B2924C0>
> failed 0.1 ['--step-length', '.1', '--end', '1000'] 2/1to1/1_0 (148.9, 149.0) <zip object at 0x000002D18B6090C0>
> failed 1 ['--step-length', '.1', '--end', '1000'] 2/1to1/1_0 (149.0, 150.0) <zip object at 0x000002D18B0BD1C0>
> failed 1 ['--step-length', '.1', '--end', '1000'] 2/1to1/1_0 (149.0, 150.0) <zip object at 0x000002D18A6236C0>
> failed 10 ['--step-length', '.1', '--end', '1000'] 2/1to1/1_0 (140.0, 150.0) <zip object at 0x000002D18A61C500>
> failed 10 ['--step-length', '.1', '--end', '1000'] 2/1to1/1_0 (140.0, 150.0) <zip object at 0x000002D18A61C440>
> failed 100 ['--step-length', '.1', '--end', '1000'] 2/1to1/1_0 (100.0, 200.0) <zip object at 0x000002D18A61CA00>
> failed 100 ['--step-length', '.1', '--end', '1000'] 2/1to1/1_0 (100.0, 200.0) <zip object at 0x000002D18A61C280>
41,98c41,48
< success 0.1 ['--step-length', '1', '--end', '1000'] 2/1to1/1_0 (245.0, 246.0) [('e2', 8.92), ('e3', 10.0), ('edge', 8.92), ('lane', 8.92)]
< success 0.1 ['--step-length', '1', '--end', '1000'] 1/1to0/1_0 (150.0, 151.0) [('e2', 9.82), ('e3', 10.0), ('edge', 9.82), ('lane', 9.82)]
< success 1 ['--step-length', '1', '--end', '1000'] 2/1to1/1_0 (245.0, 246.0) [('e2', 8.92), ('e3', 10.0), ('edge', 8.92), ('lane', 8.92)]
< success 1 ['--step-length', '1', '--end', '1000'] 1/1to0/1_0 (150.0, 151.0) [('e2', 9.82), ('e3', 10.0), ('edge', 9.82), ('lane', 9.82)]
< success 10 ['--step-length', '1', '--end', '1000'] 2/1to1/1_0 (240.0, 250.0) [('e2', 9.9), ('e3', 10.0), ('edge', 9.9), ('lane', 9.9)]
< success 10 ['--step-length', '1', '--end', '1000'] 1/1to0/1_0 (150.0, 160.0) [('e2', 9.15), ('e3', 9.84), ('edge', 9.15), ('lane', 9.15)]
< success 100 ['--step-length', '1', '--end', '1000'] 2/1to1/1_0 (200.0, 300.0) [('e1', 10.0), ('e2', 9.41), ('e3', 5.84), ('edge', 9.41), ('lane', 9.41)]
< success 100 ['--step-length', '1', '--end', '1000'] 1/1to0/1_0 (100.0, 200.0) [('e1', 10.0), ('e2', 5.94), ('e3', 7.08), ('edge', 5.94), ('lane', 5.94)]
< -- Unordered text as found by filter '^Loading configuration ... done.' --
< Loading configuration ... done.
< Loading configuration ... done.
<truncated after showing first 30 lines>

TEST had known bugs (see #254) on ts-sim-wintest-ba : sumo output teleport_multihop_newDefaults ( Last six runs Apr2024 )

different outputs from detectors which should detect the same
(This bug was triggered by text found in file 'output' matching 'failed')
---------- Differences in output ----------
9,24c9,24
< failed 0.1 ['--step-length', '.1', '--end', '100'] 2/1to1/1_0 (76.2, 76.3) [('e2', 10.49), ('e3', 10.35), ('edge', 10.49), ('lane', 10.49)]
< failed 0.1 ['--step-length', '.1', '--end', '100'] 2/1to1/1_0 (76.2, 76.3) [('e2', 10.49), ('e3', 10.35), ('edge', 10.49), ('lane', 10.49)]
< failed 1 ['--step-length', '.1', '--end', '100'] 2/1to1/1_0 (76.0, 77.0) [('e2', 10.39), ('e3', 10.35), ('edge', 10.39), ('lane', 10.39)]
< failed 1 ['--step-length', '.1', '--end', '100'] 2/1to1/1_0 (76.0, 77.0) [('e2', 10.39), ('e3', 10.35), ('edge', 10.39), ('lane', 10.39)]
< failed 10 ['--step-length', '.1', '--end', '100'] 2/1to1/1_0 (70.0, 80.0) [('e2', 10.42), ('e3', 10.25), ('edge', 10.42), ('lane', 10.42)]
< failed 10 ['--step-length', '.1', '--end', '100'] 2/1to1/1_0 (70.0, 80.0) [('e2', 10.42), ('e3', 10.25), ('edge', 10.42), ('lane', 10.42)]
< failed 100 ['--step-length', '.1', '--end', '100'] 2/1to1/1_0 (0.0, 100.0) [('e1', 10.27), ('e2', 10.24), ('e3', 9.59), ('edge', 10.24), ('lane', 10.24)]
< failed 100 ['--step-length', '.1', '--end', '100'] 2/1to1/1_0 (0.0, 100.0) [('e1', 10.27), ('e2', 10.24), ('e3', 9.59), ('edge', 10.24), ('lane', 10.24)]
< failed 0.1 ['--step-length', '.1', '--end', '1000'] 2/1to1/1_0 (76.2, 76.3) [('e2', 10.49), ('e3', 10.35), ('edge', 10.49), ('lane', 10.49)]
< failed 0.1 ['--step-length', '.1', '--end', '1000'] 2/1to1/1_0 (76.2, 76.3) [('e2', 10.49), ('e3', 10.35), ('edge', 10.49), ('lane', 10.49)]
< failed 1 ['--step-length', '.1', '--end', '1000'] 2/1to1/1_0 (76.0, 77.0) [('e2', 10.39), ('e3', 10.35), ('edge', 10.39), ('lane', 10.39)]
< failed 1 ['--step-length', '.1', '--end', '1000'] 2/1to1/1_0 (76.0, 77.0) [('e2', 10.39), ('e3', 10.35), ('edge', 10.39), ('lane', 10.39)]
< failed 10 ['--step-length', '.1', '--end', '1000'] 2/1to1/1_0 (70.0, 80.0) [('e2', 10.42), ('e3', 10.25), ('edge', 10.42), ('lane', 10.42)]
< failed 10 ['--step-length', '.1', '--end', '1000'] 2/1to1/1_0 (70.0, 80.0) [('e2', 10.42), ('e3', 10.25), ('edge', 10.42), ('lane', 10.42)]
< failed 100 ['--step-length', '.1', '--end', '1000'] 2/1to1/1_0 (0.0, 100.0) [('e1', 10.27), ('e2', 10.24), ('e3', 9.59), ('edge', 10.24), ('lane', 10.24)]
< failed 100 ['--step-length', '.1', '--end', '1000'] 2/1to1/1_0 (0.0, 100.0) [('e1', 10.27), ('e2', 10.24), ('e3', 9.59), ('edge', 10.24), ('lane', 10.24)]
---
> failed 0.1 ['--step-length', '.1', '--end', '100'] 2/1to1/1_0 (70.9, 71.0) <zip object at 0x000001CCD1230380>
> failed 0.1 ['--step-length', '.1', '--end', '100'] 2/1to1/1_0 (70.9, 71.0) <zip object at 0x000001CCD12803C0>
> failed 1 ['--step-length', '.1', '--end', '100'] 2/1to1/1_0 (70.0, 71.0) <zip object at 0x000001CCD11F6C00>
> failed 1 ['--step-length', '.1', '--end', '100'] 2/1to1/1_0 (70.0, 71.0) <zip object at 0x000001CCD11F6FC0>
> failed 10 ['--step-length', '.1', '--end', '100'] 2/1to1/1_0 (70.0, 80.0) <zip object at 0x000001CCD11F6100>
> failed 10 ['--step-length', '.1', '--end', '100'] 2/1to1/1_0 (70.0, 80.0) <zip object at 0x000001CCD11F64C0>
> failed 100 ['--step-length', '.1', '--end', '100'] 2/1to1/1_0 (0.0, 100.0) <zip object at 0x000001CCD11F6B00>
> failed 100 ['--step-length', '.1', '--end', '100'] 2/1to1/1_0 (0.0, 100.0) <zip object at 0x000001CCD11F6480>
> failed 0.1 ['--step-length', '.1', '--end', '1000'] 2/1to1/1_0 (70.9, 71.0) <zip object at 0x000001CCD1EA30C0>
> failed 0.1 ['--step-length', '.1', '--end', '1000'] 2/1to1/1_0 (70.9, 71.0) <zip object at 0x000001CCD220CFC0>
> failed 1 ['--step-length', '.1', '--end', '1000'] 2/1to1/1_0 (70.0, 71.0) <zip object at 0x000001CCD1CCDC00>
> failed 1 ['--step-length', '.1', '--end', '1000'] 2/1to1/1_0 (70.0, 71.0) <zip object at 0x000001CCD12219C0>
<truncated after showing first 30 lines>

TEST had known bugs (see #254) on ts-sim-wintest-ba : sumo output two_same_vehicles ( Last six runs Apr2024 )

different outputs from detectors which should detect the same
(This bug was triggered by text found in file 'output' matching 'failed')
---------- Differences in output ----------
5,7c5,7
< success 0.1 ['--step-length', '.1', '--end', '100'] ['3/1to2/1_0']
< success 1 ['--step-length', '.1', '--end', '100'] ['3/1to2/1_0']
< success 10 ['--step-length', '.1', '--end', '100'] ['3/1to2/1_0']
---
> failed 0.1 ['--step-length', '.1', '--end', '100'] 3/1to2/1_0 (75.4, 75.5) <zip object at 0x0000023756B08F80>
> failed 1 ['--step-length', '.1', '--end', '100'] 3/1to2/1_0 (76.0, 77.0) <zip object at 0x0000023756AAD640>
> failed 10 ['--step-length', '.1', '--end', '100'] 3/1to2/1_0 (80.0, 90.0) <zip object at 0x0000023756AAD880>
9,12c9,12
< success 0.1 ['--step-length', '.1', '--end', '1000'] ['3/1to2/1_0']
< success 1 ['--step-length', '.1', '--end', '1000'] ['3/1to2/1_0']
< success 10 ['--step-length', '.1', '--end', '1000'] ['3/1to2/1_0']
< success 100 ['--step-length', '.1', '--end', '1000'] ['3/1to2/1_0']
---
> failed 0.1 ['--step-length', '.1', '--end', '1000'] 3/1to2/1_0 (75.4, 75.5) <zip object at 0x00000237575CD1C0>
> failed 1 ['--step-length', '.1', '--end', '1000'] 3/1to2/1_0 (76.0, 77.0) <zip object at 0x0000023756B11DC0>
> failed 10 ['--step-length', '.1', '--end', '1000'] 3/1to2/1_0 (80.0, 90.0) <zip object at 0x0000023756B11E40>
> failed 100 ['--step-length', '.1', '--end', '1000'] 3/1to2/1_0 (100.0, 200.0) <zip object at 0x0000023756B00900>
17,19c17,19
< success 0.1 ['--step-length', '1', '--end', '100'] ['3/1to2/1_0']
< success 1 ['--step-length', '1', '--end', '100'] ['3/1to2/1_0']
< success 10 ['--step-length', '1', '--end', '100'] ['3/1to2/1_0']
---
> failed 0.1 ['--step-length', '1', '--end', '100'] 3/1to2/1_0 (77.0, 78.0) <zip object at 0x0000023756B03280>
> failed 1 ['--step-length', '1', '--end', '100'] 3/1to2/1_0 (77.0, 78.0) <zip object at 0x0000023756B11EC0>
> failed 10 ['--step-length', '1', '--end', '100'] 3/1to2/1_0 (80.0, 90.0) <zip object at 0x0000023756B03040>
21,50c21,24
< success 0.1 ['--step-length', '1', '--end', '1000'] ['3/1to2/1_0']
< success 1 ['--step-length', '1', '--end', '1000'] ['3/1to2/1_0']
< success 10 ['--step-length', '1', '--end', '1000'] ['3/1to2/1_0']
<truncated after showing first 30 lines>

TEST had known bugs (see #254) on ts-sim-wintest-ba : sumo output two_vehicles_diff_length ( Last six runs Apr2024 )

different outputs from detectors which should detect the same
(This bug was triggered by text found in file 'output' matching 'failed')
---------- Differences in output ----------
5,7c5,7
< success 0.1 ['--step-length', '.1', '--end', '100'] ['3/1to2/1_0']
< success 1 ['--step-length', '.1', '--end', '100'] ['3/1to2/1_0']
< success 10 ['--step-length', '.1', '--end', '100'] ['3/1to2/1_0']
---
> failed 0.1 ['--step-length', '.1', '--end', '100'] 3/1to2/1_0 (76.4, 76.5) <zip object at 0x000001D9604813C0>
> failed 1 ['--step-length', '.1', '--end', '100'] 3/1to2/1_0 (77.0, 78.0) <zip object at 0x000001D96042CEC0>
> failed 10 ['--step-length', '.1', '--end', '100'] 3/1to2/1_0 (80.0, 90.0) <zip object at 0x000001D96042C5C0>
9,12c9,12
< success 0.1 ['--step-length', '.1', '--end', '1000'] ['3/1to2/1_0']
< success 1 ['--step-length', '.1', '--end', '1000'] ['3/1to2/1_0']
< success 10 ['--step-length', '.1', '--end', '1000'] ['3/1to2/1_0']
< success 100 ['--step-length', '.1', '--end', '1000'] ['3/1to2/1_0']
---
> failed 0.1 ['--step-length', '.1', '--end', '1000'] 3/1to2/1_0 (76.4, 76.5) <zip object at 0x000001D960F4DFC0>
> failed 1 ['--step-length', '.1', '--end', '1000'] 3/1to2/1_0 (77.0, 78.0) <zip object at 0x000001D960483D00>
> failed 10 ['--step-length', '.1', '--end', '1000'] 3/1to2/1_0 (80.0, 90.0) <zip object at 0x000001D96042F140>
> failed 100 ['--step-length', '.1', '--end', '1000'] 3/1to2/1_0 (100.0, 200.0) <zip object at 0x000001D960483580>
17,19c17,19
< success 0.1 ['--step-length', '1', '--end', '100'] ['3/1to2/1_0']
< success 1 ['--step-length', '1', '--end', '100'] ['3/1to2/1_0']
< success 10 ['--step-length', '1', '--end', '100'] ['3/1to2/1_0']
---
> failed 0.1 ['--step-length', '1', '--end', '100'] 3/1to2/1_0 (78.0, 79.0) <zip object at 0x000001D96048BA40>
> failed 1 ['--step-length', '1', '--end', '100'] 3/1to2/1_0 (78.0, 79.0) <zip object at 0x000001D96048B880>
> failed 10 ['--step-length', '1', '--end', '100'] 3/1to2/1_0 (80.0, 90.0) <zip object at 0x000001D960443640>
21,50c21,24
< success 0.1 ['--step-length', '1', '--end', '1000'] ['3/1to2/1_0']
< success 1 ['--step-length', '1', '--end', '1000'] ['3/1to2/1_0']
< success 10 ['--step-length', '1', '--end', '1000'] ['3/1to2/1_0']
<truncated after showing first 30 lines>

TEST had known bugs (see #254) on ts-sim-wintest-ba : sumo output two_vehicles_diff_speed ( Last six runs Apr2024 )

different outputs from detectors which should detect the same
(This bug was triggered by text found in file 'output' matching 'failed')
---------- Differences in output ----------
0a1,24
> failed 0.1 ['--step-length', '.1', '--end', '51'] 3/1to2/1_0 (38.4, 38.5) <zip object at 0x0000019E256CA5C0>
> failed 1 ['--step-length', '.1', '--end', '51'] 3/1to2/1_0 (38.0, 39.0) <zip object at 0x0000019E256CD1C0>
> failed 10 ['--step-length', '.1', '--end', '51'] 3/1to2/1_0 (30.0, 40.0) <zip object at 0x0000019E256CF2C0>
> failed 100 ['--step-length', '.1', '--end', '51'] 3/1to2/1_0 (0.0, 51.0) <zip object at 0x0000019E256CF080>
> failed 0.1 ['--step-length', '.1', '--end', '100'] 3/1to2/1_0 (38.4, 38.5) <zip object at 0x0000019E257032C0>
> failed 1 ['--step-length', '.1', '--end', '100'] 3/1to2/1_0 (38.0, 39.0) <zip object at 0x0000019E256CF5C0>
> failed 10 ['--step-length', '.1', '--end', '100'] 3/1to2/1_0 (30.0, 40.0) <zip object at 0x0000019E256CF540>
> failed 100 ['--step-length', '.1', '--end', '100'] 3/1to2/1_0 (0.0, 100.0) <zip object at 0x0000019E256A24C0>
> failed 0.1 ['--step-length', '.1', '--end', '1000'] 3/1to2/1_0 (38.4, 38.5) <zip object at 0x0000019E261CD2C0>
> failed 1 ['--step-length', '.1', '--end', '1000'] 3/1to2/1_0 (38.0, 39.0) <zip object at 0x0000019E25700700>
> failed 10 ['--step-length', '.1', '--end', '1000'] 3/1to2/1_0 (30.0, 40.0) <zip object at 0x0000019E256BB7C0>
> failed 100 ['--step-length', '.1', '--end', '1000'] 3/1to2/1_0 (0.0, 100.0) <zip object at 0x0000019E25700B00>
> failed 0.1 ['--step-length', '1', '--end', '51'] 3/1to2/1_0 (39.0, 40.0) <zip object at 0x0000019E25703800>
> failed 1 ['--step-length', '1', '--end', '51'] 3/1to2/1_0 (39.0, 40.0) <zip object at 0x0000019E25700400>
> failed 10 ['--step-length', '1', '--end', '51'] 3/1to2/1_0 (30.0, 40.0) <zip object at 0x0000019E256D99C0>
> failed 100 ['--step-length', '1', '--end', '51'] 3/1to2/1_0 (0.0, 51.0) <zip object at 0x0000019E256D9200>
> failed 0.1 ['--step-length', '1', '--end', '100'] 3/1to2/1_0 (39.0, 40.0) <zip object at 0x0000019E256D99C0>
> failed 1 ['--step-length', '1', '--end', '100'] 3/1to2/1_0 (39.0, 40.0) <zip object at 0x0000019E256D94C0>
> failed 10 ['--step-length', '1', '--end', '100'] 3/1to2/1_0 (30.0, 40.0) <zip object at 0x0000019E256D9EC0>
> failed 100 ['--step-length', '1', '--end', '100'] 3/1to2/1_0 (0.0, 100.0) <zip object at 0x0000019E256D9D80>
> failed 0.1 ['--step-length', '1', '--end', '1000'] 3/1to2/1_0 (39.0, 40.0) <zip object at 0x0000019E256D9680>
> failed 1 ['--step-length', '1', '--end', '1000'] 3/1to2/1_0 (39.0, 40.0) <zip object at 0x0000019E25700C80>
> failed 10 ['--step-length', '1', '--end', '1000'] 3/1to2/1_0 (30.0, 40.0) <zip object at 0x0000019E256FA040>
> failed 100 ['--step-length', '1', '--end', '1000'] 3/1to2/1_0 (0.0, 100.0) <zip object at 0x0000019E256D4BC0>

TEST had known bugs (see #3263) on ts-sim-wintest-ba : traci vehicle moveToXY keepRoute2 ( Last six runs Apr2024 )

mapping failure
(This bug was triggered by text found in file 'output' matching 'failed')
---------- Differences in output ----------
0a1
> internal corner (inside, segment2) failed: x=198, x2=198.0,   y=1.9, y2=1.9,   lane=middle_0, lane2=middle_0, pos=102, pos2=98.0   posLat=2.0 posLat2=1.9

Detailed information for the tests that were terminated before completion:

TEST were terminated before completion (TIMEOUT) on ts-sim-wintest-ba : sumo parallel ( Last six runs Apr2024 )

Test exceeded wallclock time limit of 900.0 seconds

TEST were terminated before completion (TIMEOUT) on ts-sim-wintest-ba : traci gui gui ( Last six runs Apr2024 )

Test exceeded wallclock time limit of 900.0 seconds
---------- Differences in output ----------
1,33d0
< step 0
< step 1
< step 2
< hasGUI True
< views ('View #0',)
< examining View #0
< set zoom (80.0)
< get zoom 80.0
< set offset (400.0, 400.0)
< get offset (400.0, 400.0)
< set schema ('real world')
< get schema real world
< visible boundary ((-809.6875, -232.0), (1609.6875, 1032.0))
< has view View #0 True
< has view 'foo' False
< track vehicle 'horiz'
< get tracked vehicle horiz
< {0: ('View #0',)}
< step 3
< {0: ('View #0',)}
< step 4
< {0: ('View #0',)}
< step 5
< {0: ('View #0',)}
< veh selected: False
< edge selected: False
< veh selected: True
< edge selected: True
< screenshot dimensions (500, 500, 4)
<truncated after showing first 30 lines>

TEST were terminated before completion (TIMEOUT) on ts-sim-wintest-ba : traffic_lights loop_flow sotl_request ( Last six runs Apr2024 )

Test exceeded wallclock time limit of 900.0 seconds
---------- Differences in output ----------
1,32d0
< Computing for 0<->0
<  for tls-type sotl_request
< Computing for 0<->600
<  for tls-type sotl_request
< Computing for 0<->1200
<  for tls-type sotl_request
< Computing for 0<->1800
<  for tls-type sotl_request
< Computing for 600<->0
<  for tls-type sotl_request
< Computing for 600<->600
<  for tls-type sotl_request
< Computing for 600<->1200
<  for tls-type sotl_request
< Computing for 600<->1800
<  for tls-type sotl_request
< Computing for 1200<->0
<  for tls-type sotl_request
< Computing for 1200<->600
<  for tls-type sotl_request
< Computing for 1200<->1200
<  for tls-type sotl_request
< Computing for 1200<->1800
<  for tls-type sotl_request
< Computing for 1800<->0
<  for tls-type sotl_request
< Computing for 1800<->600
<  for tls-type sotl_request
< Computing for 1800<->1200
<truncated after showing first 30 lines>
---------- Differences in statistics ----------
2a3,4
> <!-- generated on 2024-04-06 03:11:25 by Eclipse SUMO sumo Version v1_19_0+1713-444e81c5c23
> <configuration xmlns:xsi="http://www.w3.org/2001/XMLSchema-instance" xsi:noNamespaceSchemaLocation="http://sumo.dlr.de/xsd/sumoConfiguration.xsd">
4,14c6,31
< <statistics xmlns:xsi="http://www.w3.org/2001/XMLSchema-instance" xsi:noNamespaceSchemaLocation="http://sumo.dlr.de/xsd/statistic_file.xsd">
<     <vehicles loaded="1458" inserted="1458" running="0" waiting="0"/>
<     <teleports total="0" jam="0" yield="0" wrongLane="0"/>
<     <safety collisions="0" emergencyStops="0" emergencyBraking="0"/>
<     <persons loaded="0" running="0" jammed="0"/>
<     <personTeleports total="0" abortWait="0" wrongDest="0"/>
<     <vehicleTripStatistics count="1458" routeLength="2041.90" speed="2.21" duration="1173.59" waitingTime="857.87" timeLoss="1026.39" departDelay="976.80" departDelayWaiting="-1.00" totalTravelTime="1711091.00" totalDepartDelay="1424181.00"/>
<     <pedestrianStatistics number="0" routeLength="0.00" duration="0.00" timeLoss="0.00"/>
<     <rideStatistics number="0"/>
<     <transportStatistics number="0"/>
< </statistics>
---
>     <input>
>         <net-file value="input_net.net.xml"/>
>         <route-files value="input_routes.rou.xml"/>
>         <additional-files value="input_additional.add.xml"/>
>     </input>
> 
>     <output>
>         <queue-output value="results/queue_sotl_request_1800_1800.xml"/>
>         <summary-output value="results/summary_sotl_request_1800_1800.xml"/>
>         <tripinfo-output value="results/tripinfos_sotl_request_1800_1800.xml"/>
>         <statistic-output value="statistics.xml"/>
>     </output>
> 
>     <processing>
<truncated after showing first 30 lines>
---------- Differences in tls_state ----------
6,1118c6,752
<     <tlsState time="66.00" id="0" programID="a" phase="1" state="yryr"/>
<     <tlsState time="70.00" id="0" programID="a" phase="2" state="rrrr"/>
<     <tlsState time="74.00" id="0" programID="a" phase="3" state="rGrG"/>
<     <tlsState time="79.00" id="0" programID="a" phase="4" state="ryry"/>
<     <tlsState time="83.00" id="0" programID="a" phase="5" state="rrrr"/>
<     <tlsState time="87.00" id="0" programID="a" phase="0" state="GrGr"/>
<     <tlsState time="92.00" id="0" programID="a" phase="1" state="yryr"/>
<     <tlsState time="96.00" id="0" programID="a" phase="2" state="rrrr"/>
<     <tlsState time="100.00" id="0" programID="a" phase="3" state="rGrG"/>
<     <tlsState time="105.00" id="0" programID="a" phase="4" state="ryry"/>
<     <tlsState time="109.00" id="0" programID="a" phase="5" state="rrrr"/>
<     <tlsState time="113.00" id="0" programID="a" phase="0" state="GrGr"/>
<     <tlsState time="118.00" id="0" programID="a" phase="1" state="yryr"/>
<     <tlsState time="122.00" id="0" programID="a" phase="2" state="rrrr"/>
<     <tlsState time="126.00" id="0" programID="a" phase="3" state="rGrG"/>
<     <tlsState time="131.00" id="0" programID="a" phase="4" state="ryry"/>
<     <tlsState time="135.00" id="0" programID="a" phase="5" state="rrrr"/>
<     <tlsState time="139.00" id="0" programID="a" phase="0" state="GrGr"/>
<     <tlsState time="144.00" id="0" programID="a" phase="1" state="yryr"/>
<     <tlsState time="148.00" id="0" programID="a" phase="2" state="rrrr"/>
<     <tlsState time="152.00" id="0" programID="a" phase="3" state="rGrG"/>
<     <tlsState time="157.00" id="0" programID="a" phase="4" state="ryry"/>
<     <tlsState time="161.00" id="0" programID="a" phase="5" state="rrrr"/>
<     <tlsState time="165.00" id="0" programID="a" phase="0" state="GrGr"/>
<     <tlsState time="170.00" id="0" programID="a" phase="1" state="yryr"/>
<     <tlsState time="174.00" id="0" programID="a" phase="2" state="rrrr"/>
<     <tlsState time="178.00" id="0" programID="a" phase="3" state="rGrG"/>
<     <tlsState time="183.00" id="0" programID="a" phase="4" state="ryry"/>
<     <tlsState time="187.00" id="0" programID="a" phase="5" state="rrrr"/>
<truncated after showing first 30 lines>