Test results for NETEDITCHECKOUTPUT

(generated by unknown at 24Apr10:35)

Last six runs

Mar2024 Apr2024

test_default.png
Test19Apr24rv1_19_0+1890-4a6c257cf1f20Apr24rv1_19_0+1903-a81fef4e9a221Apr24rv1_19_0+1903-a81fef4e9a222Apr24rv1_19_0+1903-a81fef4e9a223Apr24rv1_19_0+1904-fb2194862ad24Apr24rv1_19_0+1911-194efc3e7d5
Summary4735 tests: 4612 FAILED 98 known bugs 25 killed 4735 tests: 4612 FAILED 98 known bugs 25 killed 4735 tests: 4616 FAILED 98 known bugs 21 killed 4735 tests: 4614 FAILED 98 known bugs 23 killed 4735 tests: 4614 FAILED 98 known bugs 23 killed 4735 tests: 4611 FAILED 98 known bugs 26 killed
additionalelements access create default errors different ts-sim-build-baerrors different ts-sim-build-baerrors different ts-sim-build-baerrors different ts-sim-build-baerrors different ts-sim-build-baerrors different ts-sim-build-ba
additionalelements access create duplicated errors different ts-sim-build-baerrors different ts-sim-build-baerrors different ts-sim-build-baerrors different ts-sim-build-baerrors different ts-sim-build-baerrors different ts-sim-build-ba
additionalelements access create friendlypos errors different ts-sim-build-baerrors different ts-sim-build-baerrors different ts-sim-build-baerrors different ts-sim-build-baerrors different ts-sim-build-baerrors different ts-sim-build-ba
additionalelements access create length errors different ts-sim-build-baerrors different ts-sim-build-baerrors different ts-sim-build-baerrors different ts-sim-build-baerrors different ts-sim-build-baerrors different ts-sim-build-ba
additionalelements access create no_parent errors different ts-sim-build-baerrors different ts-sim-build-baerrors different ts-sim-build-baerrors different ts-sim-build-baerrors different ts-sim-build-baerrors different ts-sim-build-ba
additionalelements access delete errors different ts-sim-build-baerrors different ts-sim-build-baerrors different ts-sim-build-baerrors different ts-sim-build-baerrors different ts-sim-build-baerrors different ts-sim-build-ba
additionalelements access fix Test needed #3045 ts-sim-build-baTest needed #3045 ts-sim-build-baTest needed #3045 ts-sim-build-baTest needed #3045 ts-sim-build-baTest needed #3045 ts-sim-build-baTest needed #3045 ts-sim-build-ba
additionalelements access inspect friendlypos errors different ts-sim-build-baerrors different ts-sim-build-baerrors different ts-sim-build-baerrors different ts-sim-build-baerrors different ts-sim-build-baerrors different ts-sim-build-ba
additionalelements access inspect lane errors different ts-sim-build-baerrors different ts-sim-build-baerrors different ts-sim-build-baerrors different ts-sim-build-baerrors different ts-sim-build-baerrors different ts-sim-build-ba
additionalelements access inspect length errors different ts-sim-build-baerrors different ts-sim-build-baerrors different ts-sim-build-baerrors different ts-sim-build-baerrors different ts-sim-build-baerrors different ts-sim-build-ba
additionalelements access inspect pos errors different ts-sim-build-baerrors different ts-sim-build-baerrors different ts-sim-build-baerrors different ts-sim-build-baerrors different ts-sim-build-baerrors different ts-sim-build-ba
additionalelements access inspect_selection friendlypos errors different ts-sim-build-baerrors different ts-sim-build-baerrors different ts-sim-build-baerrors different ts-sim-build-baerrors different ts-sim-build-baerrors different ts-sim-build-ba
additionalelements access inspect_selection length errors different ts-sim-build-baerrors different ts-sim-build-baerrors different ts-sim-build-baerrors different ts-sim-build-baerrors different ts-sim-build-baerrors different ts-sim-build-ba
additionalelements access load friendlypos errors different ts-sim-build-baerrors different ts-sim-build-baerrors different ts-sim-build-baerrors different ts-sim-build-baerrors different ts-sim-build-baerrors different ts-sim-build-ba
additionalelements access load lane errors different ts-sim-build-baerrors different ts-sim-build-baerrors different ts-sim-build-baerrors different ts-sim-build-baerrors different ts-sim-build-baerrors different ts-sim-build-ba
additionalelements access load length errors different ts-sim-build-baerrors different ts-sim-build-baerrors different ts-sim-build-baerrors different ts-sim-build-baerrors different ts-sim-build-baerrors different ts-sim-build-ba
additionalelements access load pos errors different ts-sim-build-baerrors different ts-sim-build-baerrors different ts-sim-build-baerrors different ts-sim-build-baerrors different ts-sim-build-baerrors different ts-sim-build-ba
additionalelements access move errors different ts-sim-build-baerrors different ts-sim-build-baerrors different ts-sim-build-baerrors different ts-sim-build-baerrors different ts-sim-build-baerrors different ts-sim-build-ba
additionalelements access volatilerecomputing errors different ts-sim-build-baerrors different ts-sim-build-baerrors different ts-sim-build-baerrors different ts-sim-build-baerrors different ts-sim-build-baerrors different ts-sim-build-ba
additionalelements basic additional_invalid errors different ts-sim-build-baerrors different ts-sim-build-baerrors different ts-sim-build-baerrors different ts-sim-build-baerrors different ts-sim-build-baerrors different ts-sim-build-ba
additionalelements basic additional_refposinvalid errors different ts-sim-build-baerrors different ts-sim-build-baerrors different ts-sim-build-baerrors different ts-sim-build-baerrors different ts-sim-build-baerrors different ts-sim-build-ba
additionalelements basic additional_savedialog errors different ts-sim-build-baerrors different ts-sim-build-baerrors different ts-sim-build-baerrors different ts-sim-build-baerrors different ts-sim-build-baerrors different ts-sim-build-ba
additionalelements basic relative_positions errors different ts-sim-build-baerrors different ts-sim-build-baerrors different ts-sim-build-baerrors different ts-sim-build-baerrors different ts-sim-build-baerrors different ts-sim-build-ba
additionalelements busstop create color errors different ts-sim-build-baerrors different ts-sim-build-baerrors different ts-sim-build-baerrors different ts-sim-build-baerrors different ts-sim-build-baerrors different ts-sim-build-ba
additionalelements busstop create default errors different ts-sim-build-baerrors different ts-sim-build-baerrors different ts-sim-build-baerrors different ts-sim-build-baerrors different ts-sim-build-baerrors different ts-sim-build-ba
additionalelements busstop create friendlypos errors different ts-sim-build-baerrors different ts-sim-build-baerrors different ts-sim-build-baerrors different ts-sim-build-baerrors different ts-sim-build-baerrors different ts-sim-build-ba
additionalelements busstop create id errors different ts-sim-build-baerrors different ts-sim-build-baerrors different ts-sim-build-baerrors different ts-sim-build-baerrors different ts-sim-build-baerrors different ts-sim-build-ba
additionalelements busstop create lines errors different ts-sim-build-baerrors different ts-sim-build-baerrors different ts-sim-build-baerrors different ts-sim-build-baerrors different ts-sim-build-baerrors different ts-sim-build-ba
additionalelements busstop create name errors different ts-sim-build-baerrors different ts-sim-build-baerrors different ts-sim-build-baerrors different ts-sim-build-baerrors different ts-sim-build-baerrors different ts-sim-build-ba
additionalelements busstop create parkinglength errors different ts-sim-build-baerrors different ts-sim-build-baerrors different ts-sim-build-baerrors different ts-sim-build-baerrors different ts-sim-build-baerrors different ts-sim-build-ba
additionalelements busstop create personcapacity errors different ts-sim-build-baerrors different ts-sim-build-baerrors different ts-sim-build-baerrors different ts-sim-build-baerrors different ts-sim-build-baerrors different ts-sim-build-ba
additionalelements busstop create references errors different ts-sim-build-baerrors different ts-sim-build-baerrors different ts-sim-build-baerrors different ts-sim-build-baerrors different ts-sim-build-baerrors different ts-sim-build-ba
additionalelements busstop create references_length errors different ts-sim-build-baerrors different ts-sim-build-baerrors different ts-sim-build-baerrors different ts-sim-build-baerrors different ts-sim-build-baerrors different ts-sim-build-ba
additionalelements busstop delete errors different ts-sim-build-baerrors different ts-sim-build-baerrors different ts-sim-build-baerrors different ts-sim-build-baerrors different ts-sim-build-baerrors different ts-sim-build-ba
additionalelements busstop fix fix_positions errors different ts-sim-build-baerrors different ts-sim-build-baerrors different ts-sim-build-baerrors different ts-sim-build-baerrors different ts-sim-build-baerrors different ts-sim-build-ba
additionalelements busstop fix friendlypos errors different ts-sim-build-baerrors different ts-sim-build-baerrors different ts-sim-build-baerrors different ts-sim-build-baerrors different ts-sim-build-baerrors different ts-sim-build-ba
additionalelements busstop fix save_invalids errors different ts-sim-build-baerrors different ts-sim-build-baerrors different ts-sim-build-baerrors different ts-sim-build-baerrors different ts-sim-build-baerrors different ts-sim-build-ba
additionalelements busstop fix select_invalids errors different ts-sim-build-baerrors different ts-sim-build-baerrors different ts-sim-build-baerrors different ts-sim-build-baerrors different ts-sim-build-baerrors different ts-sim-build-ba
additionalelements busstop inspect color errors different ts-sim-build-baerrors different ts-sim-build-baerrors different ts-sim-build-baerrors different ts-sim-build-baerrors different ts-sim-build-baerrors different ts-sim-build-ba
additionalelements busstop inspect endpos errors different ts-sim-build-baerrors different ts-sim-build-baerrors different ts-sim-build-baerrors different ts-sim-build-baerrors different ts-sim-build-baerrors different ts-sim-build-ba
additionalelements busstop inspect friendlypos errors different ts-sim-build-baerrors different ts-sim-build-baerrors different ts-sim-build-baerrors different ts-sim-build-baerrors different ts-sim-build-baerrors different ts-sim-build-ba
additionalelements busstop inspect id errors different ts-sim-build-baerrors different ts-sim-build-baerrors different ts-sim-build-baerrors different ts-sim-build-baerrors different ts-sim-build-baerrors different ts-sim-build-ba
additionalelements busstop inspect lane errors different ts-sim-build-baerrors different ts-sim-build-baerrors different ts-sim-build-baerrors different ts-sim-build-baerrors different ts-sim-build-baerrors different ts-sim-build-ba
additionalelements busstop inspect lines errors different ts-sim-build-baerrors different ts-sim-build-baerrors different ts-sim-build-baerrors different ts-sim-build-baerrors different ts-sim-build-baerrors different ts-sim-build-ba
additionalelements busstop inspect name errors different ts-sim-build-baerrors different ts-sim-build-baerrors different ts-sim-build-baerrors different ts-sim-build-baerrors different ts-sim-build-baerrors different ts-sim-build-ba
additionalelements busstop inspect parameters errors different ts-sim-build-baerrors different ts-sim-build-baerrors different ts-sim-build-baerrors different ts-sim-build-baerrors different ts-sim-build-baerrors different ts-sim-build-ba
additionalelements busstop inspect parkinglength errors different ts-sim-build-baerrors different ts-sim-build-baerrors different ts-sim-build-baerrors different ts-sim-build-baerrors different ts-sim-build-baerrors different ts-sim-build-ba
additionalelements busstop inspect personcapacity errors different ts-sim-build-baerrors different ts-sim-build-baerrors different ts-sim-build-baerrors different ts-sim-build-baerrors different ts-sim-build-baerrors different ts-sim-build-ba
additionalelements busstop inspect startpos errors different ts-sim-build-baerrors different ts-sim-build-baerrors different ts-sim-build-baerrors different ts-sim-build-baerrors different ts-sim-build-baerrors different ts-sim-build-ba
additionalelements busstop inspect_selection color errors different ts-sim-build-baerrors different ts-sim-build-baerrors different ts-sim-build-baerrors different ts-sim-build-baerrors different ts-sim-build-baerrors different ts-sim-build-ba
additionalelements busstop inspect_selection friendlypos errors different ts-sim-build-baerrors different ts-sim-build-baerrors different ts-sim-build-baerrors different ts-sim-build-baerrors different ts-sim-build-baerrors different ts-sim-build-ba
additionalelements busstop inspect_selection lines errors different ts-sim-build-baerrors different ts-sim-build-baerrors different ts-sim-build-baerrors different ts-sim-build-baerrors different ts-sim-build-baerrors different ts-sim-build-ba
additionalelements busstop inspect_selection name errors different ts-sim-build-baerrors different ts-sim-build-baerrors different ts-sim-build-baerrors different ts-sim-build-baerrors different ts-sim-build-baerrors different ts-sim-build-ba
additionalelements busstop inspect_selection parameters errors different ts-sim-build-baerrors different ts-sim-build-baerrors different ts-sim-build-baerrors different ts-sim-build-baerrors different ts-sim-build-baerrors different ts-sim-build-ba
additionalelements busstop inspect_selection parkinglength errors different ts-sim-build-baerrors different ts-sim-build-baerrors different ts-sim-build-baerrors different ts-sim-build-baerrors different ts-sim-build-baerrors different ts-sim-build-ba
additionalelements busstop inspect_selection personcapacity errors different ts-sim-build-baerrors different ts-sim-build-baerrors different ts-sim-build-baerrors different ts-sim-build-baerrors different ts-sim-build-baerrors different ts-sim-build-ba
additionalelements busstop load color errors different ts-sim-build-baerrors different ts-sim-build-baerrors different ts-sim-build-baerrors different ts-sim-build-baerrors different ts-sim-build-baerrors different ts-sim-build-ba
additionalelements busstop load default errors different ts-sim-build-baerrors different ts-sim-build-baerrors different ts-sim-build-baerrors different ts-sim-build-baerrors different ts-sim-build-baerrors different ts-sim-build-ba
additionalelements busstop load endpos errors different ts-sim-build-baerrors different ts-sim-build-baerrors different ts-sim-build-baerrors different ts-sim-build-baerrors different ts-sim-build-baerrors different ts-sim-build-ba
additionalelements busstop load friendlypos errors different ts-sim-build-baerrors different ts-sim-build-baerrors different ts-sim-build-baerrors different ts-sim-build-baerrors different ts-sim-build-baerrors different ts-sim-build-ba
additionalelements busstop load id errors different ts-sim-build-baerrors different ts-sim-build-baerrors different ts-sim-build-baerrors different ts-sim-build-baerrors different ts-sim-build-baerrors different ts-sim-build-ba
additionalelements busstop load lane errors different ts-sim-build-baerrors different ts-sim-build-baerrors different ts-sim-build-baerrors different ts-sim-build-baerrors different ts-sim-build-baerrors different ts-sim-build-ba
additionalelements busstop load lines errors different ts-sim-build-baerrors different ts-sim-build-baerrors different ts-sim-build-baerrors different ts-sim-build-baerrors different ts-sim-build-baerrors different ts-sim-build-ba
additionalelements busstop load name errors different ts-sim-build-baerrors different ts-sim-build-baerrors different ts-sim-build-baerrors different ts-sim-build-baerrors different ts-sim-build-baerrors different ts-sim-build-ba
additionalelements busstop load parameters errors different ts-sim-build-baerrors different ts-sim-build-baerrors different ts-sim-build-baerrors different ts-sim-build-baerrors different ts-sim-build-baerrors different ts-sim-build-ba
additionalelements busstop load parkinglength errors different ts-sim-build-baerrors different ts-sim-build-baerrors different ts-sim-build-baerrors different ts-sim-build-baerrors different ts-sim-build-baerrors different ts-sim-build-ba
additionalelements busstop load personcapacity errors different ts-sim-build-baerrors different ts-sim-build-baerrors different ts-sim-build-baerrors different ts-sim-build-baerrors different ts-sim-build-baerrors different ts-sim-build-ba
additionalelements busstop load startpos errors different ts-sim-build-baerrors different ts-sim-build-baerrors different ts-sim-build-baerrors different ts-sim-build-baerrors different ts-sim-build-baerrors different ts-sim-build-ba
additionalelements busstop move errors different ts-sim-build-baerrors different ts-sim-build-baerrors different ts-sim-build-baerrors different ts-sim-build-baerrors different ts-sim-build-baerrors different ts-sim-build-ba
additionalelements busstop volatilerecomputing errors different ts-sim-build-baerrors different ts-sim-build-baerrors different ts-sim-build-baerrors different ts-sim-build-baerrors different ts-sim-build-baerrors different ts-sim-build-ba
additionalelements calibrator create default errors different ts-sim-build-baerrors different ts-sim-build-baerrors different ts-sim-build-baerrors different ts-sim-build-baerrors different ts-sim-build-baerrors different ts-sim-build-ba
additionalelements calibrator create default_nocenter errors different ts-sim-build-baerrors different ts-sim-build-baerrors different ts-sim-build-baerrors different ts-sim-build-baerrors different ts-sim-build-baerrors different ts-sim-build-ba
additionalelements calibrator create id errors different ts-sim-build-baerrors different ts-sim-build-baerrors different ts-sim-build-baerrors different ts-sim-build-baerrors different ts-sim-build-baerrors different ts-sim-build-ba
additionalelements calibrator create jamtreshold errors different ts-sim-build-baerrors different ts-sim-build-baerrors different ts-sim-build-baerrors different ts-sim-build-baerrors different ts-sim-build-baerrors different ts-sim-build-ba
additionalelements calibrator create name errors different ts-sim-build-baerrors different ts-sim-build-baerrors different ts-sim-build-baerrors different ts-sim-build-baerrors different ts-sim-build-baerrors different ts-sim-build-ba
additionalelements calibrator create output errors different ts-sim-build-baerrors different ts-sim-build-baerrors different ts-sim-build-baerrors different ts-sim-build-baerrors different ts-sim-build-baerrors different ts-sim-build-ba
additionalelements calibrator create period errors different ts-sim-build-baerrors different ts-sim-build-baerrors different ts-sim-build-baerrors different ts-sim-build-baerrors different ts-sim-build-baerrors different ts-sim-build-ba
additionalelements calibrator create pos errors different ts-sim-build-baerrors different ts-sim-build-baerrors different ts-sim-build-baerrors different ts-sim-build-baerrors different ts-sim-build-baerrors different ts-sim-build-ba
additionalelements calibrator create routeprobe errors different ts-sim-build-baerrors different ts-sim-build-baerrors different ts-sim-build-baerrors different ts-sim-build-baerrors different ts-sim-build-baerrors different ts-sim-build-ba
additionalelements calibrator create vtypes errors different ts-sim-build-baerrors different ts-sim-build-baerrors different ts-sim-build-baerrors different ts-sim-build-baerrors different ts-sim-build-baerrors different ts-sim-build-ba
additionalelements calibrator delete Test needed #3045 ts-sim-build-baTest needed #3045 ts-sim-build-baTest needed #3045 ts-sim-build-baTest needed #3045 ts-sim-build-baTest needed #3045 ts-sim-build-baTest needed #3045 ts-sim-build-ba
additionalelements calibrator inspect edge errors different ts-sim-build-baerrors different ts-sim-build-baerrors different ts-sim-build-baerrors different ts-sim-build-baerrors different ts-sim-build-baerrors different ts-sim-build-ba
additionalelements calibrator inspect id errors different ts-sim-build-baerrors different ts-sim-build-baerrors different ts-sim-build-baerrors different ts-sim-build-baerrors different ts-sim-build-baerrors different ts-sim-build-ba
additionalelements calibrator inspect jamtreshold errors different ts-sim-build-baerrors different ts-sim-build-baerrors different ts-sim-build-baerrors different ts-sim-build-baerrors different ts-sim-build-baerrors different ts-sim-build-ba
additionalelements calibrator inspect name errors different ts-sim-build-baerrors different ts-sim-build-baerrors different ts-sim-build-baerrors different ts-sim-build-baerrors different ts-sim-build-baerrors different ts-sim-build-ba
additionalelements calibrator inspect output errors different ts-sim-build-baerrors different ts-sim-build-baerrors different ts-sim-build-baerrors different ts-sim-build-baerrors different ts-sim-build-baerrors different ts-sim-build-ba
additionalelements calibrator inspect parameters errors different ts-sim-build-baerrors different ts-sim-build-baerrors different ts-sim-build-baerrors different ts-sim-build-baerrors different ts-sim-build-baerrors different ts-sim-build-ba
additionalelements calibrator inspect period errors different ts-sim-build-baerrors different ts-sim-build-baerrors different ts-sim-build-baerrors different ts-sim-build-baerrors different ts-sim-build-baerrors different ts-sim-build-ba
additionalelements calibrator inspect pos errors different ts-sim-build-baerrors different ts-sim-build-baerrors different ts-sim-build-baerrors different ts-sim-build-baerrors different ts-sim-build-baerrors different ts-sim-build-ba
additionalelements calibrator inspect routeprobe errors different ts-sim-build-baerrors different ts-sim-build-baerrors different ts-sim-build-baerrors different ts-sim-build-baerrors different ts-sim-build-baerrors different ts-sim-build-ba
additionalelements calibrator inspect vtypes errors different ts-sim-build-baerrors different ts-sim-build-baerrors different ts-sim-build-baerrors different ts-sim-build-baerrors different ts-sim-build-baerrors different ts-sim-build-ba
additionalelements calibrator inspect_selection jamtreshold errors different ts-sim-build-baerrors different ts-sim-build-baerrors different ts-sim-build-baerrors different ts-sim-build-baerrors different ts-sim-build-baerrors different ts-sim-build-ba
additionalelements calibrator inspect_selection name errors different ts-sim-build-baerrors different ts-sim-build-baerrors different ts-sim-build-baerrors different ts-sim-build-baerrors different ts-sim-build-baerrors different ts-sim-build-ba
additionalelements calibrator inspect_selection output errors different ts-sim-build-baerrors different ts-sim-build-baerrors different ts-sim-build-baerrors different ts-sim-build-baerrors different ts-sim-build-baerrors different ts-sim-build-ba
additionalelements calibrator inspect_selection parameters errors different ts-sim-build-baerrors different ts-sim-build-baerrors different ts-sim-build-baerrors different ts-sim-build-baerrors different ts-sim-build-baerrors different ts-sim-build-ba
additionalelements calibrator inspect_selection period errors different ts-sim-build-baerrors different ts-sim-build-baerrors different ts-sim-build-baerrors different ts-sim-build-baerrors different ts-sim-build-baerrors different ts-sim-build-ba
additionalelements calibrator inspect_selection pos errors different ts-sim-build-baerrors different ts-sim-build-baerrors different ts-sim-build-baerrors different ts-sim-build-baerrors different ts-sim-build-baerrors different ts-sim-build-ba
additionalelements calibrator inspect_selection routeprobe errors different ts-sim-build-baerrors different ts-sim-build-baerrors different ts-sim-build-baerrors different ts-sim-build-baerrors different ts-sim-build-baerrors different ts-sim-build-ba
additionalelements calibrator inspect_selection vtypes errors different ts-sim-build-baerrors different ts-sim-build-baerrors different ts-sim-build-baerrors different ts-sim-build-baerrors different ts-sim-build-baerrors different ts-sim-build-ba
additionalelements calibrator load default errors different ts-sim-build-baerrors different ts-sim-build-baerrors different ts-sim-build-baerrors different ts-sim-build-baerrors different ts-sim-build-baerrors different ts-sim-build-ba
additionalelements calibrator load edge errors different ts-sim-build-baerrors different ts-sim-build-baerrors different ts-sim-build-baerrors different ts-sim-build-baerrors different ts-sim-build-baerrors different ts-sim-build-ba
additionalelements calibrator load id errors different ts-sim-build-baerrors different ts-sim-build-baerrors different ts-sim-build-baerrors different ts-sim-build-baerrors different ts-sim-build-baerrors different ts-sim-build-ba
additionalelements calibrator load jamthreshold errors different ts-sim-build-baerrors different ts-sim-build-baerrors different ts-sim-build-baerrors different ts-sim-build-baerrors different ts-sim-build-baerrors different ts-sim-build-ba
additionalelements calibrator load name errors different ts-sim-build-baerrors different ts-sim-build-baerrors different ts-sim-build-baerrors different ts-sim-build-baerrors different ts-sim-build-baerrors different ts-sim-build-ba
additionalelements calibrator load output errors different ts-sim-build-baerrors different ts-sim-build-baerrors different ts-sim-build-baerrors different ts-sim-build-baerrors different ts-sim-build-baerrors different ts-sim-build-ba
additionalelements calibrator load parameters errors different ts-sim-build-baerrors different ts-sim-build-baerrors different ts-sim-build-baerrors different ts-sim-build-baerrors different ts-sim-build-baerrors different ts-sim-build-ba
additionalelements calibrator load period errors different ts-sim-build-baerrors different ts-sim-build-baerrors different ts-sim-build-baerrors different ts-sim-build-baerrors different ts-sim-build-baerrors different ts-sim-build-ba
additionalelements calibrator load pos errors different ts-sim-build-baerrors different ts-sim-build-baerrors different ts-sim-build-baerrors different ts-sim-build-baerrors different ts-sim-build-baerrors different ts-sim-build-ba
additionalelements calibrator load routeprobe errors different ts-sim-build-baerrors different ts-sim-build-baerrors different ts-sim-build-baerrors different ts-sim-build-baerrors different ts-sim-build-baerrors different ts-sim-build-ba
additionalelements calibrator load vtypes errors different ts-sim-build-baerrors different ts-sim-build-baerrors different ts-sim-build-baerrors different ts-sim-build-baerrors different ts-sim-build-baerrors different ts-sim-build-ba
additionalelements calibrator volatilerecomputing errors different ts-sim-build-baerrors different ts-sim-build-baerrors different ts-sim-build-baerrors different ts-sim-build-baerrors different ts-sim-build-baerrors different ts-sim-build-ba
additionalelements calibratorflow create Test needed #3045 ts-sim-build-baTest needed #3045 ts-sim-build-baTest needed #3045 ts-sim-build-baTest needed #3045 ts-sim-build-baTest needed #3045 ts-sim-build-baTest needed #3045 ts-sim-build-ba
additionalelements calibratorflow delete Test needed #3045 ts-sim-build-baTest needed #3045 ts-sim-build-baTest needed #3045 ts-sim-build-baTest needed #3045 ts-sim-build-baTest needed #3045 ts-sim-build-baTest needed #3045 ts-sim-build-ba
additionalelements calibratorflow inspect Test needed #3045 ts-sim-build-baTest needed #3045 ts-sim-build-baTest needed #3045 ts-sim-build-baTest needed #3045 ts-sim-build-baTest needed #3045 ts-sim-build-baTest needed #3045 ts-sim-build-ba
additionalelements calibratorflow inspect_selection Test needed #3045 ts-sim-build-baTest needed #3045 ts-sim-build-baTest needed #3045 ts-sim-build-baTest needed #3045 ts-sim-build-baTest needed #3045 ts-sim-build-baTest needed #3045 ts-sim-build-ba
additionalelements calibratorflow load arrivallane errors different ts-sim-build-baerrors different ts-sim-build-baerrors different ts-sim-build-baerrors different ts-sim-build-baerrors different ts-sim-build-baerrors different ts-sim-build-ba
additionalelements calibratorflow load arrivalpos errors different ts-sim-build-baerrors different ts-sim-build-baerrors different ts-sim-build-baerrors different ts-sim-build-baerrors different ts-sim-build-baerrors different ts-sim-build-ba
additionalelements calibratorflow load arrivalposlat errors different ts-sim-build-baerrors different ts-sim-build-baerrors different ts-sim-build-baerrors different ts-sim-build-baerrors different ts-sim-build-baerrors different ts-sim-build-ba
additionalelements calibratorflow load arrivalspeed errors different ts-sim-build-baerrors different ts-sim-build-baerrors different ts-sim-build-baerrors different ts-sim-build-baerrors different ts-sim-build-baerrors different ts-sim-build-ba
additionalelements calibratorflow load begin errors different ts-sim-build-baerrors different ts-sim-build-baerrors different ts-sim-build-baerrors different ts-sim-build-baerrors different ts-sim-build-baerrors different ts-sim-build-ba
additionalelements calibratorflow load color errors different ts-sim-build-baerrors different ts-sim-build-baerrors different ts-sim-build-baerrors different ts-sim-build-baerrors different ts-sim-build-baerrors different ts-sim-build-ba
additionalelements calibratorflow load containernumber errors different ts-sim-build-baerrors different ts-sim-build-baerrors different ts-sim-build-baerrors different ts-sim-build-baerrors different ts-sim-build-baerrors different ts-sim-build-ba
additionalelements calibratorflow load default errors different ts-sim-build-baerrors different ts-sim-build-baerrors different ts-sim-build-baerrors different ts-sim-build-baerrors different ts-sim-build-baerrors different ts-sim-build-ba
additionalelements calibratorflow load departlane errors different ts-sim-build-baerrors different ts-sim-build-baerrors different ts-sim-build-baerrors different ts-sim-build-baerrors different ts-sim-build-baerrors different ts-sim-build-ba
additionalelements calibratorflow load departpos errors different ts-sim-build-baerrors different ts-sim-build-baerrors different ts-sim-build-baerrors different ts-sim-build-baerrors different ts-sim-build-baerrors different ts-sim-build-ba
additionalelements calibratorflow load departposlat errors different ts-sim-build-baerrors different ts-sim-build-baerrors different ts-sim-build-baerrors different ts-sim-build-baerrors different ts-sim-build-baerrors different ts-sim-build-ba
additionalelements calibratorflow load departspeed errors different ts-sim-build-baerrors different ts-sim-build-baerrors different ts-sim-build-baerrors different ts-sim-build-baerrors different ts-sim-build-baerrors different ts-sim-build-ba
additionalelements calibratorflow load end errors different ts-sim-build-baerrors different ts-sim-build-baerrors different ts-sim-build-baerrors different ts-sim-build-baerrors different ts-sim-build-baerrors different ts-sim-build-ba
additionalelements calibratorflow load id errors different ts-sim-build-baerrors different ts-sim-build-baerrors different ts-sim-build-baerrors different ts-sim-build-baerrors different ts-sim-build-baerrors different ts-sim-build-ba
additionalelements calibratorflow load invalid errors different ts-sim-build-baerrors different ts-sim-build-baerrors different ts-sim-build-baerrors different ts-sim-build-baerrors different ts-sim-build-baerrors different ts-sim-build-ba
additionalelements calibratorflow load line errors different ts-sim-build-baerrors different ts-sim-build-baerrors different ts-sim-build-baerrors different ts-sim-build-baerrors different ts-sim-build-baerrors different ts-sim-build-ba
additionalelements calibratorflow load personnumber errors different ts-sim-build-baerrors different ts-sim-build-baerrors different ts-sim-build-baerrors different ts-sim-build-baerrors different ts-sim-build-baerrors different ts-sim-build-ba
additionalelements calibratorflow load reroute errors different ts-sim-build-baerrors different ts-sim-build-baerrors different ts-sim-build-baerrors different ts-sim-build-baerrors different ts-sim-build-baerrors different ts-sim-build-ba
additionalelements calibratorflow load route errors different ts-sim-build-baerrors different ts-sim-build-baerrors different ts-sim-build-baerrors different ts-sim-build-baerrors different ts-sim-build-baerrors different ts-sim-build-ba
additionalelements calibratorflow load speed errors different ts-sim-build-baerrors different ts-sim-build-baerrors different ts-sim-build-baerrors different ts-sim-build-baerrors different ts-sim-build-baerrors different ts-sim-build-ba
additionalelements calibratorflow load type errors different ts-sim-build-baerrors different ts-sim-build-baerrors different ts-sim-build-baerrors different ts-sim-build-baerrors different ts-sim-build-baerrors different ts-sim-build-ba
additionalelements calibratorflow load vehsperhour errors different ts-sim-build-baerrors different ts-sim-build-baerrors different ts-sim-build-baerrors different ts-sim-build-baerrors different ts-sim-build-baerrors different ts-sim-build-ba
additionalelements calibratorflow volatilerecomputing Test needed #3045 ts-sim-build-baTest needed #3045 ts-sim-build-baTest needed #3045 ts-sim-build-baTest needed #3045 ts-sim-build-baTest needed #3045 ts-sim-build-baTest needed #3045 ts-sim-build-ba
additionalelements calibratorlane create default errors different ts-sim-build-baerrors different ts-sim-build-baerrors different ts-sim-build-baerrors different ts-sim-build-baerrors different ts-sim-build-baerrors different ts-sim-build-ba
additionalelements calibratorlane create default_nocenter errors different ts-sim-build-baerrors different ts-sim-build-baerrors different ts-sim-build-baerrors different ts-sim-build-baerrors different ts-sim-build-baerrors different ts-sim-build-ba
additionalelements calibratorlane create id errors different ts-sim-build-baerrors different ts-sim-build-baerrors different ts-sim-build-baerrors different ts-sim-build-baerrors different ts-sim-build-baerrors different ts-sim-build-ba
additionalelements calibratorlane create jamtreshold errors different ts-sim-build-baerrors different ts-sim-build-baerrors different ts-sim-build-baerrors different ts-sim-build-baerrors different ts-sim-build-baerrors different ts-sim-build-ba
additionalelements calibratorlane create name errors different ts-sim-build-baerrors different ts-sim-build-baerrors different ts-sim-build-baerrors different ts-sim-build-baerrors different ts-sim-build-baerrors different ts-sim-build-ba
additionalelements calibratorlane create output errors different ts-sim-build-baerrors different ts-sim-build-baerrors different ts-sim-build-baerrors different ts-sim-build-baerrors different ts-sim-build-baerrors different ts-sim-build-ba
additionalelements calibratorlane create period errors different ts-sim-build-baerrors different ts-sim-build-baerrors different ts-sim-build-baerrors different ts-sim-build-baerrors different ts-sim-build-baerrors different ts-sim-build-ba
additionalelements calibratorlane create pos errors different ts-sim-build-baerrors different ts-sim-build-baerrors different ts-sim-build-baerrors different ts-sim-build-baerrors different ts-sim-build-baerrors different ts-sim-build-ba
additionalelements calibratorlane create routeprobe errors different ts-sim-build-baerrors different ts-sim-build-baerrors different ts-sim-build-baerrors different ts-sim-build-baerrors different ts-sim-build-baerrors different ts-sim-build-ba
additionalelements calibratorlane create vtypes errors different ts-sim-build-baerrors different ts-sim-build-baerrors different ts-sim-build-baerrors different ts-sim-build-baerrors different ts-sim-build-baerrors different ts-sim-build-ba
additionalelements calibratorlane delete Test needed #3045 ts-sim-build-baTest needed #3045 ts-sim-build-baTest needed #3045 ts-sim-build-baTest needed #3045 ts-sim-build-baTest needed #3045 ts-sim-build-baTest needed #3045 ts-sim-build-ba
additionalelements calibratorlane inspect id errors different ts-sim-build-baerrors different ts-sim-build-baerrors different ts-sim-build-baerrors different ts-sim-build-baerrors different ts-sim-build-baerrors different ts-sim-build-ba
additionalelements calibratorlane inspect jamtreshold errors different ts-sim-build-baerrors different ts-sim-build-baerrors different ts-sim-build-baerrors different ts-sim-build-baerrors different ts-sim-build-baerrors different ts-sim-build-ba
additionalelements calibratorlane inspect lane errors different ts-sim-build-baerrors different ts-sim-build-baerrors different ts-sim-build-baerrors different ts-sim-build-baerrors different ts-sim-build-baerrors different ts-sim-build-ba
additionalelements calibratorlane inspect name errors different ts-sim-build-baerrors different ts-sim-build-baerrors different ts-sim-build-baerrors different ts-sim-build-baerrors different ts-sim-build-baerrors different ts-sim-build-ba
additionalelements calibratorlane inspect output errors different ts-sim-build-baerrors different ts-sim-build-baerrors different ts-sim-build-baerrors different ts-sim-build-baerrors different ts-sim-build-baerrors different ts-sim-build-ba
additionalelements calibratorlane inspect parameters errors different ts-sim-build-baerrors different ts-sim-build-baerrors different ts-sim-build-baerrors different ts-sim-build-baerrors different ts-sim-build-baerrors different ts-sim-build-ba
additionalelements calibratorlane inspect period errors different ts-sim-build-baerrors different ts-sim-build-baerrors different ts-sim-build-baerrors different ts-sim-build-baerrors different ts-sim-build-baerrors different ts-sim-build-ba
additionalelements calibratorlane inspect pos errors different ts-sim-build-baerrors different ts-sim-build-baerrors different ts-sim-build-baerrors different ts-sim-build-baerrors different ts-sim-build-baerrors different ts-sim-build-ba
additionalelements calibratorlane inspect routeprobe errors different ts-sim-build-baerrors different ts-sim-build-baerrors different ts-sim-build-baerrors different ts-sim-build-baerrors different ts-sim-build-baerrors different ts-sim-build-ba
additionalelements calibratorlane inspect vtypes errors different ts-sim-build-baerrors different ts-sim-build-baerrors different ts-sim-build-baerrors different ts-sim-build-baerrors different ts-sim-build-baerrors different ts-sim-build-ba
additionalelements calibratorlane inspect_selection jamtreshold errors different ts-sim-build-baerrors different ts-sim-build-baerrors different ts-sim-build-baerrors different ts-sim-build-baerrors different ts-sim-build-baerrors different ts-sim-build-ba
additionalelements calibratorlane inspect_selection name errors different ts-sim-build-baerrors different ts-sim-build-baerrors different ts-sim-build-baerrors different ts-sim-build-baerrors different ts-sim-build-baerrors different ts-sim-build-ba
additionalelements calibratorlane inspect_selection output errors different ts-sim-build-baerrors different ts-sim-build-baerrors different ts-sim-build-baerrors different ts-sim-build-baerrors different ts-sim-build-baerrors different ts-sim-build-ba
additionalelements calibratorlane inspect_selection parameters errors different ts-sim-build-baerrors different ts-sim-build-baerrors different ts-sim-build-baerrors different ts-sim-build-baerrors different ts-sim-build-baerrors different ts-sim-build-ba
additionalelements calibratorlane inspect_selection period errors different ts-sim-build-baerrors different ts-sim-build-baerrors different ts-sim-build-baerrors different ts-sim-build-baerrors different ts-sim-build-baerrors different ts-sim-build-ba
additionalelements calibratorlane inspect_selection pos errors different ts-sim-build-baerrors different ts-sim-build-baerrors different ts-sim-build-baerrors different ts-sim-build-baerrors different ts-sim-build-baerrors different ts-sim-build-ba
additionalelements calibratorlane inspect_selection routeprobe errors different ts-sim-build-baerrors different ts-sim-build-baerrors different ts-sim-build-baerrors different ts-sim-build-baerrors different ts-sim-build-baerrors different ts-sim-build-ba
additionalelements calibratorlane inspect_selection vtypes errors different ts-sim-build-baerrors different ts-sim-build-baerrors different ts-sim-build-baerrors different ts-sim-build-baerrors different ts-sim-build-baerrors different ts-sim-build-ba
additionalelements calibratorlane load default errors different ts-sim-build-baerrors different ts-sim-build-baerrors different ts-sim-build-baerrors different ts-sim-build-baerrors different ts-sim-build-baerrors different ts-sim-build-ba
additionalelements calibratorlane load id errors different ts-sim-build-baerrors different ts-sim-build-baerrors different ts-sim-build-baerrors different ts-sim-build-baerrors different ts-sim-build-baerrors different ts-sim-build-ba
additionalelements calibratorlane load jamthreshold errors different ts-sim-build-baerrors different ts-sim-build-baerrors different ts-sim-build-baerrors different ts-sim-build-baerrors different ts-sim-build-baerrors different ts-sim-build-ba
additionalelements calibratorlane load lane errors different ts-sim-build-baerrors different ts-sim-build-baerrors different ts-sim-build-baerrors different ts-sim-build-baerrors different ts-sim-build-baerrors different ts-sim-build-ba
additionalelements calibratorlane load name errors different ts-sim-build-baerrors different ts-sim-build-baerrors different ts-sim-build-baerrors different ts-sim-build-baerrors different ts-sim-build-baerrors different ts-sim-build-ba
additionalelements calibratorlane load output errors different ts-sim-build-baerrors different ts-sim-build-baerrors different ts-sim-build-baerrors different ts-sim-build-baerrors different ts-sim-build-baerrors different ts-sim-build-ba
additionalelements calibratorlane load parameters errors different ts-sim-build-baerrors different ts-sim-build-baerrors different ts-sim-build-baerrors different ts-sim-build-baerrors different ts-sim-build-baerrors different ts-sim-build-ba
additionalelements calibratorlane load period errors different ts-sim-build-baerrors different ts-sim-build-baerrors different ts-sim-build-baerrors different ts-sim-build-baerrors different ts-sim-build-baerrors different ts-sim-build-ba
additionalelements calibratorlane load pos errors different ts-sim-build-baerrors different ts-sim-build-baerrors different ts-sim-build-baerrors different ts-sim-build-baerrors different ts-sim-build-baerrors different ts-sim-build-ba
additionalelements calibratorlane load routeprobe errors different ts-sim-build-baerrors different ts-sim-build-baerrors different ts-sim-build-baerrors different ts-sim-build-baerrors different ts-sim-build-baerrors different ts-sim-build-ba
additionalelements calibratorlane load vtypes errors different ts-sim-build-baerrors different ts-sim-build-baerrors different ts-sim-build-baerrors different ts-sim-build-baerrors different ts-sim-build-baerrors different ts-sim-build-ba
additionalelements calibratorlane volatilerecomputing errors different ts-sim-build-baerrors different ts-sim-build-baerrors different ts-sim-build-baerrors different ts-sim-build-baerrors different ts-sim-build-baerrors different ts-sim-build-ba
additionalelements chargingstation create chargedelay errors different ts-sim-build-baerrors different ts-sim-build-baerrors different ts-sim-build-baerrors different ts-sim-build-baerrors different ts-sim-build-baerrors different ts-sim-build-ba
additionalelements chargingstation create chargeintransit errors different ts-sim-build-baerrors different ts-sim-build-baerrors different ts-sim-build-baerrors different ts-sim-build-baerrors different ts-sim-build-baerrors different ts-sim-build-ba
additionalelements chargingstation create default errors different ts-sim-build-baerrors different ts-sim-build-baerrors different ts-sim-build-baerrors different ts-sim-build-baerrors different ts-sim-build-baerrors different ts-sim-build-ba
additionalelements chargingstation create efficiency errors different ts-sim-build-baerrors different ts-sim-build-baerrors different ts-sim-build-baerrors different ts-sim-build-baerrors different ts-sim-build-baerrors different ts-sim-build-ba
additionalelements chargingstation create friendlypos errors different ts-sim-build-baerrors different ts-sim-build-baerrors different ts-sim-build-baerrors different ts-sim-build-baerrors different ts-sim-build-baerrors different ts-sim-build-ba
additionalelements chargingstation create id errors different ts-sim-build-baerrors different ts-sim-build-baerrors different ts-sim-build-baerrors different ts-sim-build-baerrors different ts-sim-build-baerrors different ts-sim-build-ba
additionalelements chargingstation create name errors different ts-sim-build-baerrors different ts-sim-build-baerrors different ts-sim-build-baerrors different ts-sim-build-baerrors different ts-sim-build-baerrors different ts-sim-build-ba
additionalelements chargingstation create power errors different ts-sim-build-baerrors different ts-sim-build-baerrors different ts-sim-build-baerrors different ts-sim-build-baerrors different ts-sim-build-baerrors different ts-sim-build-ba
additionalelements chargingstation create references errors different ts-sim-build-baerrors different ts-sim-build-baerrors different ts-sim-build-baerrors different ts-sim-build-baerrors different ts-sim-build-baerrors different ts-sim-build-ba
additionalelements chargingstation create references_length errors different ts-sim-build-baerrors different ts-sim-build-baerrors different ts-sim-build-baerrors different ts-sim-build-baerrors different ts-sim-build-baerrors different ts-sim-build-ba
additionalelements chargingstation delete errors different ts-sim-build-baerrors different ts-sim-build-baerrors different ts-sim-build-baerrors different ts-sim-build-baerrors different ts-sim-build-baerrors different ts-sim-build-ba
additionalelements chargingstation fix fix_positions errors different ts-sim-build-baerrors different ts-sim-build-baerrors different ts-sim-build-baerrors different ts-sim-build-baerrors different ts-sim-build-baerrors different ts-sim-build-ba
additionalelements chargingstation fix friendlypos errors different ts-sim-build-baerrors different ts-sim-build-baerrors different ts-sim-build-baerrors different ts-sim-build-baerrors different ts-sim-build-baerrors different ts-sim-build-ba
additionalelements chargingstation fix save_invalids errors different ts-sim-build-baerrors different ts-sim-build-baerrors different ts-sim-build-baerrors different ts-sim-build-baerrors different ts-sim-build-baerrors different ts-sim-build-ba
additionalelements chargingstation fix select_invalids errors different ts-sim-build-baerrors different ts-sim-build-baerrors different ts-sim-build-baerrors different ts-sim-build-baerrors different ts-sim-build-baerrors different ts-sim-build-ba
additionalelements chargingstation inspect chargedelay errors different ts-sim-build-baerrors different ts-sim-build-baerrors different ts-sim-build-baerrors different ts-sim-build-baerrors different ts-sim-build-baerrors different ts-sim-build-ba
additionalelements chargingstation inspect chargeintransit errors different ts-sim-build-baerrors different ts-sim-build-baerrors different ts-sim-build-baerrors different ts-sim-build-baerrors different ts-sim-build-baerrors different ts-sim-build-ba
additionalelements chargingstation inspect efficiency errors different ts-sim-build-baerrors different ts-sim-build-baerrors different ts-sim-build-baerrors different ts-sim-build-baerrors different ts-sim-build-baerrors different ts-sim-build-ba
additionalelements chargingstation inspect endpos errors different ts-sim-build-baerrors different ts-sim-build-baerrors different ts-sim-build-baerrors different ts-sim-build-baerrors different ts-sim-build-baerrors different ts-sim-build-ba
additionalelements chargingstation inspect friendlypos errors different ts-sim-build-baerrors different ts-sim-build-baerrors different ts-sim-build-baerrors different ts-sim-build-baerrors different ts-sim-build-baerrors different ts-sim-build-ba
additionalelements chargingstation inspect id errors different ts-sim-build-baerrors different ts-sim-build-baerrors different ts-sim-build-baerrors different ts-sim-build-baerrors different ts-sim-build-baerrors different ts-sim-build-ba
additionalelements chargingstation inspect lane errors different ts-sim-build-baerrors different ts-sim-build-baerrors different ts-sim-build-baerrors different ts-sim-build-baerrors different ts-sim-build-baerrors different ts-sim-build-ba
additionalelements chargingstation inspect name errors different ts-sim-build-baerrors different ts-sim-build-baerrors different ts-sim-build-baerrors different ts-sim-build-baerrors different ts-sim-build-baerrors different ts-sim-build-ba
additionalelements chargingstation inspect parameters errors different ts-sim-build-baerrors different ts-sim-build-baerrors different ts-sim-build-baerrors different ts-sim-build-baerrors different ts-sim-build-baerrors different ts-sim-build-ba
additionalelements chargingstation inspect power errors different ts-sim-build-baerrors different ts-sim-build-baerrors different ts-sim-build-baerrors different ts-sim-build-baerrors different ts-sim-build-baerrors different ts-sim-build-ba
additionalelements chargingstation inspect startpos errors different ts-sim-build-baerrors different ts-sim-build-baerrors different ts-sim-build-baerrors different ts-sim-build-baerrors different ts-sim-build-baerrors different ts-sim-build-ba
additionalelements chargingstation inspect_selection chargedelay errors different ts-sim-build-baerrors different ts-sim-build-baerrors different ts-sim-build-baerrors different ts-sim-build-baerrors different ts-sim-build-baerrors different ts-sim-build-ba
additionalelements chargingstation inspect_selection chargeintransit errors different ts-sim-build-baerrors different ts-sim-build-baerrors different ts-sim-build-baerrors different ts-sim-build-baerrors different ts-sim-build-baerrors different ts-sim-build-ba
additionalelements chargingstation inspect_selection efficiency errors different ts-sim-build-baerrors different ts-sim-build-baerrors different ts-sim-build-baerrors different ts-sim-build-baerrors different ts-sim-build-baerrors different ts-sim-build-ba
additionalelements chargingstation inspect_selection friendlypos errors different ts-sim-build-baerrors different ts-sim-build-baerrors different ts-sim-build-baerrors different ts-sim-build-baerrors different ts-sim-build-baerrors different ts-sim-build-ba
additionalelements chargingstation inspect_selection name errors different ts-sim-build-baerrors different ts-sim-build-baerrors different ts-sim-build-baerrors different ts-sim-build-baerrors different ts-sim-build-baerrors different ts-sim-build-ba
additionalelements chargingstation inspect_selection parameters errors different ts-sim-build-baerrors different ts-sim-build-baerrors different ts-sim-build-baerrors different ts-sim-build-baerrors different ts-sim-build-baerrors different ts-sim-build-ba
additionalelements chargingstation inspect_selection power errors different ts-sim-build-baerrors different ts-sim-build-baerrors different ts-sim-build-baerrors different ts-sim-build-baerrors different ts-sim-build-baerrors different ts-sim-build-ba
additionalelements chargingstation load chargedelay errors different ts-sim-build-baerrors different ts-sim-build-baerrors different ts-sim-build-baerrors different ts-sim-build-baerrors different ts-sim-build-baerrors different ts-sim-build-ba
additionalelements chargingstation load chargeintransit errors different ts-sim-build-baerrors different ts-sim-build-baerrors different ts-sim-build-baerrors different ts-sim-build-baerrors different ts-sim-build-baerrors different ts-sim-build-ba
additionalelements chargingstation load default errors different ts-sim-build-baerrors different ts-sim-build-baerrors different ts-sim-build-baerrors different ts-sim-build-baerrors different ts-sim-build-baerrors different ts-sim-build-ba
additionalelements chargingstation load efficiency errors different ts-sim-build-baerrors different ts-sim-build-baerrors different ts-sim-build-baerrors different ts-sim-build-baerrors different ts-sim-build-baerrors different ts-sim-build-ba
additionalelements chargingstation load endpos errors different ts-sim-build-baerrors different ts-sim-build-baerrors different ts-sim-build-baerrors different ts-sim-build-baerrors different ts-sim-build-baerrors different ts-sim-build-ba
additionalelements chargingstation load friendlypos errors different ts-sim-build-baerrors different ts-sim-build-baerrors different ts-sim-build-baerrors different ts-sim-build-baerrors different ts-sim-build-baerrors different ts-sim-build-ba
additionalelements chargingstation load id errors different ts-sim-build-baerrors different ts-sim-build-baerrors different ts-sim-build-baerrors different ts-sim-build-baerrors different ts-sim-build-baerrors different ts-sim-build-ba
additionalelements chargingstation load lane errors different ts-sim-build-baerrors different ts-sim-build-baerrors different ts-sim-build-baerrors different ts-sim-build-baerrors different ts-sim-build-baerrors different ts-sim-build-ba
additionalelements chargingstation load name errors different ts-sim-build-baerrors different ts-sim-build-baerrors different ts-sim-build-baerrors different ts-sim-build-baerrors different ts-sim-build-baerrors different ts-sim-build-ba
additionalelements chargingstation load parameters errors different ts-sim-build-baerrors different ts-sim-build-baerrors different ts-sim-build-baerrors different ts-sim-build-baerrors different ts-sim-build-baerrors different ts-sim-build-ba
additionalelements chargingstation load power errors different ts-sim-build-baerrors different ts-sim-build-baerrors different ts-sim-build-baerrors different ts-sim-build-baerrors different ts-sim-build-baerrors different ts-sim-build-ba
additionalelements chargingstation load startpos errors different ts-sim-build-baerrors different ts-sim-build-baerrors different ts-sim-build-baerrors different ts-sim-build-baerrors different ts-sim-build-baerrors different ts-sim-build-ba
additionalelements chargingstation move errors different ts-sim-build-baerrors different ts-sim-build-baerrors different ts-sim-build-baerrors different ts-sim-build-baerrors different ts-sim-build-baerrors different ts-sim-build-ba
additionalelements chargingstation volatilerecomputing errors different ts-sim-build-baerrors different ts-sim-build-baerrors different ts-sim-build-baerrors different ts-sim-build-baerrors different ts-sim-build-baerrors different ts-sim-build-ba
additionalelements containerstop create color errors different ts-sim-build-baerrors different ts-sim-build-baerrors different ts-sim-build-baerrors different ts-sim-build-baerrors different ts-sim-build-baerrors different ts-sim-build-ba
additionalelements containerstop create containercapacity errors different ts-sim-build-baerrors different ts-sim-build-baerrors different ts-sim-build-baerrors different ts-sim-build-baerrors different ts-sim-build-baerrors different ts-sim-build-ba
additionalelements containerstop create default errors different ts-sim-build-baerrors different ts-sim-build-baerrors different ts-sim-build-baerrors different ts-sim-build-baerrors different ts-sim-build-baerrors different ts-sim-build-ba
additionalelements containerstop create friendlypos errors different ts-sim-build-baerrors different ts-sim-build-baerrors different ts-sim-build-baerrors different ts-sim-build-baerrors different ts-sim-build-baerrors different ts-sim-build-ba
additionalelements containerstop create id errors different ts-sim-build-baerrors different ts-sim-build-baerrors different ts-sim-build-baerrors different ts-sim-build-baerrors different ts-sim-build-baerrors different ts-sim-build-ba
additionalelements containerstop create lines errors different ts-sim-build-baerrors different ts-sim-build-baerrors different ts-sim-build-baerrors different ts-sim-build-baerrors different ts-sim-build-baerrors different ts-sim-build-ba
additionalelements containerstop create name errors different ts-sim-build-baerrors different ts-sim-build-baerrors different ts-sim-build-baerrors different ts-sim-build-baerrors different ts-sim-build-baerrors different ts-sim-build-ba
additionalelements containerstop create parkinglength errors different ts-sim-build-baerrors different ts-sim-build-baerrors different ts-sim-build-baerrors different ts-sim-build-baerrors different ts-sim-build-baerrors different ts-sim-build-ba
additionalelements containerstop create references errors different ts-sim-build-baerrors different ts-sim-build-baerrors different ts-sim-build-baerrors different ts-sim-build-baerrors different ts-sim-build-baerrors different ts-sim-build-ba
additionalelements containerstop create references_length errors different ts-sim-build-baerrors different ts-sim-build-baerrors different ts-sim-build-baerrors different ts-sim-build-baerrors different ts-sim-build-baerrors different ts-sim-build-ba
additionalelements containerstop delete errors different ts-sim-build-baerrors different ts-sim-build-baerrors different ts-sim-build-baerrors different ts-sim-build-baerrors different ts-sim-build-baerrors different ts-sim-build-ba
additionalelements containerstop fix fix_positions errors different ts-sim-build-baerrors different ts-sim-build-baerrors different ts-sim-build-baerrors different ts-sim-build-baerrors different ts-sim-build-baerrors different ts-sim-build-ba
additionalelements containerstop fix friendlypos errors different ts-sim-build-baerrors different ts-sim-build-baerrors different ts-sim-build-baerrors different ts-sim-build-baerrors different ts-sim-build-baerrors different ts-sim-build-ba
additionalelements containerstop fix save_invalids errors different ts-sim-build-baerrors different ts-sim-build-baerrors different ts-sim-build-baerrors different ts-sim-build-baerrors different ts-sim-build-baerrors different ts-sim-build-ba
additionalelements containerstop fix select_invalids errors different ts-sim-build-baerrors different ts-sim-build-baerrors different ts-sim-build-baerrors different ts-sim-build-baerrors different ts-sim-build-baerrors different ts-sim-build-ba
additionalelements containerstop inspect color errors different ts-sim-build-baerrors different ts-sim-build-baerrors different ts-sim-build-baerrors different ts-sim-build-baerrors different ts-sim-build-baerrors different ts-sim-build-ba
additionalelements containerstop inspect containercapacity errors different ts-sim-build-baerrors different ts-sim-build-baerrors different ts-sim-build-baerrors different ts-sim-build-baerrors different ts-sim-build-baerrors different ts-sim-build-ba
additionalelements containerstop inspect endpos errors different ts-sim-build-baerrors different ts-sim-build-baerrors different ts-sim-build-baerrors different ts-sim-build-baerrors different ts-sim-build-baerrors different ts-sim-build-ba
additionalelements containerstop inspect friendlypos errors different ts-sim-build-baerrors different ts-sim-build-baerrors different ts-sim-build-baerrors different ts-sim-build-baerrors different ts-sim-build-baerrors different ts-sim-build-ba
additionalelements containerstop inspect id errors different ts-sim-build-baerrors different ts-sim-build-baerrors different ts-sim-build-baerrors different ts-sim-build-baerrors different ts-sim-build-baerrors different ts-sim-build-ba
additionalelements containerstop inspect lane errors different ts-sim-build-baerrors different ts-sim-build-baerrors different ts-sim-build-baerrors different ts-sim-build-baerrors different ts-sim-build-baerrors different ts-sim-build-ba
additionalelements containerstop inspect lines errors different ts-sim-build-baerrors different ts-sim-build-baerrors different ts-sim-build-baerrors different ts-sim-build-baerrors different ts-sim-build-baerrors different ts-sim-build-ba
additionalelements containerstop inspect name errors different ts-sim-build-baerrors different ts-sim-build-baerrors different ts-sim-build-baerrors different ts-sim-build-baerrors different ts-sim-build-baerrors different ts-sim-build-ba
additionalelements containerstop inspect parameters errors different ts-sim-build-baerrors different ts-sim-build-baerrors different ts-sim-build-baerrors different ts-sim-build-baerrors different ts-sim-build-baerrors different ts-sim-build-ba
additionalelements containerstop inspect parkinglength errors different ts-sim-build-baerrors different ts-sim-build-baerrors different ts-sim-build-baerrors different ts-sim-build-baerrors different ts-sim-build-baerrors different ts-sim-build-ba
additionalelements containerstop inspect startpos errors different ts-sim-build-baerrors different ts-sim-build-baerrors different ts-sim-build-baerrors different ts-sim-build-baerrors different ts-sim-build-baerrors different ts-sim-build-ba
additionalelements containerstop inspect_selection color errors different ts-sim-build-baerrors different ts-sim-build-baerrors different ts-sim-build-baerrors different ts-sim-build-baerrors different ts-sim-build-baerrors different ts-sim-build-ba
additionalelements containerstop inspect_selection containercapacity errors different ts-sim-build-baerrors different ts-sim-build-baerrors different ts-sim-build-baerrors different ts-sim-build-baerrors different ts-sim-build-baerrors different ts-sim-build-ba
additionalelements containerstop inspect_selection friendlypos errors different ts-sim-build-baerrors different ts-sim-build-baerrors different ts-sim-build-baerrors different ts-sim-build-baerrors different ts-sim-build-baerrors different ts-sim-build-ba
additionalelements containerstop inspect_selection lines errors different ts-sim-build-baerrors different ts-sim-build-baerrors different ts-sim-build-baerrors different ts-sim-build-baerrors different ts-sim-build-baerrors different ts-sim-build-ba
additionalelements containerstop inspect_selection name errors different ts-sim-build-baerrors different ts-sim-build-baerrors different ts-sim-build-baerrors different ts-sim-build-baerrors different ts-sim-build-baerrors different ts-sim-build-ba
additionalelements containerstop inspect_selection parameters errors different ts-sim-build-baerrors different ts-sim-build-baerrors different ts-sim-build-baerrors different ts-sim-build-baerrors different ts-sim-build-baerrors different ts-sim-build-ba
additionalelements containerstop inspect_selection parkinglength errors different ts-sim-build-baerrors different ts-sim-build-baerrors different ts-sim-build-baerrors different ts-sim-build-baerrors different ts-sim-build-baerrors different ts-sim-build-ba
additionalelements containerstop load color errors different ts-sim-build-baerrors different ts-sim-build-baerrors different ts-sim-build-baerrors different ts-sim-build-baerrors different ts-sim-build-baerrors different ts-sim-build-ba
additionalelements containerstop load containercapacity errors different ts-sim-build-baerrors different ts-sim-build-baerrors different ts-sim-build-baerrors different ts-sim-build-baerrors different ts-sim-build-baerrors different ts-sim-build-ba
additionalelements containerstop load default errors different ts-sim-build-baerrors different ts-sim-build-baerrors different ts-sim-build-baerrors different ts-sim-build-baerrors different ts-sim-build-baerrors different ts-sim-build-ba
additionalelements containerstop load endpos errors different ts-sim-build-baerrors different ts-sim-build-baerrors different ts-sim-build-baerrors different ts-sim-build-baerrors different ts-sim-build-baerrors different ts-sim-build-ba
additionalelements containerstop load friendlypos errors different ts-sim-build-baerrors different ts-sim-build-baerrors different ts-sim-build-baerrors different ts-sim-build-baerrors different ts-sim-build-baerrors different ts-sim-build-ba
additionalelements containerstop load id errors different ts-sim-build-baerrors different ts-sim-build-baerrors different ts-sim-build-baerrors different ts-sim-build-baerrors different ts-sim-build-baerrors different ts-sim-build-ba
additionalelements containerstop load lane errors different ts-sim-build-baerrors different ts-sim-build-baerrors different ts-sim-build-baerrors different ts-sim-build-baerrors different ts-sim-build-baerrors different ts-sim-build-ba
additionalelements containerstop load lines errors different ts-sim-build-baerrors different ts-sim-build-baerrors different ts-sim-build-baerrors different ts-sim-build-baerrors different ts-sim-build-baerrors different ts-sim-build-ba
additionalelements containerstop load name errors different ts-sim-build-baerrors different ts-sim-build-baerrors different ts-sim-build-baerrors different ts-sim-build-baerrors different ts-sim-build-baerrors different ts-sim-build-ba
additionalelements containerstop load parameters errors different ts-sim-build-baerrors different ts-sim-build-baerrors different ts-sim-build-baerrors different ts-sim-build-baerrors different ts-sim-build-baerrors different ts-sim-build-ba
additionalelements containerstop load parkinglength errors different ts-sim-build-baerrors different ts-sim-build-baerrors different ts-sim-build-baerrors different ts-sim-build-baerrors different ts-sim-build-baerrors different ts-sim-build-ba
additionalelements containerstop load startpos errors different ts-sim-build-baerrors different ts-sim-build-baerrors different ts-sim-build-baerrors different ts-sim-build-baerrors different ts-sim-build-baerrors different ts-sim-build-ba
additionalelements containerstop move errors different ts-sim-build-baerrors different ts-sim-build-baerrors different ts-sim-build-baerrors different ts-sim-build-baerrors different ts-sim-build-baerrors different ts-sim-build-ba
additionalelements containerstop volatilerecomputing errors different ts-sim-build-baerrors different ts-sim-build-baerrors different ts-sim-build-baerrors different ts-sim-build-baerrors different ts-sim-build-baerrors different ts-sim-build-ba
additionalelements detentry create default errors different ts-sim-build-baerrors different ts-sim-build-baerrors different ts-sim-build-baerrors different ts-sim-build-baerrors different ts-sim-build-baerrors different ts-sim-build-ba
additionalelements detentry create friendlypos errors different ts-sim-build-baerrors different ts-sim-build-baerrors different ts-sim-build-baerrors different ts-sim-build-baerrors different ts-sim-build-baerrors different ts-sim-build-ba
additionalelements detentry create no_parent errors different ts-sim-build-baerrors different ts-sim-build-baerrors different ts-sim-build-baerrors different ts-sim-build-baerrors different ts-sim-build-baerrors different ts-sim-build-ba
additionalelements detentry delete errors different ts-sim-build-baerrors different ts-sim-build-baerrors different ts-sim-build-baerrors different ts-sim-build-baerrors different ts-sim-build-baerrors different ts-sim-build-ba
additionalelements detentry inspect friendlypos errors different ts-sim-build-baerrors different ts-sim-build-baerrors different ts-sim-build-baerrors different ts-sim-build-baerrors different ts-sim-build-baerrors different ts-sim-build-ba
additionalelements detentry inspect lane errors different ts-sim-build-baerrors different ts-sim-build-baerrors different ts-sim-build-baerrors different ts-sim-build-baerrors different ts-sim-build-baerrors different ts-sim-build-ba
additionalelements detentry inspect parameters errors different ts-sim-build-baerrors different ts-sim-build-baerrors different ts-sim-build-baerrors different ts-sim-build-baerrors different ts-sim-build-baerrors different ts-sim-build-ba
additionalelements detentry inspect parent errors different ts-sim-build-baerrors different ts-sim-build-baerrors different ts-sim-build-baerrors different ts-sim-build-baerrors different ts-sim-build-baerrors different ts-sim-build-ba
additionalelements detentry inspect pos errors different ts-sim-build-baerrors different ts-sim-build-baerrors different ts-sim-build-baerrors different ts-sim-build-baerrors different ts-sim-build-baerrors different ts-sim-build-ba
additionalelements detentry inspect_selection friendlypos errors different ts-sim-build-baerrors different ts-sim-build-baerrors different ts-sim-build-baerrors different ts-sim-build-baerrors different ts-sim-build-baerrors different ts-sim-build-ba
additionalelements detentry inspect_selection parameters errors different ts-sim-build-baerrors different ts-sim-build-baerrors different ts-sim-build-baerrors different ts-sim-build-baerrors different ts-sim-build-baerrors different ts-sim-build-ba
additionalelements detentry inspect_selection parent errors different ts-sim-build-baerrors different ts-sim-build-baerrors different ts-sim-build-baerrors different ts-sim-build-baerrors different ts-sim-build-baerrors different ts-sim-build-ba
additionalelements detentry load default errors different ts-sim-build-baerrors different ts-sim-build-baerrors different ts-sim-build-baerrors different ts-sim-build-baerrors different ts-sim-build-baerrors different ts-sim-build-ba
additionalelements detentry load friendlypos errors different ts-sim-build-baerrors different ts-sim-build-baerrors different ts-sim-build-baerrors different ts-sim-build-baerrors different ts-sim-build-baerrors different ts-sim-build-ba
additionalelements detentry load lane errors different ts-sim-build-baerrors different ts-sim-build-baerrors different ts-sim-build-baerrors different ts-sim-build-baerrors different ts-sim-build-baerrors different ts-sim-build-ba
additionalelements detentry load no_parent errors different ts-sim-build-baerrors different ts-sim-build-baerrors different ts-sim-build-baerrors different ts-sim-build-baerrors different ts-sim-build-baerrors different ts-sim-build-ba
additionalelements detentry load parameters errors different ts-sim-build-baerrors different ts-sim-build-baerrors different ts-sim-build-baerrors different ts-sim-build-baerrors different ts-sim-build-baerrors different ts-sim-build-ba
additionalelements detentry load parent_invalid errors different ts-sim-build-baerrors different ts-sim-build-baerrors different ts-sim-build-baerrors different ts-sim-build-baerrors different ts-sim-build-baerrors different ts-sim-build-ba
additionalelements detentry load pos errors different ts-sim-build-baerrors different ts-sim-build-baerrors different ts-sim-build-baerrors different ts-sim-build-baerrors different ts-sim-build-baerrors different ts-sim-build-ba
additionalelements detentry move errors different ts-sim-build-baerrors different ts-sim-build-baerrors different ts-sim-build-baerrors different ts-sim-build-baerrors different ts-sim-build-baerrors different ts-sim-build-ba
additionalelements detentry volatilerecomputing errors different ts-sim-build-baerrors different ts-sim-build-baerrors different ts-sim-build-baerrors different ts-sim-build-baerrors different ts-sim-build-baerrors different ts-sim-build-ba
additionalelements detexit create default errors different ts-sim-build-baerrors different ts-sim-build-baerrors different ts-sim-build-baerrors different ts-sim-build-baerrors different ts-sim-build-baerrors different ts-sim-build-ba
additionalelements detexit create friendlypos errors different ts-sim-build-baerrors different ts-sim-build-baerrors different ts-sim-build-baerrors different ts-sim-build-baerrors different ts-sim-build-baerrors different ts-sim-build-ba
additionalelements detexit create no_parent errors different ts-sim-build-baerrors different ts-sim-build-baerrors different ts-sim-build-baerrors different ts-sim-build-baerrors different ts-sim-build-baerrors different ts-sim-build-ba
additionalelements detexit delete errors different ts-sim-build-baerrors different ts-sim-build-baerrors different ts-sim-build-baerrors different ts-sim-build-baerrors different ts-sim-build-baerrors different ts-sim-build-ba
additionalelements detexit inspect friendlypos errors different ts-sim-build-baerrors different ts-sim-build-baerrors different ts-sim-build-baerrors different ts-sim-build-baerrors different ts-sim-build-baerrors different ts-sim-build-ba
additionalelements detexit inspect lane errors different ts-sim-build-baerrors different ts-sim-build-baerrors different ts-sim-build-baerrors different ts-sim-build-baerrors different ts-sim-build-baerrors different ts-sim-build-ba
additionalelements detexit inspect parameters errors different ts-sim-build-baerrors different ts-sim-build-baerrors different ts-sim-build-baerrors different ts-sim-build-baerrors different ts-sim-build-baerrors different ts-sim-build-ba
additionalelements detexit inspect parent errors different ts-sim-build-baerrors different ts-sim-build-baerrors different ts-sim-build-baerrors different ts-sim-build-baerrors different ts-sim-build-baerrors different ts-sim-build-ba
additionalelements detexit inspect pos errors different ts-sim-build-baerrors different ts-sim-build-baerrors different ts-sim-build-baerrors different ts-sim-build-baerrors different ts-sim-build-baerrors different ts-sim-build-ba
additionalelements detexit inspect_selection friendlypos errors different ts-sim-build-baerrors different ts-sim-build-baerrors different ts-sim-build-baerrors different ts-sim-build-baerrors different ts-sim-build-baerrors different ts-sim-build-ba
additionalelements detexit inspect_selection parameters errors different ts-sim-build-baerrors different ts-sim-build-baerrors different ts-sim-build-baerrors different ts-sim-build-baerrors different ts-sim-build-baerrors different ts-sim-build-ba
additionalelements detexit inspect_selection parent errors different ts-sim-build-baerrors different ts-sim-build-baerrors different ts-sim-build-baerrors different ts-sim-build-baerrors different ts-sim-build-baerrors different ts-sim-build-ba
additionalelements detexit load default errors different ts-sim-build-baerrors different ts-sim-build-baerrors different ts-sim-build-baerrors different ts-sim-build-baerrors different ts-sim-build-baerrors different ts-sim-build-ba
additionalelements detexit load friendlypos errors different ts-sim-build-baerrors different ts-sim-build-baerrors different ts-sim-build-baerrors different ts-sim-build-baerrors different ts-sim-build-baerrors different ts-sim-build-ba
additionalelements detexit load lane errors different ts-sim-build-baerrors different ts-sim-build-baerrors different ts-sim-build-baerrors different ts-sim-build-baerrors different ts-sim-build-baerrors different ts-sim-build-ba
additionalelements detexit load no_parent errors different ts-sim-build-baerrors different ts-sim-build-baerrors different ts-sim-build-baerrors different ts-sim-build-baerrors different ts-sim-build-baerrors different ts-sim-build-ba
additionalelements detexit load parameters errors different ts-sim-build-baerrors different ts-sim-build-baerrors different ts-sim-build-baerrors different ts-sim-build-baerrors different ts-sim-build-baerrors different ts-sim-build-ba
additionalelements detexit load parent_invalid errors different ts-sim-build-baerrors different ts-sim-build-baerrors different ts-sim-build-baerrors different ts-sim-build-baerrors different ts-sim-build-baerrors different ts-sim-build-ba
additionalelements detexit load pos errors different ts-sim-build-baerrors different ts-sim-build-baerrors different ts-sim-build-baerrors different ts-sim-build-baerrors different ts-sim-build-baerrors different ts-sim-build-ba
additionalelements detexit move errors different ts-sim-build-baerrors different ts-sim-build-baerrors different ts-sim-build-baerrors different ts-sim-build-baerrors different ts-sim-build-baerrors different ts-sim-build-ba
additionalelements detexit volatilerecomputing errors different ts-sim-build-baerrors different ts-sim-build-baerrors different ts-sim-build-baerrors different ts-sim-build-baerrors different ts-sim-build-baerrors different ts-sim-build-ba
additionalelements e1detector create default errors different ts-sim-build-baerrors different ts-sim-build-baerrors different ts-sim-build-baerrors different ts-sim-build-baerrors different ts-sim-build-baerrors different ts-sim-build-ba
additionalelements e1detector create file errors different ts-sim-build-baerrors different ts-sim-build-baerrors different ts-sim-build-baerrors different ts-sim-build-baerrors different ts-sim-build-baerrors different ts-sim-build-ba
additionalelements e1detector create friendlypos errors different ts-sim-build-baerrors different ts-sim-build-baerrors different ts-sim-build-baerrors different ts-sim-build-baerrors different ts-sim-build-baerrors different ts-sim-build-ba
additionalelements e1detector create id errors different ts-sim-build-baerrors different ts-sim-build-baerrors different ts-sim-build-baerrors different ts-sim-build-baerrors different ts-sim-build-baerrors different ts-sim-build-ba
additionalelements e1detector create name errors different ts-sim-build-baerrors different ts-sim-build-baerrors different ts-sim-build-baerrors different ts-sim-build-baerrors different ts-sim-build-baerrors different ts-sim-build-ba
additionalelements e1detector create period errors different ts-sim-build-baerrors different ts-sim-build-baerrors different ts-sim-build-baerrors different ts-sim-build-baerrors different ts-sim-build-baerrors different ts-sim-build-ba
additionalelements e1detector create vtypes errors different ts-sim-build-baerrors different ts-sim-build-baerrors different ts-sim-build-baerrors different ts-sim-build-baerrors different ts-sim-build-baerrors different ts-sim-build-ba
additionalelements e1detector delete errors different ts-sim-build-baerrors different ts-sim-build-baerrors different ts-sim-build-baerrors different ts-sim-build-baerrors different ts-sim-build-baerrors different ts-sim-build-ba
additionalelements e1detector inspect file errors different ts-sim-build-baerrors different ts-sim-build-baerrors different ts-sim-build-baerrors different ts-sim-build-baerrors different ts-sim-build-baerrors different ts-sim-build-ba
additionalelements e1detector inspect friendlypos errors different ts-sim-build-baerrors different ts-sim-build-baerrors different ts-sim-build-baerrors different ts-sim-build-baerrors different ts-sim-build-baerrors different ts-sim-build-ba
additionalelements e1detector inspect id errors different ts-sim-build-baerrors different ts-sim-build-baerrors different ts-sim-build-baerrors different ts-sim-build-baerrors different ts-sim-build-baerrors different ts-sim-build-ba
additionalelements e1detector inspect lane errors different ts-sim-build-baerrors different ts-sim-build-baerrors different ts-sim-build-baerrors different ts-sim-build-baerrors different ts-sim-build-baerrors different ts-sim-build-ba
additionalelements e1detector inspect name errors different ts-sim-build-baerrors different ts-sim-build-baerrors different ts-sim-build-baerrors different ts-sim-build-baerrors different ts-sim-build-baerrors different ts-sim-build-ba
additionalelements e1detector inspect parameters errors different ts-sim-build-baerrors different ts-sim-build-baerrors different ts-sim-build-baerrors different ts-sim-build-baerrors different ts-sim-build-baerrors different ts-sim-build-ba
additionalelements e1detector inspect period errors different ts-sim-build-baerrors different ts-sim-build-baerrors different ts-sim-build-baerrors different ts-sim-build-baerrors different ts-sim-build-baerrors different ts-sim-build-ba
additionalelements e1detector inspect pos errors different ts-sim-build-baerrors different ts-sim-build-baerrors different ts-sim-build-baerrors different ts-sim-build-baerrors different ts-sim-build-baerrors different ts-sim-build-ba
additionalelements e1detector inspect vtypes errors different ts-sim-build-baerrors different ts-sim-build-baerrors different ts-sim-build-baerrors different ts-sim-build-baerrors different ts-sim-build-baerrors different ts-sim-build-ba
additionalelements e1detector inspect_selection file errors different ts-sim-build-baerrors different ts-sim-build-baerrors different ts-sim-build-baerrors different ts-sim-build-baerrors different ts-sim-build-baerrors different ts-sim-build-ba
additionalelements e1detector inspect_selection friendlypos errors different ts-sim-build-baerrors different ts-sim-build-baerrors different ts-sim-build-baerrors different ts-sim-build-baerrors different ts-sim-build-baerrors different ts-sim-build-ba
additionalelements e1detector inspect_selection name errors different ts-sim-build-baerrors different ts-sim-build-baerrors different ts-sim-build-baerrors different ts-sim-build-baerrors different ts-sim-build-baerrors different ts-sim-build-ba
additionalelements e1detector inspect_selection parameters errors different ts-sim-build-baerrors different ts-sim-build-baerrors different ts-sim-build-baerrors different ts-sim-build-baerrors different ts-sim-build-baerrors different ts-sim-build-ba
additionalelements e1detector inspect_selection period errors different ts-sim-build-baerrors different ts-sim-build-baerrors different ts-sim-build-baerrors different ts-sim-build-baerrors different ts-sim-build-baerrors different ts-sim-build-ba
additionalelements e1detector inspect_selection vtypes errors different ts-sim-build-baerrors different ts-sim-build-baerrors different ts-sim-build-baerrors different ts-sim-build-baerrors different ts-sim-build-baerrors different ts-sim-build-ba
additionalelements e1detector load file errors different ts-sim-build-baerrors different ts-sim-build-baerrors different ts-sim-build-baerrors different ts-sim-build-baerrors different ts-sim-build-baerrors different ts-sim-build-ba
additionalelements e1detector load id errors different ts-sim-build-baerrors different ts-sim-build-baerrors different ts-sim-build-baerrors different ts-sim-build-baerrors different ts-sim-build-baerrors different ts-sim-build-ba
additionalelements e1detector load lane errors different ts-sim-build-baerrors different ts-sim-build-baerrors different ts-sim-build-baerrors different ts-sim-build-baerrors different ts-sim-build-baerrors different ts-sim-build-ba
additionalelements e1detector load name errors different ts-sim-build-baerrors different ts-sim-build-baerrors different ts-sim-build-baerrors different ts-sim-build-baerrors different ts-sim-build-baerrors different ts-sim-build-ba
additionalelements e1detector load parameters errors different ts-sim-build-baerrors different ts-sim-build-baerrors different ts-sim-build-baerrors different ts-sim-build-baerrors different ts-sim-build-baerrors different ts-sim-build-ba
additionalelements e1detector load period errors different ts-sim-build-baerrors different ts-sim-build-baerrors different ts-sim-build-baerrors different ts-sim-build-baerrors different ts-sim-build-baerrors different ts-sim-build-ba
additionalelements e1detector load pos errors different ts-sim-build-baerrors different ts-sim-build-baerrors different ts-sim-build-baerrors different ts-sim-build-baerrors different ts-sim-build-baerrors different ts-sim-build-ba
additionalelements e1detector load vtypes errors different ts-sim-build-baerrors different ts-sim-build-baerrors different ts-sim-build-baerrors different ts-sim-build-baerrors different ts-sim-build-baerrors different ts-sim-build-ba
additionalelements e1detector move errors different ts-sim-build-baerrors different ts-sim-build-baerrors different ts-sim-build-baerrors different ts-sim-build-baerrors different ts-sim-build-baerrors different ts-sim-build-ba
additionalelements e1detector volatilerecomputing errors different ts-sim-build-baerrors different ts-sim-build-baerrors different ts-sim-build-baerrors different ts-sim-build-baerrors different ts-sim-build-baerrors different ts-sim-build-ba
additionalelements e1instantdetector create default errors different ts-sim-build-baerrors different ts-sim-build-baerrors different ts-sim-build-baerrors different ts-sim-build-baerrors different ts-sim-build-baerrors different ts-sim-build-ba
additionalelements e1instantdetector create file errors different ts-sim-build-baerrors different ts-sim-build-baerrors different ts-sim-build-baerrors different ts-sim-build-baerrors different ts-sim-build-baerrors different ts-sim-build-ba
additionalelements e1instantdetector create friendlypos errors different ts-sim-build-baerrors different ts-sim-build-baerrors different ts-sim-build-baerrors different ts-sim-build-baerrors different ts-sim-build-baerrors different ts-sim-build-ba
additionalelements e1instantdetector create id errors different ts-sim-build-baerrors different ts-sim-build-baerrors different ts-sim-build-baerrors different ts-sim-build-baerrors different ts-sim-build-baerrors different ts-sim-build-ba
additionalelements e1instantdetector create name errors different ts-sim-build-baerrors different ts-sim-build-baerrors different ts-sim-build-baerrors different ts-sim-build-baerrors different ts-sim-build-baerrors different ts-sim-build-ba
additionalelements e1instantdetector create vtypes errors different ts-sim-build-baerrors different ts-sim-build-baerrors different ts-sim-build-baerrors different ts-sim-build-baerrors different ts-sim-build-baerrors different ts-sim-build-ba
additionalelements e1instantdetector delete errors different ts-sim-build-baerrors different ts-sim-build-baerrors different ts-sim-build-baerrors different ts-sim-build-baerrors different ts-sim-build-baerrors different ts-sim-build-ba
additionalelements e1instantdetector inspect file errors different ts-sim-build-baerrors different ts-sim-build-baerrors different ts-sim-build-baerrors different ts-sim-build-baerrors different ts-sim-build-baerrors different ts-sim-build-ba
additionalelements e1instantdetector inspect friendlypos errors different ts-sim-build-baerrors different ts-sim-build-baerrors different ts-sim-build-baerrors different ts-sim-build-baerrors different ts-sim-build-baerrors different ts-sim-build-ba
additionalelements e1instantdetector inspect id errors different ts-sim-build-baerrors different ts-sim-build-baerrors different ts-sim-build-baerrors different ts-sim-build-baerrors different ts-sim-build-baerrors different ts-sim-build-ba
additionalelements e1instantdetector inspect lane errors different ts-sim-build-baerrors different ts-sim-build-baerrors different ts-sim-build-baerrors different ts-sim-build-baerrors different ts-sim-build-baerrors different ts-sim-build-ba
additionalelements e1instantdetector inspect name errors different ts-sim-build-baerrors different ts-sim-build-baerrors different ts-sim-build-baerrors different ts-sim-build-baerrors different ts-sim-build-baerrors different ts-sim-build-ba
additionalelements e1instantdetector inspect parameters errors different ts-sim-build-baerrors different ts-sim-build-baerrors different ts-sim-build-baerrors different ts-sim-build-baerrors different ts-sim-build-baerrors different ts-sim-build-ba
additionalelements e1instantdetector inspect pos errors different ts-sim-build-baerrors different ts-sim-build-baerrors different ts-sim-build-baerrors different ts-sim-build-baerrors different ts-sim-build-baerrors different ts-sim-build-ba
additionalelements e1instantdetector inspect vtypes errors different ts-sim-build-baerrors different ts-sim-build-baerrors different ts-sim-build-baerrors different ts-sim-build-baerrors different ts-sim-build-baerrors different ts-sim-build-ba
additionalelements e1instantdetector inspect_selection file errors different ts-sim-build-baerrors different ts-sim-build-baerrors different ts-sim-build-baerrors different ts-sim-build-baerrors different ts-sim-build-baerrors different ts-sim-build-ba
additionalelements e1instantdetector inspect_selection friendlypos errors different ts-sim-build-baerrors different ts-sim-build-baerrors different ts-sim-build-baerrors different ts-sim-build-baerrors different ts-sim-build-baerrors different ts-sim-build-ba
additionalelements e1instantdetector inspect_selection name errors different ts-sim-build-baerrors different ts-sim-build-baerrors different ts-sim-build-baerrors different ts-sim-build-baerrors different ts-sim-build-baerrors different ts-sim-build-ba
additionalelements e1instantdetector inspect_selection parameters errors different ts-sim-build-baerrors different ts-sim-build-baerrors different ts-sim-build-baerrors different ts-sim-build-baerrors different ts-sim-build-baerrors different ts-sim-build-ba
additionalelements e1instantdetector inspect_selection vtypes errors different ts-sim-build-baerrors different ts-sim-build-baerrors different ts-sim-build-baerrors different ts-sim-build-baerrors different ts-sim-build-baerrors different ts-sim-build-ba
additionalelements e1instantdetector load file errors different ts-sim-build-baerrors different ts-sim-build-baerrors different ts-sim-build-baerrors different ts-sim-build-baerrors different ts-sim-build-baerrors different ts-sim-build-ba
additionalelements e1instantdetector load id errors different ts-sim-build-baerrors different ts-sim-build-baerrors different ts-sim-build-baerrors different ts-sim-build-baerrors different ts-sim-build-baerrors different ts-sim-build-ba
additionalelements e1instantdetector load lane errors different ts-sim-build-baerrors different ts-sim-build-baerrors different ts-sim-build-baerrors different ts-sim-build-baerrors different ts-sim-build-baerrors different ts-sim-build-ba
additionalelements e1instantdetector load name errors different ts-sim-build-baerrors different ts-sim-build-baerrors different ts-sim-build-baerrors different ts-sim-build-baerrors different ts-sim-build-baerrors different ts-sim-build-ba
additionalelements e1instantdetector load parameters errors different ts-sim-build-baerrors different ts-sim-build-baerrors different ts-sim-build-baerrors different ts-sim-build-baerrors different ts-sim-build-baerrors different ts-sim-build-ba
additionalelements e1instantdetector load pos errors different ts-sim-build-baerrors different ts-sim-build-baerrors different ts-sim-build-baerrors different ts-sim-build-baerrors different ts-sim-build-baerrors different ts-sim-build-ba
additionalelements e1instantdetector load vtypes errors different ts-sim-build-baerrors different ts-sim-build-baerrors different ts-sim-build-baerrors different ts-sim-build-baerrors different ts-sim-build-baerrors different ts-sim-build-ba
additionalelements e1instantdetector move errors different ts-sim-build-baerrors different ts-sim-build-baerrors different ts-sim-build-baerrors different ts-sim-build-baerrors different ts-sim-build-baerrors different ts-sim-build-ba
additionalelements e1instantdetector volatilerecomputing errors different ts-sim-build-baerrors different ts-sim-build-baerrors different ts-sim-build-baerrors different ts-sim-build-baerrors different ts-sim-build-baerrors different ts-sim-build-ba
additionalelements e2detector create default errors different ts-sim-build-baerrors different ts-sim-build-baerrors different ts-sim-build-baerrors different ts-sim-build-baerrors different ts-sim-build-baerrors different ts-sim-build-ba
additionalelements e2detector create file errors different ts-sim-build-baerrors different ts-sim-build-baerrors different ts-sim-build-baerrors different ts-sim-build-baerrors different ts-sim-build-baerrors different ts-sim-build-ba
additionalelements e2detector create friendlypos errors different ts-sim-build-baerrors different ts-sim-build-baerrors different ts-sim-build-baerrors different ts-sim-build-baerrors different ts-sim-build-baerrors different ts-sim-build-ba
additionalelements e2detector create id errors different ts-sim-build-baerrors different ts-sim-build-baerrors different ts-sim-build-baerrors different ts-sim-build-baerrors different ts-sim-build-baerrors different ts-sim-build-ba
additionalelements e2detector create jamtreshold errors different ts-sim-build-baerrors different ts-sim-build-baerrors different ts-sim-build-baerrors different ts-sim-build-baerrors different ts-sim-build-baerrors different ts-sim-build-ba
additionalelements e2detector create length errors different ts-sim-build-baerrors different ts-sim-build-baerrors different ts-sim-build-baerrors different ts-sim-build-baerrors different ts-sim-build-baerrors different ts-sim-build-ba
additionalelements e2detector create name errors different ts-sim-build-baerrors different ts-sim-build-baerrors different ts-sim-build-baerrors different ts-sim-build-baerrors different ts-sim-build-baerrors different ts-sim-build-ba
additionalelements e2detector create period errors different ts-sim-build-baerrors different ts-sim-build-baerrors different ts-sim-build-baerrors different ts-sim-build-baerrors different ts-sim-build-baerrors different ts-sim-build-ba
additionalelements e2detector create speedtreshold errors different ts-sim-build-baerrors different ts-sim-build-baerrors different ts-sim-build-baerrors different ts-sim-build-baerrors different ts-sim-build-baerrors different ts-sim-build-ba
additionalelements e2detector create timetreshold errors different ts-sim-build-baerrors different ts-sim-build-baerrors different ts-sim-build-baerrors different ts-sim-build-baerrors different ts-sim-build-baerrors different ts-sim-build-ba
additionalelements e2detector create tl errors different ts-sim-build-baerrors different ts-sim-build-baerrors different ts-sim-build-baerrors different ts-sim-build-baerrors different ts-sim-build-baerrors different ts-sim-build-ba
additionalelements e2detector create vtypes errors different ts-sim-build-baerrors different ts-sim-build-baerrors different ts-sim-build-baerrors different ts-sim-build-baerrors different ts-sim-build-baerrors different ts-sim-build-ba
additionalelements e2detector delete errors different ts-sim-build-baerrors different ts-sim-build-baerrors different ts-sim-build-baerrors different ts-sim-build-baerrors different ts-sim-build-baerrors different ts-sim-build-ba
additionalelements e2detector inspect file errors different ts-sim-build-baerrors different ts-sim-build-baerrors different ts-sim-build-baerrors different ts-sim-build-baerrors different ts-sim-build-baerrors different ts-sim-build-ba
additionalelements e2detector inspect friendlypos errors different ts-sim-build-baerrors different ts-sim-build-baerrors different ts-sim-build-baerrors different ts-sim-build-baerrors different ts-sim-build-baerrors different ts-sim-build-ba
additionalelements e2detector inspect id errors different ts-sim-build-baerrors different ts-sim-build-baerrors different ts-sim-build-baerrors different ts-sim-build-baerrors different ts-sim-build-baerrors different ts-sim-build-ba
additionalelements e2detector inspect jamthreshold errors different ts-sim-build-baerrors different ts-sim-build-baerrors different ts-sim-build-baerrors different ts-sim-build-baerrors different ts-sim-build-baerrors different ts-sim-build-ba
additionalelements e2detector inspect lane errors different ts-sim-build-baerrors different ts-sim-build-baerrors different ts-sim-build-baerrors different ts-sim-build-baerrors different ts-sim-build-baerrors different ts-sim-build-ba
additionalelements e2detector inspect length errors different ts-sim-build-baerrors different ts-sim-build-baerrors different ts-sim-build-baerrors different ts-sim-build-baerrors different ts-sim-build-baerrors different ts-sim-build-ba
additionalelements e2detector inspect name errors different ts-sim-build-baerrors different ts-sim-build-baerrors different ts-sim-build-baerrors different ts-sim-build-baerrors different ts-sim-build-baerrors different ts-sim-build-ba
additionalelements e2detector inspect parameters errors different ts-sim-build-baerrors different ts-sim-build-baerrors different ts-sim-build-baerrors different ts-sim-build-baerrors different ts-sim-build-baerrors different ts-sim-build-ba
additionalelements e2detector inspect period errors different ts-sim-build-baerrors different ts-sim-build-baerrors different ts-sim-build-baerrors different ts-sim-build-baerrors different ts-sim-build-baerrors different ts-sim-build-ba
additionalelements e2detector inspect pos errors different ts-sim-build-baerrors different ts-sim-build-baerrors different ts-sim-build-baerrors different ts-sim-build-baerrors different ts-sim-build-baerrors different ts-sim-build-ba
additionalelements e2detector inspect speedthreshold errors different ts-sim-build-baerrors different ts-sim-build-baerrors different ts-sim-build-baerrors different ts-sim-build-baerrors different ts-sim-build-baerrors different ts-sim-build-ba
additionalelements e2detector inspect timethreshold errors different ts-sim-build-baerrors different ts-sim-build-baerrors different ts-sim-build-baerrors different ts-sim-build-baerrors different ts-sim-build-baerrors different ts-sim-build-ba
additionalelements e2detector inspect tl errors different ts-sim-build-baerrors different ts-sim-build-baerrors different ts-sim-build-baerrors different ts-sim-build-baerrors different ts-sim-build-baerrors different ts-sim-build-ba
additionalelements e2detector inspect vtypes errors different ts-sim-build-baerrors different ts-sim-build-baerrors different ts-sim-build-baerrors different ts-sim-build-baerrors different ts-sim-build-baerrors different ts-sim-build-ba
additionalelements e2detector inspect_selection file errors different ts-sim-build-baerrors different ts-sim-build-baerrors different ts-sim-build-baerrors different ts-sim-build-baerrors different ts-sim-build-baerrors different ts-sim-build-ba
additionalelements e2detector inspect_selection friendlypos errors different ts-sim-build-baerrors different ts-sim-build-baerrors different ts-sim-build-baerrors different ts-sim-build-baerrors different ts-sim-build-baerrors different ts-sim-build-ba
additionalelements e2detector inspect_selection jamthreshold errors different ts-sim-build-baerrors different ts-sim-build-baerrors different ts-sim-build-baerrors different ts-sim-build-baerrors different ts-sim-build-baerrors different ts-sim-build-ba
additionalelements e2detector inspect_selection length errors different ts-sim-build-baerrors different ts-sim-build-baerrors different ts-sim-build-baerrors different ts-sim-build-baerrors different ts-sim-build-baerrors different ts-sim-build-ba
additionalelements e2detector inspect_selection name errors different ts-sim-build-baerrors different ts-sim-build-baerrors different ts-sim-build-baerrors different ts-sim-build-baerrors different ts-sim-build-baerrors different ts-sim-build-ba
additionalelements e2detector inspect_selection parameters errors different ts-sim-build-baerrors different ts-sim-build-baerrors different ts-sim-build-baerrors different ts-sim-build-baerrors different ts-sim-build-baerrors different ts-sim-build-ba
additionalelements e2detector inspect_selection period errors different ts-sim-build-baerrors different ts-sim-build-baerrors different ts-sim-build-baerrors different ts-sim-build-baerrors different ts-sim-build-baerrors different ts-sim-build-ba
additionalelements e2detector inspect_selection speedthreshold errors different ts-sim-build-baerrors different ts-sim-build-baerrors different ts-sim-build-baerrors different ts-sim-build-baerrors different ts-sim-build-baerrors different ts-sim-build-ba
additionalelements e2detector inspect_selection timethreshold errors different ts-sim-build-baerrors different ts-sim-build-baerrors different ts-sim-build-baerrors different ts-sim-build-baerrors different ts-sim-build-baerrors different ts-sim-build-ba
additionalelements e2detector inspect_selection tl errors different ts-sim-build-baerrors different ts-sim-build-baerrors different ts-sim-build-baerrors different ts-sim-build-baerrors different ts-sim-build-baerrors different ts-sim-build-ba
additionalelements e2detector inspect_selection vtypes errors different ts-sim-build-baerrors different ts-sim-build-baerrors different ts-sim-build-baerrors different ts-sim-build-baerrors different ts-sim-build-baerrors different ts-sim-build-ba
additionalelements e2detector load file errors different ts-sim-build-baerrors different ts-sim-build-baerrors different ts-sim-build-baerrors different ts-sim-build-baerrors different ts-sim-build-baerrors different ts-sim-build-ba
additionalelements e2detector load friendlypos errors different ts-sim-build-baerrors different ts-sim-build-baerrors different ts-sim-build-baerrors different ts-sim-build-baerrors different ts-sim-build-baerrors different ts-sim-build-ba
additionalelements e2detector load id errors different ts-sim-build-baerrors different ts-sim-build-baerrors different ts-sim-build-baerrors different ts-sim-build-baerrors different ts-sim-build-baerrors different ts-sim-build-ba
additionalelements e2detector load jamthreshold errors different ts-sim-build-baerrors different ts-sim-build-baerrors different ts-sim-build-baerrors different ts-sim-build-baerrors different ts-sim-build-baerrors different ts-sim-build-ba
additionalelements e2detector load lane errors different ts-sim-build-baerrors different ts-sim-build-baerrors different ts-sim-build-baerrors different ts-sim-build-baerrors different ts-sim-build-baerrors different ts-sim-build-ba
additionalelements e2detector load length errors different ts-sim-build-baerrors different ts-sim-build-baerrors different ts-sim-build-baerrors different ts-sim-build-baerrors different ts-sim-build-baerrors different ts-sim-build-ba
additionalelements e2detector load parameters errors different ts-sim-build-baerrors different ts-sim-build-baerrors different ts-sim-build-baerrors different ts-sim-build-baerrors different ts-sim-build-baerrors different ts-sim-build-ba
additionalelements e2detector load period errors different ts-sim-build-baerrors different ts-sim-build-baerrors different ts-sim-build-baerrors different ts-sim-build-baerrors different ts-sim-build-baerrors different ts-sim-build-ba
additionalelements e2detector load pos errors different ts-sim-build-baerrors different ts-sim-build-baerrors different ts-sim-build-baerrors different ts-sim-build-baerrors different ts-sim-build-baerrors different ts-sim-build-ba
additionalelements e2detector load speedthreshold errors different ts-sim-build-baerrors different ts-sim-build-baerrors different ts-sim-build-baerrors different ts-sim-build-baerrors different ts-sim-build-baerrors different ts-sim-build-ba
additionalelements e2detector load timethreshold errors different ts-sim-build-baerrors different ts-sim-build-baerrors different ts-sim-build-baerrors different ts-sim-build-baerrors different ts-sim-build-baerrors different ts-sim-build-ba
additionalelements e2detector load tl errors different ts-sim-build-baerrors different ts-sim-build-baerrors different ts-sim-build-baerrors different ts-sim-build-baerrors different ts-sim-build-baerrors different ts-sim-build-ba
additionalelements e2detector load vtypes errors different ts-sim-build-baerrors different ts-sim-build-baerrors different ts-sim-build-baerrors different ts-sim-build-baerrors different ts-sim-build-baerrors different ts-sim-build-ba
additionalelements e2detector move errors different ts-sim-build-baerrors different ts-sim-build-baerrors different ts-sim-build-baerrors different ts-sim-build-baerrors different ts-sim-build-baerrors different ts-sim-build-ba
additionalelements e2detector volatilerecomputing errors different ts-sim-build-baerrors different ts-sim-build-baerrors different ts-sim-build-baerrors different ts-sim-build-baerrors different ts-sim-build-baerrors different ts-sim-build-ba
additionalelements e2multilanedetector create default errors different ts-sim-build-baerrors different ts-sim-build-baerrors different ts-sim-build-baerrors different ts-sim-build-baerrors different ts-sim-build-baerrors different ts-sim-build-ba
additionalelements e2multilanedetector create default_nonconsecutive errors different ts-sim-build-baerrors different ts-sim-build-baerrors different ts-sim-build-baerrors different ts-sim-build-baerrors different ts-sim-build-baerrors different ts-sim-build-ba
additionalelements e2multilanedetector create default_singlelane errors different ts-sim-build-baerrors different ts-sim-build-baerrors different ts-sim-build-baerrors different ts-sim-build-baerrors different ts-sim-build-baerrors different ts-sim-build-ba
additionalelements e2multilanedetector create file errors different ts-sim-build-baerrors different ts-sim-build-baerrors different ts-sim-build-baerrors different ts-sim-build-baerrors different ts-sim-build-baerrors different ts-sim-build-ba
additionalelements e2multilanedetector create friendlypos errors different ts-sim-build-baerrors different ts-sim-build-baerrors different ts-sim-build-baerrors different ts-sim-build-baerrors different ts-sim-build-baerrors different ts-sim-build-ba
additionalelements e2multilanedetector create id errors different ts-sim-build-baerrors different ts-sim-build-baerrors different ts-sim-build-baerrors different ts-sim-build-baerrors different ts-sim-build-baerrors different ts-sim-build-ba
additionalelements e2multilanedetector create jamthreshold errors different ts-sim-build-baerrors different ts-sim-build-baerrors different ts-sim-build-baerrors different ts-sim-build-baerrors different ts-sim-build-baerrors different ts-sim-build-ba
additionalelements e2multilanedetector create name errors different ts-sim-build-baerrors different ts-sim-build-baerrors different ts-sim-build-baerrors different ts-sim-build-baerrors different ts-sim-build-baerrors different ts-sim-build-ba
additionalelements e2multilanedetector create period errors different ts-sim-build-baerrors different ts-sim-build-baerrors different ts-sim-build-baerrors different ts-sim-build-baerrors different ts-sim-build-baerrors different ts-sim-build-ba
additionalelements e2multilanedetector create speedthreshold errors different ts-sim-build-baerrors different ts-sim-build-baerrors different ts-sim-build-baerrors different ts-sim-build-baerrors different ts-sim-build-baerrors different ts-sim-build-ba
additionalelements e2multilanedetector create timethreshold errors different ts-sim-build-baerrors different ts-sim-build-baerrors different ts-sim-build-baerrors different ts-sim-build-baerrors different ts-sim-build-baerrors different ts-sim-build-ba
additionalelements e2multilanedetector create tl errors different ts-sim-build-baerrors different ts-sim-build-baerrors different ts-sim-build-baerrors different ts-sim-build-baerrors different ts-sim-build-baerrors different ts-sim-build-ba
additionalelements e2multilanedetector create vtypes errors different ts-sim-build-baerrors different ts-sim-build-baerrors different ts-sim-build-baerrors different ts-sim-build-baerrors different ts-sim-build-baerrors different ts-sim-build-ba
additionalelements e2multilanedetector delete errors different ts-sim-build-baerrors different ts-sim-build-baerrors different ts-sim-build-baerrors different ts-sim-build-baerrors different ts-sim-build-baerrors different ts-sim-build-ba
additionalelements e2multilanedetector inspect endpos errors different ts-sim-build-baerrors different ts-sim-build-baerrors different ts-sim-build-baerrors different ts-sim-build-baerrors different ts-sim-build-baerrors different ts-sim-build-ba
additionalelements e2multilanedetector inspect file errors different ts-sim-build-baerrors different ts-sim-build-baerrors different ts-sim-build-baerrors different ts-sim-build-baerrors different ts-sim-build-baerrors different ts-sim-build-ba
additionalelements e2multilanedetector inspect friendlypos errors different ts-sim-build-baerrors different ts-sim-build-baerrors different ts-sim-build-baerrors different ts-sim-build-baerrors different ts-sim-build-baerrors different ts-sim-build-ba
additionalelements e2multilanedetector inspect id errors different ts-sim-build-baerrors different ts-sim-build-baerrors different ts-sim-build-baerrors different ts-sim-build-baerrors different ts-sim-build-baerrors different ts-sim-build-ba
additionalelements e2multilanedetector inspect jamthreshold errors different ts-sim-build-baerrors different ts-sim-build-baerrors different ts-sim-build-baerrors different ts-sim-build-baerrors different ts-sim-build-baerrors different ts-sim-build-ba
additionalelements e2multilanedetector inspect lanes errors different ts-sim-build-baerrors different ts-sim-build-baerrors different ts-sim-build-baerrors different ts-sim-build-baerrors different ts-sim-build-baerrors different ts-sim-build-ba
additionalelements e2multilanedetector inspect name errors different ts-sim-build-baerrors different ts-sim-build-baerrors different ts-sim-build-baerrors different ts-sim-build-baerrors different ts-sim-build-baerrors different ts-sim-build-ba
additionalelements e2multilanedetector inspect parameters errors different ts-sim-build-baerrors different ts-sim-build-baerrors different ts-sim-build-baerrors different ts-sim-build-baerrors different ts-sim-build-baerrors different ts-sim-build-ba
additionalelements e2multilanedetector inspect period errors different ts-sim-build-baerrors different ts-sim-build-baerrors different ts-sim-build-baerrors different ts-sim-build-baerrors different ts-sim-build-baerrors different ts-sim-build-ba
additionalelements e2multilanedetector inspect pos errors different ts-sim-build-baerrors different ts-sim-build-baerrors different ts-sim-build-baerrors different ts-sim-build-baerrors different ts-sim-build-baerrors different ts-sim-build-ba
additionalelements e2multilanedetector inspect speedthreshold errors different ts-sim-build-baerrors different ts-sim-build-baerrors different ts-sim-build-baerrors different ts-sim-build-baerrors different ts-sim-build-baerrors different ts-sim-build-ba
additionalelements e2multilanedetector inspect timethreshold errors different ts-sim-build-baerrors different ts-sim-build-baerrors different ts-sim-build-baerrors different ts-sim-build-baerrors different ts-sim-build-baerrors different ts-sim-build-ba
additionalelements e2multilanedetector inspect tl errors different ts-sim-build-baerrors different ts-sim-build-baerrors different ts-sim-build-baerrors different ts-sim-build-baerrors different ts-sim-build-baerrors different ts-sim-build-ba
additionalelements e2multilanedetector inspect vtypes errors different ts-sim-build-baerrors different ts-sim-build-baerrors different ts-sim-build-baerrors different ts-sim-build-baerrors different ts-sim-build-baerrors different ts-sim-build-ba
additionalelements e2multilanedetector inspect_selection file errors different ts-sim-build-baerrors different ts-sim-build-baerrors different ts-sim-build-baerrors different ts-sim-build-baerrors different ts-sim-build-baerrors different ts-sim-build-ba
additionalelements e2multilanedetector inspect_selection friendlypos errors different ts-sim-build-baerrors different ts-sim-build-baerrors different ts-sim-build-baerrors different ts-sim-build-baerrors different ts-sim-build-baerrors different ts-sim-build-ba
additionalelements e2multilanedetector inspect_selection jamthreshold errors different ts-sim-build-baerrors different ts-sim-build-baerrors different ts-sim-build-baerrors different ts-sim-build-baerrors different ts-sim-build-baerrors different ts-sim-build-ba
additionalelements e2multilanedetector inspect_selection name errors different ts-sim-build-baerrors different ts-sim-build-baerrors different ts-sim-build-baerrors different ts-sim-build-baerrors different ts-sim-build-baerrors different ts-sim-build-ba
additionalelements e2multilanedetector inspect_selection parameters errors different ts-sim-build-baerrors different ts-sim-build-baerrors different ts-sim-build-baerrors different ts-sim-build-baerrors different ts-sim-build-baerrors different ts-sim-build-ba
additionalelements e2multilanedetector inspect_selection period errors different ts-sim-build-baerrors different ts-sim-build-baerrors different ts-sim-build-baerrors different ts-sim-build-baerrors different ts-sim-build-baerrors different ts-sim-build-ba
additionalelements e2multilanedetector inspect_selection speedthreshold errors different ts-sim-build-baerrors different ts-sim-build-baerrors different ts-sim-build-baerrors different ts-sim-build-baerrors different ts-sim-build-baerrors different ts-sim-build-ba
additionalelements e2multilanedetector inspect_selection timethreshold errors different ts-sim-build-baerrors different ts-sim-build-baerrors different ts-sim-build-baerrors different ts-sim-build-baerrors different ts-sim-build-baerrors different ts-sim-build-ba
additionalelements e2multilanedetector inspect_selection tl errors different ts-sim-build-baerrors different ts-sim-build-baerrors different ts-sim-build-baerrors different ts-sim-build-baerrors different ts-sim-build-baerrors different ts-sim-build-ba
additionalelements e2multilanedetector inspect_selection vtypes errors different ts-sim-build-baerrors different ts-sim-build-baerrors different ts-sim-build-baerrors different ts-sim-build-baerrors different ts-sim-build-baerrors different ts-sim-build-ba
additionalelements e2multilanedetector load endpos errors different(+) ts-sim-build-baerrors different(+) ts-sim-build-baerrors different(+) ts-sim-build-baerrors different(+) ts-sim-build-baerrors different(+) ts-sim-build-baerrors different(+) ts-sim-build-ba
additionalelements e2multilanedetector load file errors different ts-sim-build-baerrors different ts-sim-build-baerrors different ts-sim-build-baerrors different ts-sim-build-baerrors different ts-sim-build-baerrors different ts-sim-build-ba
additionalelements e2multilanedetector load friendlypos errors different ts-sim-build-baerrors different ts-sim-build-ba