23Jun22rv1_13_0+1125-a2e6391f177 - detailed test results for NETEDITCHECKOUTPUT

To reconnect the TextTest GUI to these results, run:

texttest -a neteditcheckoutput -d /home/delphi/clangDebug/sumo/tests -reconnect /home/delphi/clangDebug/texttesttmp/clang3_64D.30Jun050555.543189 -g

To start TextTest for these tests, run:

texttest -a neteditcheckoutput -d /home/delphi/clangDebug/sumo/tests


default: 3617 tests: 3483 succeeded 107 FAILED 17 known bugs 10 killed

Detailed information for the tests that FAILED:

19 TESTS FAILED on ts-sim-build-ba :

---------- Differences in errors ----------
0a1,2
> /home/delphi/clangDebug/sumo/src/microsim/trigger/MSCalibrator.cpp:276:21: runtime error: 6.40512e+14 is outside the range of representable values of type 'int'
> SUMMARY: UndefinedBehaviorSanitizer: undefined-behavior /home/delphi/clangDebug/sumo/src/microsim/trigger/MSCalibrator.cpp:276:21 in 
additionalelements calibratorflow load arrivallane ( Last six runs Jun2022 )
additionalelements calibratorflow load arrivalpos ( Last six runs Jun2022 )
additionalelements calibratorflow load arrivalposlat ( Last six runs Jun2022 )
additionalelements calibratorflow load arrivalspeed ( Last six runs Jun2022 )
additionalelements calibratorflow load begin ( Last six runs Jun2022 )
additionalelements calibratorflow load color ( Last six runs Jun2022 )
additionalelements calibratorflow load containernumber ( Last six runs Jun2022 )
additionalelements calibratorflow load default ( Last six runs Jun2022 )
additionalelements calibratorflow load departlane ( Last six runs Jun2022 )
additionalelements calibratorflow load departpos ( Last six runs Jun2022 )
additionalelements calibratorflow load departposlat ( Last six runs Jun2022 )
additionalelements calibratorflow load departspeed ( Last six runs Jun2022 )
additionalelements calibratorflow load end ( Last six runs Jun2022 )
additionalelements calibratorflow load id ( Last six runs Jun2022 )
additionalelements calibratorflow load line ( Last six runs Jun2022 )
additionalelements calibratorflow load personnumber ( Last six runs Jun2022 )
additionalelements calibratorflow load reroute ( Last six runs Jun2022 )
additionalelements calibratorflow load route ( Last six runs Jun2022 )
additionalelements calibratorflow load speed ( Last six runs Jun2022 )

TEST FAILED on ts-sim-build-ba : additionalelements calibratorflow load invalid ( Last six runs Jun2022 )

---------- Differences in errors ----------
0a1,2
> /home/delphi/clangDebug/sumo/src/microsim/trigger/MSCalibrator.cpp:276:21: runtime error: 6.40512e+15 is outside the range of representable values of type 'int'
> SUMMARY: UndefinedBehaviorSanitizer: undefined-behavior /home/delphi/clangDebug/sumo/src/microsim/trigger/MSCalibrator.cpp:276:21 in 

TEST FAILED on ts-sim-build-ba : additionalelements calibratorflow load type ( Last six runs Jun2022 )

---------- Differences in errors ----------
0a1,2
> /home/delphi/clangDebug/sumo/src/microsim/trigger/MSCalibrator.cpp:276:21: runtime error: -2.56205e+12 is outside the range of representable values of type 'int'
> SUMMARY: UndefinedBehaviorSanitizer: undefined-behavior /home/delphi/clangDebug/sumo/src/microsim/trigger/MSCalibrator.cpp:276:21 in 

TEST FAILED on ts-sim-build-ba : additionalelements calibratorflow load vehsperhour ( Last six runs Jun2022 )

---------- Differences in errors ----------
0a1,2
> /home/delphi/clangDebug/sumo/src/microsim/trigger/MSCalibrator.cpp:276:21: runtime error: 5.89271e+14 is outside the range of representable values of type 'int'
> SUMMARY: UndefinedBehaviorSanitizer: undefined-behavior /home/delphi/clangDebug/sumo/src/microsim/trigger/MSCalibrator.cpp:276:21 in 

TEST FAILED on ts-sim-build-ba : additionalelements e2multilanedetector load endpos ( Last six runs Jun2022 )

---------- Differences in errors ----------
1a2
> sumo: /home/delphi/clangDebug/sumo/src/microsim/output/MSE2Collector.cpp:275: void MSE2Collector::checkPositioning(bool, double): Assertion `(myStartPos >= POSITION_EPS || myStartPos == 0) && myStartPos < myFirstLane->getLength()' failed.
---------- New result in exitcode ----------
-6

TEST FAILED on ts-sim-build-ba : bugs viewport change_zoom ( Last six runs Jun2022 )

---------- Differences in errors ----------
2a3,508
> 
> =================================================================
> ==2663878==ERROR: LeakSanitizer: detected memory leaks
> 
> Direct leak of 56 byte(s) in 1 object(s) allocated from:
>     #0 0x55035d in operator new(unsigned long) (/home/delphi/clangDebug/sumo/bin/sumoD+0x55035d)
>     #1 0x1768581 in NLBuilder::buildRouteLoaderControl(OptionsCont const&) /home/delphi/clangDebug/sumo/src/netload/NLBuilder.cpp:424:40
>     #2 0x1763251 in NLBuilder::buildNet() /home/delphi/clangDebug/sumo/src/netload/NLBuilder.cpp:363:24
>     #3 0x1757acf in NLBuilder::build() /home/delphi/clangDebug/sumo/src/netload/NLBuilder.cpp:134:5
>     #4 0x1767a79 in NLBuilder::init(bool) /home/delphi/clangDebug/sumo/src/netload/NLBuilder.cpp:330:17
>     #5 0x5541b4 in main /home/delphi/clangDebug/sumo/src/sumo_main.cpp:96:19
>     #6 0x7f36edd37082 in __libc_start_main /build/glibc-SzIz7B/glibc-2.31/csu/../csu/libc-start.c:308:16
> 
> Indirect leak of 39192 byte(s) in 23 object(s) allocated from:
>     #0 0x55035d in operator new(unsigned long) (/home/delphi/clangDebug/sumo/bin/sumoD+0x55035d)
>     #1 0x1846ee8 in NLEdgeControlBuilder::addLane(std::__cxx11::basic_string<char, std::char_traits<char>, std::allocator<char> > const&, double, double, double, PositionVector const&, double, int, int, int, int, bool, std::__cxx11::basic_string<char, std::char_traits<char>, std::allocator<char> > const&) /home/delphi/clangDebug/sumo/src/netload/NLEdgeControlBuilder.cpp:87:20
>     #2 0x178bd88 in NLHandler::addLane(SUMOSAXAttributes const&) /home/delphi/clangDebug/sumo/src/netload/NLHandler.cpp:539:49
>     #3 0x177cd95 in NLHandler::myStartElement(int, SUMOSAXAttributes const&) /home/delphi/clangDebug/sumo/src/netload/NLHandler.cpp:103:17
>     #4 0x307c9d3 in GenericSAXHandler::startElement(char16_t const*, char16_t const*, char16_t const*, xercesc_3_2::Attributes const&) /home/delphi/clangDebug/sumo/src/utils/xml/GenericSAXHandler.cpp:128:9
>     #5 0x7f36eefe95ae in xercesc_3_2::SAX2XMLReaderImpl::startElement(xercesc_3_2::XMLElementDecl const&, unsigned int, char16_t const*, xercesc_3_2::RefVectorOf<xercesc_3_2::XMLAttr> const&, unsigned long, bool, bool) (/usr/lib/x86_64-linux-gnu/libxerces-c-3.2.so+0x2135ae)
> 
> Indirect leak of 23256 byte(s) in 19 object(s) allocated from:
>     #0 0x55035d in operator new(unsigned long) (/home/delphi/clangDebug/sumo/bin/sumoD+0x55035d)
>     #1 0x184f092 in NLEdgeControlBuilder::buildEdge(std::__cxx11::basic_string<char, std::char_traits<char>, std::allocator<char> > const&, SumoXMLEdgeFunc, std::__cxx11::basic_string<char, std::char_traits<char>, std::allocator<char> > const&, std::__cxx11::basic_string<char, std::char_traits<char>, std::allocator<char> > const&, int, double) /home/delphi/clangDebug/sumo/src/netload/NLEdgeControlBuilder.cpp:233:12
>     #2 0x184645f in NLEdgeControlBuilder::beginEdgeParsing(std::__cxx11::basic_string<char, std::char_traits<char>, std::allocator<char> > const&, SumoXMLEdgeFunc, std::__cxx11::basic_string<char, std::char_traits<char>, std::allocator<char> > const&, std::__cxx11::basic_string<char, std::char_traits<char>, std::allocator<char> > const&, int, std::__cxx11::basic_string<char, std::char_traits<char>, std::allocator<char> > const&, double) /home/delphi/clangDebug/sumo/src/netload/NLEdgeControlBui
lder.cpp:68:20
>     #3 0x1787983 in NLHandler::beginEdgeParsing(SUMOSAXAttributes const&) /home/delphi/clangDebug/sumo/src/netload/NLHandler.cpp:454:30
>     #4 0x177cc97 in NLHandler::myStartElement(int, SUMOSAXAttributes const&) /home/delphi/clangDebug/sumo/src/netload/NLHandler.cpp:100:17
>     #5 0x307c9d3 in GenericSAXHandler::startElement(char16_t const*, char16_t const*, char16_t const*, xercesc_3_2::Attributes const&) /home/delphi/clangDebug/sumo/src/utils/xml/GenericSAXHandler.cpp:128:9
>     #6 0x7f36eefe95ae in xercesc_3_2::SAX2XMLReaderImpl::startElement(xercesc_3_2::XMLElementDecl const&, unsigned int, char16_t const*, xercesc_3_2::RefVectorOf<xercesc_3_2::XMLAttr> const&, unsigned long, bool, bool) (/usr/lib/x86_64-linux-gnu/libxerces-c-3.2.so+0x2135ae)
<truncated after showing first 30 lines>

TEST FAILED on ts-sim-build-ba : bugs viewport input_zoom ( Last six runs Jun2022 )

---------- Differences in errors ----------
2a3,508
> 
> =================================================================
> ==2663876==ERROR: LeakSanitizer: detected memory leaks
> 
> Direct leak of 56 byte(s) in 1 object(s) allocated from:
>     #0 0x55035d in operator new(unsigned long) (/home/delphi/clangDebug/sumo/bin/sumoD+0x55035d)
>     #1 0x1768581 in NLBuilder::buildRouteLoaderControl(OptionsCont const&) /home/delphi/clangDebug/sumo/src/netload/NLBuilder.cpp:424:40
>     #2 0x1763251 in NLBuilder::buildNet() /home/delphi/clangDebug/sumo/src/netload/NLBuilder.cpp:363:24
>     #3 0x1757acf in NLBuilder::build() /home/delphi/clangDebug/sumo/src/netload/NLBuilder.cpp:134:5
>     #4 0x1767a79 in NLBuilder::init(bool) /home/delphi/clangDebug/sumo/src/netload/NLBuilder.cpp:330:17
>     #5 0x5541b4 in main /home/delphi/clangDebug/sumo/src/sumo_main.cpp:96:19
>     #6 0x7f7502b69082 in __libc_start_main /build/glibc-SzIz7B/glibc-2.31/csu/../csu/libc-start.c:308:16
> 
> Indirect leak of 39192 byte(s) in 23 object(s) allocated from:
>     #0 0x55035d in operator new(unsigned long) (/home/delphi/clangDebug/sumo/bin/sumoD+0x55035d)
>     #1 0x1846ee8 in NLEdgeControlBuilder::addLane(std::__cxx11::basic_string<char, std::char_traits<char>, std::allocator<char> > const&, double, double, double, PositionVector const&, double, int, int, int, int, bool, std::__cxx11::basic_string<char, std::char_traits<char>, std::allocator<char> > const&) /home/delphi/clangDebug/sumo/src/netload/NLEdgeControlBuilder.cpp:87:20
>     #2 0x178bd88 in NLHandler::addLane(SUMOSAXAttributes const&) /home/delphi/clangDebug/sumo/src/netload/NLHandler.cpp:539:49
>     #3 0x177cd95 in NLHandler::myStartElement(int, SUMOSAXAttributes const&) /home/delphi/clangDebug/sumo/src/netload/NLHandler.cpp:103:17
>     #4 0x307c9d3 in GenericSAXHandler::startElement(char16_t const*, char16_t const*, char16_t const*, xercesc_3_2::Attributes const&) /home/delphi/clangDebug/sumo/src/utils/xml/GenericSAXHandler.cpp:128:9
>     #5 0x7f7503e1b5ae in xercesc_3_2::SAX2XMLReaderImpl::startElement(xercesc_3_2::XMLElementDecl const&, unsigned int, char16_t const*, xercesc_3_2::RefVectorOf<xercesc_3_2::XMLAttr> const&, unsigned long, bool, bool) (/usr/lib/x86_64-linux-gnu/libxerces-c-3.2.so+0x2135ae)
> 
> Indirect leak of 23256 byte(s) in 19 object(s) allocated from:
>     #0 0x55035d in operator new(unsigned long) (/home/delphi/clangDebug/sumo/bin/sumoD+0x55035d)
>     #1 0x184f092 in NLEdgeControlBuilder::buildEdge(std::__cxx11::basic_string<char, std::char_traits<char>, std::allocator<char> > const&, SumoXMLEdgeFunc, std::__cxx11::basic_string<char, std::char_traits<char>, std::allocator<char> > const&, std::__cxx11::basic_string<char, std::char_traits<char>, std::allocator<char> > const&, int, double) /home/delphi/clangDebug/sumo/src/netload/NLEdgeControlBuilder.cpp:233:12
>     #2 0x184645f in NLEdgeControlBuilder::beginEdgeParsing(std::__cxx11::basic_string<char, std::char_traits<char>, std::allocator<char> > const&, SumoXMLEdgeFunc, std::__cxx11::basic_string<char, std::char_traits<char>, std::allocator<char> > const&, std::__cxx11::basic_string<char, std::char_traits<char>, std::allocator<char> > const&, int, std::__cxx11::basic_string<char, std::char_traits<char>, std::allocator<char> > const&, double) /home/delphi/clangDebug/sumo/src/netload/NLEdgeControlBui
lder.cpp:68:20
>     #3 0x1787983 in NLHandler::beginEdgeParsing(SUMOSAXAttributes const&) /home/delphi/clangDebug/sumo/src/netload/NLHandler.cpp:454:30
>     #4 0x177cc97 in NLHandler::myStartElement(int, SUMOSAXAttributes const&) /home/delphi/clangDebug/sumo/src/netload/NLHandler.cpp:100:17
>     #5 0x307c9d3 in GenericSAXHandler::startElement(char16_t const*, char16_t const*, char16_t const*, xercesc_3_2::Attributes const&) /home/delphi/clangDebug/sumo/src/utils/xml/GenericSAXHandler.cpp:128:9
>     #6 0x7f7503e1b5ae in xercesc_3_2::SAX2XMLReaderImpl::startElement(xercesc_3_2::XMLElementDecl const&, unsigned int, char16_t const*, xercesc_3_2::RefVectorOf<xercesc_3_2::XMLAttr> const&, unsigned long, bool, bool) (/usr/lib/x86_64-linux-gnu/libxerces-c-3.2.so+0x2135ae)
<truncated after showing first 30 lines>

TEST FAILED on ts-sim-build-ba : demandelements container create color ( Last six runs Jun2022 )

---------- Differences in errors ----------
0a1,13
> 
> =================================================================
> ==2659723==ERROR: LeakSanitizer: detected memory leaks
> 
> Direct leak of 48 byte(s) in 2 object(s) allocated from:
>     #0 0x55035d in operator new(unsigned long) (/home/delphi/clangDebug/sumo/bin/sumoD+0x55035d)
>     #1 0x92a9ab in MSRouteHandler::addContainer(SUMOSAXAttributes const&) /home/delphi/clangDebug/sumo/src/microsim/MSRouteHandler.cpp:1515:33
>     #2 0x2e996ff in SUMORouteHandler::myStartElement(int, SUMOSAXAttributes const&) /home/delphi/clangDebug/sumo/src/utils/vehicle/SUMORouteHandler.cpp:111:13
>     #3 0x8bcdb1 in MSRouteHandler::myStartElement(int, SUMOSAXAttributes const&) /home/delphi/clangDebug/sumo/src/microsim/MSRouteHandler.cpp:192:27
>     #4 0x307c9d3 in GenericSAXHandler::startElement(char16_t const*, char16_t const*, char16_t const*, xercesc_3_2::Attributes const&) /home/delphi/clangDebug/sumo/src/utils/xml/GenericSAXHandler.cpp:128:9
>     #5 0x7f48d530a5ae in xercesc_3_2::SAX2XMLReaderImpl::startElement(xercesc_3_2::XMLElementDecl const&, unsigned int, char16_t const*, xercesc_3_2::RefVectorOf<xercesc_3_2::XMLAttr> const&, unsigned long, bool, bool) (/usr/lib/x86_64-linux-gnu/libxerces-c-3.2.so+0x2135ae)
> 
> SUMMARY: AddressSanitizer: 48 byte(s) leaked in 2 allocation(s).
---------- New result in exitcode ----------
1

TEST FAILED on ts-sim-build-ba : demandelements container create default_stop default_stop_containerstop ( Last six runs Jun2022 )

---------- Differences in errors ----------
0a1,13
> 
> =================================================================
> ==2659710==ERROR: LeakSanitizer: detected memory leaks
> 
> Direct leak of 24 byte(s) in 1 object(s) allocated from:
>     #0 0x55035d in operator new(unsigned long) (/home/delphi/clangDebug/sumo/bin/sumoD+0x55035d)
>     #1 0x92a9ab in MSRouteHandler::addContainer(SUMOSAXAttributes const&) /home/delphi/clangDebug/sumo/src/microsim/MSRouteHandler.cpp:1515:33
>     #2 0x2e996ff in SUMORouteHandler::myStartElement(int, SUMOSAXAttributes const&) /home/delphi/clangDebug/sumo/src/utils/vehicle/SUMORouteHandler.cpp:111:13
>     #3 0x8bcdb1 in MSRouteHandler::myStartElement(int, SUMOSAXAttributes const&) /home/delphi/clangDebug/sumo/src/microsim/MSRouteHandler.cpp:192:27
>     #4 0x307c9d3 in GenericSAXHandler::startElement(char16_t const*, char16_t const*, char16_t const*, xercesc_3_2::Attributes const&) /home/delphi/clangDebug/sumo/src/utils/xml/GenericSAXHandler.cpp:128:9
>     #5 0x7f7324d1f5ae in xercesc_3_2::SAX2XMLReaderImpl::startElement(xercesc_3_2::XMLElementDecl const&, unsigned int, char16_t const*, xercesc_3_2::RefVectorOf<xercesc_3_2::XMLAttr> const&, unsigned long, bool, bool) (/usr/lib/x86_64-linux-gnu/libxerces-c-3.2.so+0x2135ae)
> 
> SUMMARY: AddressSanitizer: 24 byte(s) leaked in 1 allocation(s).
---------- New result in exitcode ----------
1

TEST FAILED on ts-sim-build-ba : demandelements container create default_stop default_stop_lane ( Last six runs Jun2022 )

---------- Differences in errors ----------
0a1,13
> 
> =================================================================
> ==2659694==ERROR: LeakSanitizer: detected memory leaks
> 
> Direct leak of 24 byte(s) in 1 object(s) allocated from:
>     #0 0x55035d in operator new(unsigned long) (/home/delphi/clangDebug/sumo/bin/sumoD+0x55035d)
>     #1 0x92a9ab in MSRouteHandler::addContainer(SUMOSAXAttributes const&) /home/delphi/clangDebug/sumo/src/microsim/MSRouteHandler.cpp:1515:33
>     #2 0x2e996ff in SUMORouteHandler::myStartElement(int, SUMOSAXAttributes const&) /home/delphi/clangDebug/sumo/src/utils/vehicle/SUMORouteHandler.cpp:111:13
>     #3 0x8bcdb1 in MSRouteHandler::myStartElement(int, SUMOSAXAttributes const&) /home/delphi/clangDebug/sumo/src/microsim/MSRouteHandler.cpp:192:27
>     #4 0x307c9d3 in GenericSAXHandler::startElement(char16_t const*, char16_t const*, char16_t const*, xercesc_3_2::Attributes const&) /home/delphi/clangDebug/sumo/src/utils/xml/GenericSAXHandler.cpp:128:9
>     #5 0x7f3e948ce5ae in xercesc_3_2::SAX2XMLReaderImpl::startElement(xercesc_3_2::XMLElementDecl const&, unsigned int, char16_t const*, xercesc_3_2::RefVectorOf<xercesc_3_2::XMLAttr> const&, unsigned long, bool, bool) (/usr/lib/x86_64-linux-gnu/libxerces-c-3.2.so+0x2135ae)
> 
> SUMMARY: AddressSanitizer: 24 byte(s) leaked in 1 allocation(s).
---------- New result in exitcode ----------
1

TEST FAILED on ts-sim-build-ba : demandelements container create default_tranship default_tranship_containerstop ( Last six runs Jun2022 )

---------- Differences in errors ----------
0a1,13
> 
> =================================================================
> ==2659678==ERROR: LeakSanitizer: detected memory leaks
> 
> Direct leak of 24 byte(s) in 1 object(s) allocated from:
>     #0 0x55035d in operator new(unsigned long) (/home/delphi/clangDebug/sumo/bin/sumoD+0x55035d)
>     #1 0x92a9ab in MSRouteHandler::addContainer(SUMOSAXAttributes const&) /home/delphi/clangDebug/sumo/src/microsim/MSRouteHandler.cpp:1515:33
>     #2 0x2e996ff in SUMORouteHandler::myStartElement(int, SUMOSAXAttributes const&) /home/delphi/clangDebug/sumo/src/utils/vehicle/SUMORouteHandler.cpp:111:13
>     #3 0x8bcdb1 in MSRouteHandler::myStartElement(int, SUMOSAXAttributes const&) /home/delphi/clangDebug/sumo/src/microsim/MSRouteHandler.cpp:192:27
>     #4 0x307c9d3 in GenericSAXHandler::startElement(char16_t const*, char16_t const*, char16_t const*, xercesc_3_2::Attributes const&) /home/delphi/clangDebug/sumo/src/utils/xml/GenericSAXHandler.cpp:128:9
>     #5 0x7f34678485ae in xercesc_3_2::SAX2XMLReaderImpl::startElement(xercesc_3_2::XMLElementDecl const&, unsigned int, char16_t const*, xercesc_3_2::RefVectorOf<xercesc_3_2::XMLAttr> const&, unsigned long, bool, bool) (/usr/lib/x86_64-linux-gnu/libxerces-c-3.2.so+0x2135ae)
> 
> SUMMARY: AddressSanitizer: 24 byte(s) leaked in 1 allocation(s).
---------- New result in exitcode ----------
1

TEST FAILED on ts-sim-build-ba : demandelements container create default_tranship default_tranship_edges ( Last six runs Jun2022 )

---------- Differences in errors ----------
0a1,13
> 
> =================================================================
> ==2659669==ERROR: LeakSanitizer: detected memory leaks
> 
> Direct leak of 24 byte(s) in 1 object(s) allocated from:
>     #0 0x55035d in operator new(unsigned long) (/home/delphi/clangDebug/sumo/bin/sumoD+0x55035d)
>     #1 0x92a9ab in MSRouteHandler::addContainer(SUMOSAXAttributes const&) /home/delphi/clangDebug/sumo/src/microsim/MSRouteHandler.cpp:1515:33
>     #2 0x2e996ff in SUMORouteHandler::myStartElement(int, SUMOSAXAttributes const&) /home/delphi/clangDebug/sumo/src/utils/vehicle/SUMORouteHandler.cpp:111:13
>     #3 0x8bcdb1 in MSRouteHandler::myStartElement(int, SUMOSAXAttributes const&) /home/delphi/clangDebug/sumo/src/microsim/MSRouteHandler.cpp:192:27
>     #4 0x307c9d3 in GenericSAXHandler::startElement(char16_t const*, char16_t const*, char16_t const*, xercesc_3_2::Attributes const&) /home/delphi/clangDebug/sumo/src/utils/xml/GenericSAXHandler.cpp:128:9
>     #5 0x7ff1b8cb65ae in xercesc_3_2::SAX2XMLReaderImpl::startElement(xercesc_3_2::XMLElementDecl const&, unsigned int, char16_t const*, xercesc_3_2::RefVectorOf<xercesc_3_2::XMLAttr> const&, unsigned long, bool, bool) (/usr/lib/x86_64-linux-gnu/libxerces-c-3.2.so+0x2135ae)
> 
> SUMMARY: AddressSanitizer: 24 byte(s) leaked in 1 allocation(s).
---------- New result in exitcode ----------
1

TEST FAILED on ts-sim-build-ba : demandelements container create default_tranship default_tranship_fromto ( Last six runs Jun2022 )

---------- Differences in errors ----------
0a1,13
> 
> =================================================================
> ==2659676==ERROR: LeakSanitizer: detected memory leaks
> 
> Direct leak of 24 byte(s) in 1 object(s) allocated from:
>     #0 0x55035d in operator new(unsigned long) (/home/delphi/clangDebug/sumo/bin/sumoD+0x55035d)
>     #1 0x92a9ab in MSRouteHandler::addContainer(SUMOSAXAttributes const&) /home/delphi/clangDebug/sumo/src/microsim/MSRouteHandler.cpp:1515:33
>     #2 0x2e996ff in SUMORouteHandler::myStartElement(int, SUMOSAXAttributes const&) /home/delphi/clangDebug/sumo/src/utils/vehicle/SUMORouteHandler.cpp:111:13
>     #3 0x8bcdb1 in MSRouteHandler::myStartElement(int, SUMOSAXAttributes const&) /home/delphi/clangDebug/sumo/src/microsim/MSRouteHandler.cpp:192:27
>     #4 0x307c9d3 in GenericSAXHandler::startElement(char16_t const*, char16_t const*, char16_t const*, xercesc_3_2::Attributes const&) /home/delphi/clangDebug/sumo/src/utils/xml/GenericSAXHandler.cpp:128:9
>     #5 0x7f2c5af0d5ae in xercesc_3_2::SAX2XMLReaderImpl::startElement(xercesc_3_2::XMLElementDecl const&, unsigned int, char16_t const*, xercesc_3_2::RefVectorOf<xercesc_3_2::XMLAttr> const&, unsigned long, bool, bool) (/usr/lib/x86_64-linux-gnu/libxerces-c-3.2.so+0x2135ae)
> 
> SUMMARY: AddressSanitizer: 24 byte(s) leaked in 1 allocation(s).
---------- New result in exitcode ----------
1

TEST FAILED on ts-sim-build-ba : demandelements container create default_transport default_transport_containerstop ( Last six runs Jun2022 )

---------- Differences in errors ----------
1a2,14
> 
> =================================================================
> ==2659688==ERROR: LeakSanitizer: detected memory leaks
> 
> Direct leak of 24 byte(s) in 1 object(s) allocated from:
>     #0 0x55035d in operator new(unsigned long) (/home/delphi/clangDebug/sumo/bin/sumoD+0x55035d)
>     #1 0x92a9ab in MSRouteHandler::addContainer(SUMOSAXAttributes const&) /home/delphi/clangDebug/sumo/src/microsim/MSRouteHandler.cpp:1515:33
>     #2 0x2e996ff in SUMORouteHandler::myStartElement(int, SUMOSAXAttributes const&) /home/delphi/clangDebug/sumo/src/utils/vehicle/SUMORouteHandler.cpp:111:13
>     #3 0x8bcdb1 in MSRouteHandler::myStartElement(int, SUMOSAXAttributes const&) /home/delphi/clangDebug/sumo/src/microsim/MSRouteHandler.cpp:192:27
>     #4 0x307c9d3 in GenericSAXHandler::startElement(char16_t const*, char16_t const*, char16_t const*, xercesc_3_2::Attributes const&) /home/delphi/clangDebug/sumo/src/utils/xml/GenericSAXHandler.cpp:128:9
>     #5 0x7fbf5c5905ae in xercesc_3_2::SAX2XMLReaderImpl::startElement(xercesc_3_2::XMLElementDecl const&, unsigned int, char16_t const*, xercesc_3_2::RefVectorOf<xercesc_3_2::XMLAttr> const&, unsigned long, bool, bool) (/usr/lib/x86_64-linux-gnu/libxerces-c-3.2.so+0x2135ae)
> 
> SUMMARY: AddressSanitizer: 24 byte(s) leaked in 1 allocation(s).
---------- New result in exitcode ----------
1

TEST FAILED on ts-sim-build-ba : demandelements container create default_transport default_transport_fromto ( Last six runs Jun2022 )

---------- Differences in errors ----------
1a2,14
> 
> =================================================================
> ==2659683==ERROR: LeakSanitizer: detected memory leaks
> 
> Direct leak of 24 byte(s) in 1 object(s) allocated from:
>     #0 0x55035d in operator new(unsigned long) (/home/delphi/clangDebug/sumo/bin/sumoD+0x55035d)
>     #1 0x92a9ab in MSRouteHandler::addContainer(SUMOSAXAttributes const&) /home/delphi/clangDebug/sumo/src/microsim/MSRouteHandler.cpp:1515:33
>     #2 0x2e996ff in SUMORouteHandler::myStartElement(int, SUMOSAXAttributes const&) /home/delphi/clangDebug/sumo/src/utils/vehicle/SUMORouteHandler.cpp:111:13
>     #3 0x8bcdb1 in MSRouteHandler::myStartElement(int, SUMOSAXAttributes const&) /home/delphi/clangDebug/sumo/src/microsim/MSRouteHandler.cpp:192:27
>     #4 0x307c9d3 in GenericSAXHandler::startElement(char16_t const*, char16_t const*, char16_t const*, xercesc_3_2::Attributes const&) /home/delphi/clangDebug/sumo/src/utils/xml/GenericSAXHandler.cpp:128:9
>     #5 0x7f7f7fe865ae in xercesc_3_2::SAX2XMLReaderImpl::startElement(xercesc_3_2::XMLElementDecl const&, unsigned int, char16_t const*, xercesc_3_2::RefVectorOf<xercesc_3_2::XMLAttr> const&, unsigned long, bool, bool) (/usr/lib/x86_64-linux-gnu/libxerces-c-3.2.so+0x2135ae)
> 
> SUMMARY: AddressSanitizer: 24 byte(s) leaked in 1 allocation(s).
---------- New result in exitcode ----------
1

TEST FAILED on ts-sim-build-ba : demandelements container create depart ( Last six runs Jun2022 )

---------- Differences in errors ----------
0a1,13
> 
> =================================================================
> ==2659731==ERROR: LeakSanitizer: detected memory leaks
> 
> Direct leak of 24 byte(s) in 1 object(s) allocated from:
>     #0 0x55035d in operator new(unsigned long) (/home/delphi/clangDebug/sumo/bin/sumoD+0x55035d)
>     #1 0x92a9ab in MSRouteHandler::addContainer(SUMOSAXAttributes const&) /home/delphi/clangDebug/sumo/src/microsim/MSRouteHandler.cpp:1515:33
>     #2 0x2e996ff in SUMORouteHandler::myStartElement(int, SUMOSAXAttributes const&) /home/delphi/clangDebug/sumo/src/utils/vehicle/SUMORouteHandler.cpp:111:13
>     #3 0x8bcdb1 in MSRouteHandler::myStartElement(int, SUMOSAXAttributes const&) /home/delphi/clangDebug/sumo/src/microsim/MSRouteHandler.cpp:192:27
>     #4 0x307c9d3 in GenericSAXHandler::startElement(char16_t const*, char16_t const*, char16_t const*, xercesc_3_2::Attributes const&) /home/delphi/clangDebug/sumo/src/utils/xml/GenericSAXHandler.cpp:128:9
>     #5 0x7fded08175ae in xercesc_3_2::SAX2XMLReaderImpl::startElement(xercesc_3_2::XMLElementDecl const&, unsigned int, char16_t const*, xercesc_3_2::RefVectorOf<xercesc_3_2::XMLAttr> const&, unsigned long, bool, bool) (/usr/lib/x86_64-linux-gnu/libxerces-c-3.2.so+0x2135ae)
> 
> SUMMARY: AddressSanitizer: 24 byte(s) leaked in 1 allocation(s).
---------- New result in exitcode ----------
1

TEST FAILED on ts-sim-build-ba : demandelements container create id ( Last six runs Jun2022 )

---------- Differences in errors ----------
0a1,13
> 
> =================================================================
> ==2659716==ERROR: LeakSanitizer: detected memory leaks
> 
> Direct leak of 48 byte(s) in 2 object(s) allocated from:
>     #0 0x55035d in operator new(unsigned long) (/home/delphi/clangDebug/sumo/bin/sumoD+0x55035d)
>     #1 0x92a9ab in MSRouteHandler::addContainer(SUMOSAXAttributes const&) /home/delphi/clangDebug/sumo/src/microsim/MSRouteHandler.cpp:1515:33
>     #2 0x2e996ff in SUMORouteHandler::myStartElement(int, SUMOSAXAttributes const&) /home/delphi/clangDebug/sumo/src/utils/vehicle/SUMORouteHandler.cpp:111:13
>     #3 0x8bcdb1 in MSRouteHandler::myStartElement(int, SUMOSAXAttributes const&) /home/delphi/clangDebug/sumo/src/microsim/MSRouteHandler.cpp:192:27
>     #4 0x307c9d3 in GenericSAXHandler::startElement(char16_t const*, char16_t const*, char16_t const*, xercesc_3_2::Attributes const&) /home/delphi/clangDebug/sumo/src/utils/xml/GenericSAXHandler.cpp:128:9
>     #5 0x7f9ae59945ae in xercesc_3_2::SAX2XMLReaderImpl::startElement(xercesc_3_2::XMLElementDecl const&, unsigned int, char16_t const*, xercesc_3_2::RefVectorOf<xercesc_3_2::XMLAttr> const&, unsigned long, bool, bool) (/usr/lib/x86_64-linux-gnu/libxerces-c-3.2.so+0x2135ae)
> 
> SUMMARY: AddressSanitizer: 48 byte(s) leaked in 2 allocation(s).
---------- New result in exitcode ----------
1

TEST FAILED on ts-sim-build-ba : demandelements container inspect color ( Last six runs Jun2022 )

---------- Differences in errors ----------
1a2,14
> 
> =================================================================
> ==2659756==ERROR: LeakSanitizer: detected memory leaks
> 
> Direct leak of 24 byte(s) in 1 object(s) allocated from:
>     #0 0x55035d in operator new(unsigned long) (/home/delphi/clangDebug/sumo/bin/sumoD+0x55035d)
>     #1 0x92a9ab in MSRouteHandler::addContainer(SUMOSAXAttributes const&) /home/delphi/clangDebug/sumo/src/microsim/MSRouteHandler.cpp:1515:33
>     #2 0x2e996ff in SUMORouteHandler::myStartElement(int, SUMOSAXAttributes const&) /home/delphi/clangDebug/sumo/src/utils/vehicle/SUMORouteHandler.cpp:111:13
>     #3 0x8bcdb1 in MSRouteHandler::myStartElement(int, SUMOSAXAttributes const&) /home/delphi/clangDebug/sumo/src/microsim/MSRouteHandler.cpp:192:27
>     #4 0x307c9d3 in GenericSAXHandler::startElement(char16_t const*, char16_t const*, char16_t const*, xercesc_3_2::Attributes const&) /home/delphi/clangDebug/sumo/src/utils/xml/GenericSAXHandler.cpp:128:9
>     #5 0x7fa20b6335ae in xercesc_3_2::SAX2XMLReaderImpl::startElement(xercesc_3_2::XMLElementDecl const&, unsigned int, char16_t const*, xercesc_3_2::RefVectorOf<xercesc_3_2::XMLAttr> const&, unsigned long, bool, bool) (/usr/lib/x86_64-linux-gnu/libxerces-c-3.2.so+0x2135ae)
> 
> SUMMARY: AddressSanitizer: 24 byte(s) leaked in 1 allocation(s).
---------- New result in exitcode ----------
1

TEST FAILED on ts-sim-build-ba : demandelements container inspect depart float ( Last six runs Jun2022 )

---------- Differences in errors ----------
1a2,14
> 
> =================================================================
> ==2659763==ERROR: LeakSanitizer: detected memory leaks
> 
> Direct leak of 24 byte(s) in 1 object(s) allocated from:
>     #0 0x55035d in operator new(unsigned long) (/home/delphi/clangDebug/sumo/bin/sumoD+0x55035d)
>     #1 0x92a9ab in MSRouteHandler::addContainer(SUMOSAXAttributes const&) /home/delphi/clangDebug/sumo/src/microsim/MSRouteHandler.cpp:1515:33
>     #2 0x2e996ff in SUMORouteHandler::myStartElement(int, SUMOSAXAttributes const&) /home/delphi/clangDebug/sumo/src/utils/vehicle/SUMORouteHandler.cpp:111:13
>     #3 0x8bcdb1 in MSRouteHandler::myStartElement(int, SUMOSAXAttributes const&) /home/delphi/clangDebug/sumo/src/microsim/MSRouteHandler.cpp:192:27
>     #4 0x307c9d3 in GenericSAXHandler::startElement(char16_t const*, char16_t const*, char16_t const*, xercesc_3_2::Attributes const&) /home/delphi/clangDebug/sumo/src/utils/xml/GenericSAXHandler.cpp:128:9
>     #5 0x7fcaebf3b5ae in xercesc_3_2::SAX2XMLReaderImpl::startElement(xercesc_3_2::XMLElementDecl const&, unsigned int, char16_t const*, xercesc_3_2::RefVectorOf<xercesc_3_2::XMLAttr> const&, unsigned long, bool, bool) (/usr/lib/x86_64-linux-gnu/libxerces-c-3.2.so+0x2135ae)
> 
> SUMMARY: AddressSanitizer: 24 byte(s) leaked in 1 allocation(s).
---------- New result in exitcode ----------
1

TEST FAILED on ts-sim-build-ba : demandelements container inspect depart triggered ( Last six runs Jun2022 )

---------- Differences in errors ----------
2a3,15
> 
> =================================================================
> ==2659776==ERROR: LeakSanitizer: detected memory leaks
> 
> Direct leak of 24 byte(s) in 1 object(s) allocated from:
>     #0 0x55035d in operator new(unsigned long) (/home/delphi/clangDebug/sumo/bin/sumoD+0x55035d)
>     #1 0x92a9ab in MSRouteHandler::addContainer(SUMOSAXAttributes const&) /home/delphi/clangDebug/sumo/src/microsim/MSRouteHandler.cpp:1515:33
>     #2 0x2e996ff in SUMORouteHandler::myStartElement(int, SUMOSAXAttributes const&) /home/delphi/clangDebug/sumo/src/utils/vehicle/SUMORouteHandler.cpp:111:13
>     #3 0x8bcdb1 in MSRouteHandler::myStartElement(int, SUMOSAXAttributes const&) /home/delphi/clangDebug/sumo/src/microsim/MSRouteHandler.cpp:192:27
>     #4 0x307c9d3 in GenericSAXHandler::startElement(char16_t const*, char16_t const*, char16_t const*, xercesc_3_2::Attributes const&) /home/delphi/clangDebug/sumo/src/utils/xml/GenericSAXHandler.cpp:128:9
>     #5 0x7f3b4e25f5ae in xercesc_3_2::SAX2XMLReaderImpl::startElement(xercesc_3_2::XMLElementDecl const&, unsigned int, char16_t const*, xercesc_3_2::RefVectorOf<xercesc_3_2::XMLAttr> const&, unsigned long, bool, bool) (/usr/lib/x86_64-linux-gnu/libxerces-c-3.2.so+0x2135ae)
> 
> SUMMARY: AddressSanitizer: 24 byte(s) leaked in 1 allocation(s).

TEST FAILED on ts-sim-build-ba : demandelements container inspect id ( Last six runs Jun2022 )

---------- Differences in errors ----------
2a3,15
> 
> =================================================================
> ==2659745==ERROR: LeakSanitizer: detected memory leaks
> 
> Direct leak of 48 byte(s) in 2 object(s) allocated from:
>     #0 0x55035d in operator new(unsigned long) (/home/delphi/clangDebug/sumo/bin/sumoD+0x55035d)
>     #1 0x92a9ab in MSRouteHandler::addContainer(SUMOSAXAttributes const&) /home/delphi/clangDebug/sumo/src/microsim/MSRouteHandler.cpp:1515:33
>     #2 0x2e996ff in SUMORouteHandler::myStartElement(int, SUMOSAXAttributes const&) /home/delphi/clangDebug/sumo/src/utils/vehicle/SUMORouteHandler.cpp:111:13
>     #3 0x8bcdb1 in MSRouteHandler::myStartElement(int, SUMOSAXAttributes const&) /home/delphi/clangDebug/sumo/src/microsim/MSRouteHandler.cpp:192:27
>     #4 0x307c9d3 in GenericSAXHandler::startElement(char16_t const*, char16_t const*, char16_t const*, xercesc_3_2::Attributes const&) /home/delphi/clangDebug/sumo/src/utils/xml/GenericSAXHandler.cpp:128:9
>     #5 0x7f93a63785ae in xercesc_3_2::SAX2XMLReaderImpl::startElement(xercesc_3_2::XMLElementDecl const&, unsigned int, char16_t const*, xercesc_3_2::RefVectorOf<xercesc_3_2::XMLAttr> const&, unsigned long, bool, bool) (/usr/lib/x86_64-linux-gnu/libxerces-c-3.2.so+0x2135ae)
> 
> SUMMARY: AddressSanitizer: 48 byte(s) leaked in 2 allocation(s).
---------- New result in exitcode ----------
1

TEST FAILED on ts-sim-build-ba : demandelements container inspect parameters ( Last six runs Jun2022 )

---------- Differences in errors ----------
1a2,14
> 
> =================================================================
> ==2659777==ERROR: LeakSanitizer: detected memory leaks
> 
> Direct leak of 24 byte(s) in 1 object(s) allocated from:
>     #0 0x55035d in operator new(unsigned long) (/home/delphi/clangDebug/sumo/bin/sumoD+0x55035d)
>     #1 0x92a9ab in MSRouteHandler::addContainer(SUMOSAXAttributes const&) /home/delphi/clangDebug/sumo/src/microsim/MSRouteHandler.cpp:1515:33
>     #2 0x2e996ff in SUMORouteHandler::myStartElement(int, SUMOSAXAttributes const&) /home/delphi/clangDebug/sumo/src/utils/vehicle/SUMORouteHandler.cpp:111:13
>     #3 0x8bcdb1 in MSRouteHandler::myStartElement(int, SUMOSAXAttributes const&) /home/delphi/clangDebug/sumo/src/microsim/MSRouteHandler.cpp:192:27
>     #4 0x307c9d3 in GenericSAXHandler::startElement(char16_t const*, char16_t const*, char16_t const*, xercesc_3_2::Attributes const&) /home/delphi/clangDebug/sumo/src/utils/xml/GenericSAXHandler.cpp:128:9
>     #5 0x7f14926435ae in xercesc_3_2::SAX2XMLReaderImpl::startElement(xercesc_3_2::XMLElementDecl const&, unsigned int, char16_t const*, xercesc_3_2::RefVectorOf<xercesc_3_2::XMLAttr> const&, unsigned long, bool, bool) (/usr/lib/x86_64-linux-gnu/libxerces-c-3.2.so+0x2135ae)
> 
> SUMMARY: AddressSanitizer: 24 byte(s) leaked in 1 allocation(s).
---------- New result in exitcode ----------
1

TEST FAILED on ts-sim-build-ba : demandelements container inspect type ( Last six runs Jun2022 )

---------- Differences in errors ----------
1a2,14
> 
> =================================================================
> ==2659744==ERROR: LeakSanitizer: detected memory leaks
> 
> Direct leak of 24 byte(s) in 1 object(s) allocated from:
>     #0 0x55035d in operator new(unsigned long) (/home/delphi/clangDebug/sumo/bin/sumoD+0x55035d)
>     #1 0x92a9ab in MSRouteHandler::addContainer(SUMOSAXAttributes const&) /home/delphi/clangDebug/sumo/src/microsim/MSRouteHandler.cpp:1515:33
>     #2 0x2e996ff in SUMORouteHandler::myStartElement(int, SUMOSAXAttributes const&) /home/delphi/clangDebug/sumo/src/utils/vehicle/SUMORouteHandler.cpp:111:13
>     #3 0x8bcdb1 in MSRouteHandler::myStartElement(int, SUMOSAXAttributes const&) /home/delphi/clangDebug/sumo/src/microsim/MSRouteHandler.cpp:192:27
>     #4 0x307c9d3 in GenericSAXHandler::startElement(char16_t const*, char16_t const*, char16_t const*, xercesc_3_2::Attributes const&) /home/delphi/clangDebug/sumo/src/utils/xml/GenericSAXHandler.cpp:128:9
>     #5 0x7f18230cf5ae in xercesc_3_2::SAX2XMLReaderImpl::startElement(xercesc_3_2::XMLElementDecl const&, unsigned int, char16_t const*, xercesc_3_2::RefVectorOf<xercesc_3_2::XMLAttr> const&, unsigned long, bool, bool) (/usr/lib/x86_64-linux-gnu/libxerces-c-3.2.so+0x2135ae)
> 
> SUMMARY: AddressSanitizer: 24 byte(s) leaked in 1 allocation(s).
---------- New result in exitcode ----------
1

TEST FAILED on ts-sim-build-ba : demandelements container inspect_selection color ( Last six runs Jun2022 )

---------- Differences in errors ----------
0a1,13
> 
> =================================================================
> ==2659788==ERROR: LeakSanitizer: detected memory leaks
> 
> Direct leak of 48 byte(s) in 2 object(s) allocated from:
>     #0 0x55035d in operator new(unsigned long) (/home/delphi/clangDebug/sumo/bin/sumoD+0x55035d)
>     #1 0x92a9ab in MSRouteHandler::addContainer(SUMOSAXAttributes const&) /home/delphi/clangDebug/sumo/src/microsim/MSRouteHandler.cpp:1515:33
>     #2 0x2e996ff in SUMORouteHandler::myStartElement(int, SUMOSAXAttributes const&) /home/delphi/clangDebug/sumo/src/utils/vehicle/SUMORouteHandler.cpp:111:13
>     #3 0x8bcdb1 in MSRouteHandler::myStartElement(int, SUMOSAXAttributes const&) /home/delphi/clangDebug/sumo/src/microsim/MSRouteHandler.cpp:192:27
>     #4 0x307c9d3 in GenericSAXHandler::startElement(char16_t const*, char16_t const*, char16_t const*, xercesc_3_2::Attributes const&) /home/delphi/clangDebug/sumo/src/utils/xml/GenericSAXHandler.cpp:128:9
>     #5 0x7f52ade985ae in xercesc_3_2::SAX2XMLReaderImpl::startElement(xercesc_3_2::XMLElementDecl const&, unsigned int, char16_t const*, xercesc_3_2::RefVectorOf<xercesc_3_2::XMLAttr> const&, unsigned long, bool, bool) (/usr/lib/x86_64-linux-gnu/libxerces-c-3.2.so+0x2135ae)
> 
> SUMMARY: AddressSanitizer: 48 byte(s) leaked in 2 allocation(s).
---------- New result in exitcode ----------
1

TEST FAILED on ts-sim-build-ba : demandelements container inspect_selection depart float ( Last six runs Jun2022 )

---------- Differences in errors ----------
0a1,13
> 
> =================================================================
> ==2659796==ERROR: LeakSanitizer: detected memory leaks
> 
> Direct leak of 48 byte(s) in 2 object(s) allocated from:
>     #0 0x55035d in operator new(unsigned long) (/home/delphi/clangDebug/sumo/bin/sumoD+0x55035d)
>     #1 0x92a9ab in MSRouteHandler::addContainer(SUMOSAXAttributes const&) /home/delphi/clangDebug/sumo/src/microsim/MSRouteHandler.cpp:1515:33
>     #2 0x2e996ff in SUMORouteHandler::myStartElement(int, SUMOSAXAttributes const&) /home/delphi/clangDebug/sumo/src/utils/vehicle/SUMORouteHandler.cpp:111:13
>     #3 0x8bcdb1 in MSRouteHandler::myStartElement(int, SUMOSAXAttributes const&) /home/delphi/clangDebug/sumo/src/microsim/MSRouteHandler.cpp:192:27
>     #4 0x307c9d3 in GenericSAXHandler::startElement(char16_t const*, char16_t const*, char16_t const*, xercesc_3_2::Attributes const&) /home/delphi/clangDebug/sumo/src/utils/xml/GenericSAXHandler.cpp:128:9
>     #5 0x7f5a6503a5ae in xercesc_3_2::SAX2XMLReaderImpl::startElement(xercesc_3_2::XMLElementDecl const&, unsigned int, char16_t const*, xercesc_3_2::RefVectorOf<xercesc_3_2::XMLAttr> const&, unsigned long, bool, bool) (/usr/lib/x86_64-linux-gnu/libxerces-c-3.2.so+0x2135ae)
> 
> SUMMARY: AddressSanitizer: 48 byte(s) leaked in 2 allocation(s).
---------- New result in exitcode ----------
1

TEST FAILED on ts-sim-build-ba : demandelements container inspect_selection depart triggered ( Last six runs Jun2022 )

---------- Differences in errors ----------
2a3,15
> 
> =================================================================
> ==2659804==ERROR: LeakSanitizer: detected memory leaks
> 
> Direct leak of 24 byte(s) in 1 object(s) allocated from:
>     #0 0x55035d in operator new(unsigned long) (/home/delphi/clangDebug/sumo/bin/sumoD+0x55035d)
>     #1 0x92a9ab in MSRouteHandler::addContainer(SUMOSAXAttributes const&) /home/delphi/clangDebug/sumo/src/microsim/MSRouteHandler.cpp:1515:33
>     #2 0x2e996ff in SUMORouteHandler::myStartElement(int, SUMOSAXAttributes const&) /home/delphi/clangDebug/sumo/src/utils/vehicle/SUMORouteHandler.cpp:111:13
>     #3 0x8bcdb1 in MSRouteHandler::myStartElement(int, SUMOSAXAttributes const&) /home/delphi/clangDebug/sumo/src/microsim/MSRouteHandler.cpp:192:27
>     #4 0x307c9d3 in GenericSAXHandler::startElement(char16_t const*, char16_t const*, char16_t const*, xercesc_3_2::Attributes const&) /home/delphi/clangDebug/sumo/src/utils/xml/GenericSAXHandler.cpp:128:9
>     #5 0x7f1352ef15ae in xercesc_3_2::SAX2XMLReaderImpl::startElement(xercesc_3_2::XMLElementDecl const&, unsigned int, char16_t const*, xercesc_3_2::RefVectorOf<xercesc_3_2::XMLAttr> const&, unsigned long, bool, bool) (/usr/lib/x86_64-linux-gnu/libxerces-c-3.2.so+0x2135ae)
> 
> SUMMARY: AddressSanitizer: 24 byte(s) leaked in 1 allocation(s).

TEST FAILED on ts-sim-build-ba : demandelements container inspect_selection parameters ( Last six runs Jun2022 )

---------- Differences in errors ----------
0a1,13
> 
> =================================================================
> ==2659810==ERROR: LeakSanitizer: detected memory leaks
> 
> Direct leak of 48 byte(s) in 2 object(s) allocated from:
>     #0 0x55035d in operator new(unsigned long) (/home/delphi/clangDebug/sumo/bin/sumoD+0x55035d)
>     #1 0x92a9ab in MSRouteHandler::addContainer(SUMOSAXAttributes const&) /home/delphi/clangDebug/sumo/src/microsim/MSRouteHandler.cpp:1515:33
>     #2 0x2e996ff in SUMORouteHandler::myStartElement(int, SUMOSAXAttributes const&) /home/delphi/clangDebug/sumo/src/utils/vehicle/SUMORouteHandler.cpp:111:13
>     #3 0x8bcdb1 in MSRouteHandler::myStartElement(int, SUMOSAXAttributes const&) /home/delphi/clangDebug/sumo/src/microsim/MSRouteHandler.cpp:192:27
>     #4 0x307c9d3 in GenericSAXHandler::startElement(char16_t const*, char16_t const*, char16_t const*, xercesc_3_2::Attributes const&) /home/delphi/clangDebug/sumo/src/utils/xml/GenericSAXHandler.cpp:128:9
>     #5 0x7efc14f055ae in xercesc_3_2::SAX2XMLReaderImpl::startElement(xercesc_3_2::XMLElementDecl const&, unsigned int, char16_t const*, xercesc_3_2::RefVectorOf<xercesc_3_2::XMLAttr> const&, unsigned long, bool, bool) (/usr/lib/x86_64-linux-gnu/libxerces-c-3.2.so+0x2135ae)
> 
> SUMMARY: AddressSanitizer: 48 byte(s) leaked in 2 allocation(s).
---------- New result in exitcode ----------
1

TEST FAILED on ts-sim-build-ba : demandelements container inspect_selection type ( Last six runs Jun2022 )

---------- Differences in errors ----------
0a1,13
> 
> =================================================================
> ==2659787==ERROR: LeakSanitizer: detected memory leaks
> 
> Direct leak of 48 byte(s) in 2 object(s) allocated from:
>     #0 0x55035d in operator new(unsigned long) (/home/delphi/clangDebug/sumo/bin/sumoD+0x55035d)
>     #1 0x92a9ab in MSRouteHandler::addContainer(SUMOSAXAttributes const&) /home/delphi/clangDebug/sumo/src/microsim/MSRouteHandler.cpp:1515:33
>     #2 0x2e996ff in SUMORouteHandler::myStartElement(int, SUMOSAXAttributes const&) /home/delphi/clangDebug/sumo/src/utils/vehicle/SUMORouteHandler.cpp:111:13
>     #3 0x8bcdb1 in MSRouteHandler::myStartElement(int, SUMOSAXAttributes const&) /home/delphi/clangDebug/sumo/src/microsim/MSRouteHandler.cpp:192:27
>     #4 0x307c9d3 in GenericSAXHandler::startElement(char16_t const*, char16_t const*, char16_t const*, xercesc_3_2::Attributes const&) /home/delphi/clangDebug/sumo/src/utils/xml/GenericSAXHandler.cpp:128:9
>     #5 0x7f6a538395ae in xercesc_3_2::SAX2XMLReaderImpl::startElement(xercesc_3_2::XMLElementDecl const&, unsigned int, char16_t const*, xercesc_3_2::RefVectorOf<xercesc_3_2::XMLAttr> const&, unsigned long, bool, bool) (/usr/lib/x86_64-linux-gnu/libxerces-c-3.2.so+0x2135ae)
> 
> SUMMARY: AddressSanitizer: 48 byte(s) leaked in 2 allocation(s).
---------- New result in exitcode ----------
1

TEST FAILED on ts-sim-build-ba : demandelements container load color ( Last six runs Jun2022 )

---------- Differences in errors ----------
0a1,13
> 
> =================================================================
> ==2659846==ERROR: LeakSanitizer: detected memory leaks
> 
> Direct leak of 48 byte(s) in 2 object(s) allocated from:
>     #0 0x55035d in operator new(unsigned long) (/home/delphi/clangDebug/sumo/bin/sumoD+0x55035d)
>     #1 0x92a9ab in MSRouteHandler::addContainer(SUMOSAXAttributes const&) /home/delphi/clangDebug/sumo/src/microsim/MSRouteHandler.cpp:1515:33
>     #2 0x2e996ff in SUMORouteHandler::myStartElement(int, SUMOSAXAttributes const&) /home/delphi/clangDebug/sumo/src/utils/vehicle/SUMORouteHandler.cpp:111:13
>     #3 0x8bcdb1 in MSRouteHandler::myStartElement(int, SUMOSAXAttributes const&) /home/delphi/clangDebug/sumo/src/microsim/MSRouteHandler.cpp:192:27
>     #4 0x307c9d3 in GenericSAXHandler::startElement(char16_t const*, char16_t const*, char16_t const*, xercesc_3_2::Attributes const&) /home/delphi/clangDebug/sumo/src/utils/xml/GenericSAXHandler.cpp:128:9
>     #5 0x7f5fc631b5ae in xercesc_3_2::SAX2XMLReaderImpl::startElement(xercesc_3_2::XMLElementDecl const&, unsigned int, char16_t const*, xercesc_3_2::RefVectorOf<xercesc_3_2::XMLAttr> const&, unsigned long, bool, bool) (/usr/lib/x86_64-linux-gnu/libxerces-c-3.2.so+0x2135ae)
> 
> SUMMARY: AddressSanitizer: 48 byte(s) leaked in 2 allocation(s).
---------- New result in exitcode ----------
1

TEST FAILED on ts-sim-build-ba : demandelements container load default ( Last six runs Jun2022 )

---------- Differences in errors ----------
0a1,13
> 
> =================================================================
> ==2659818==ERROR: LeakSanitizer: detected memory leaks
> 
> Direct leak of 24 byte(s) in 1 object(s) allocated from:
>     #0 0x55035d in operator new(unsigned long) (/home/delphi/clangDebug/sumo/bin/sumoD+0x55035d)
>     #1 0x92a9ab in MSRouteHandler::addContainer(SUMOSAXAttributes const&) /home/delphi/clangDebug/sumo/src/microsim/MSRouteHandler.cpp:1515:33
>     #2 0x2e996ff in SUMORouteHandler::myStartElement(int, SUMOSAXAttributes const&) /home/delphi/clangDebug/sumo/src/utils/vehicle/SUMORouteHandler.cpp:111:13
>     #3 0x8bcdb1 in MSRouteHandler::myStartElement(int, SUMOSAXAttributes const&) /home/delphi/clangDebug/sumo/src/microsim/MSRouteHandler.cpp:192:27
>     #4 0x307c9d3 in GenericSAXHandler::startElement(char16_t const*, char16_t const*, char16_t const*, xercesc_3_2::Attributes const&) /home/delphi/clangDebug/sumo/src/utils/xml/GenericSAXHandler.cpp:128:9
>     #5 0x7f03d38475ae in xercesc_3_2::SAX2XMLReaderImpl::startElement(xercesc_3_2::XMLElementDecl const&, unsigned int, char16_t const*, xercesc_3_2::RefVectorOf<xercesc_3_2::XMLAttr> const&, unsigned long, bool, bool) (/usr/lib/x86_64-linux-gnu/libxerces-c-3.2.so+0x2135ae)
> 
> SUMMARY: AddressSanitizer: 24 byte(s) leaked in 1 allocation(s).
---------- New result in exitcode ----------
1

TEST FAILED on ts-sim-build-ba : demandelements container load depart ( Last six runs Jun2022 )

---------- Differences in errors ----------
0a1,13
> 
> =================================================================
> ==2659853==ERROR: LeakSanitizer: detected memory leaks
> 
> Direct leak of 48 byte(s) in 2 object(s) allocated from:
>     #0 0x55035d in operator new(unsigned long) (/home/delphi/clangDebug/sumo/bin/sumoD+0x55035d)
>     #1 0x92a9ab in MSRouteHandler::addContainer(SUMOSAXAttributes const&) /home/delphi/clangDebug/sumo/src/microsim/MSRouteHandler.cpp:1515:33
>     #2 0x2e996ff in SUMORouteHandler::myStartElement(int, SUMOSAXAttributes const&) /home/delphi/clangDebug/sumo/src/utils/vehicle/SUMORouteHandler.cpp:111:13
>     #3 0x8bcdb1 in MSRouteHandler::myStartElement(int, SUMOSAXAttributes const&) /home/delphi/clangDebug/sumo/src/microsim/MSRouteHandler.cpp:192:27
>     #4 0x307c9d3 in GenericSAXHandler::startElement(char16_t const*, char16_t const*, char16_t const*, xercesc_3_2::Attributes const&) /home/delphi/clangDebug/sumo/src/utils/xml/GenericSAXHandler.cpp:128:9
>     #5 0x7f87c4c265ae in xercesc_3_2::SAX2XMLReaderImpl::startElement(xercesc_3_2::XMLElementDecl const&, unsigned int, char16_t const*, xercesc_3_2::RefVectorOf<xercesc_3_2::XMLAttr> const&, unsigned long, bool, bool) (/usr/lib/x86_64-linux-gnu/libxerces-c-3.2.so+0x2135ae)
> 
> SUMMARY: AddressSanitizer: 48 byte(s) leaked in 2 allocation(s).
---------- New result in exitcode ----------
1

TEST FAILED on ts-sim-build-ba : demandelements container load parameters ( Last six runs Jun2022 )

---------- Differences in errors ----------
0a1,13
> 
> =================================================================
> ==2659866==ERROR: LeakSanitizer: detected memory leaks
> 
> Direct leak of 24 byte(s) in 1 object(s) allocated from:
>     #0 0x55035d in operator new(unsigned long) (/home/delphi/clangDebug/sumo/bin/sumoD+0x55035d)
>     #1 0x92a9ab in MSRouteHandler::addContainer(SUMOSAXAttributes const&) /home/delphi/clangDebug/sumo/src/microsim/MSRouteHandler.cpp:1515:33
>     #2 0x2e996ff in SUMORouteHandler::myStartElement(int, SUMOSAXAttributes const&) /home/delphi/clangDebug/sumo/src/utils/vehicle/SUMORouteHandler.cpp:111:13
>     #3 0x8bcdb1 in MSRouteHandler::myStartElement(int, SUMOSAXAttributes const&) /home/delphi/clangDebug/sumo/src/microsim/MSRouteHandler.cpp:192:27
>     #4 0x307c9d3 in GenericSAXHandler::startElement(char16_t const*, char16_t const*, char16_t const*, xercesc_3_2::Attributes const&) /home/delphi/clangDebug/sumo/src/utils/xml/GenericSAXHandler.cpp:128:9
>     #5 0x7f378cb325ae in xercesc_3_2::SAX2XMLReaderImpl::startElement(xercesc_3_2::XMLElementDecl const&, unsigned int, char16_t const*, xercesc_3_2::RefVectorOf<xercesc_3_2::XMLAttr> const&, unsigned long, bool, bool) (/usr/lib/x86_64-linux-gnu/libxerces-c-3.2.so+0x2135ae)
> 
> SUMMARY: AddressSanitizer: 24 byte(s) leaked in 1 allocation(s).
---------- New result in exitcode ----------
1

TEST FAILED on ts-sim-build-ba : demandelements container load type ( Last six runs Jun2022 )

---------- Differences in errors ----------
0a1,13
> 
> =================================================================
> ==2659843==ERROR: LeakSanitizer: detected memory leaks
> 
> Direct leak of 48 byte(s) in 2 object(s) allocated from:
>     #0 0x55035d in operator new(unsigned long) (/home/delphi/clangDebug/sumo/bin/sumoD+0x55035d)
>     #1 0x92a9ab in MSRouteHandler::addContainer(SUMOSAXAttributes const&) /home/delphi/clangDebug/sumo/src/microsim/MSRouteHandler.cpp:1515:33
>     #2 0x2e996ff in SUMORouteHandler::myStartElement(int, SUMOSAXAttributes const&) /home/delphi/clangDebug/sumo/src/utils/vehicle/SUMORouteHandler.cpp:111:13
>     #3 0x8bcdb1 in MSRouteHandler::myStartElement(int, SUMOSAXAttributes const&) /home/delphi/clangDebug/sumo/src/microsim/MSRouteHandler.cpp:192:27
>     #4 0x307c9d3 in GenericSAXHandler::startElement(char16_t const*, char16_t const*, char16_t const*, xercesc_3_2::Attributes const&) /home/delphi/clangDebug/sumo/src/utils/xml/GenericSAXHandler.cpp:128:9
>     #5 0x7ff91e7eb5ae in xercesc_3_2::SAX2XMLReaderImpl::startElement(xercesc_3_2::XMLElementDecl const&, unsigned int, char16_t const*, xercesc_3_2::RefVectorOf<xercesc_3_2::XMLAttr> const&, unsigned long, bool, bool) (/usr/lib/x86_64-linux-gnu/libxerces-c-3.2.so+0x2135ae)
> 
> SUMMARY: AddressSanitizer: 48 byte(s) leaked in 2 allocation(s).
---------- New result in exitcode ----------
1

TEST FAILED on ts-sim-build-ba : demandelements person create color ( Last six runs Jun2022 )

---------- Differences in errors ----------
0a1,13
> 
> =================================================================
> ==2658940==ERROR: LeakSanitizer: detected memory leaks
> 
> Direct leak of 48 byte(s) in 2 object(s) allocated from:
>     #0 0x55035d in operator new(unsigned long) (/home/delphi/clangDebug/sumo/bin/sumoD+0x55035d)
>     #1 0x92967b in MSRouteHandler::addPerson(SUMOSAXAttributes const&) /home/delphi/clangDebug/sumo/src/microsim/MSRouteHandler.cpp:1507:33
>     #2 0x2e98ffb in SUMORouteHandler::myStartElement(int, SUMOSAXAttributes const&) /home/delphi/clangDebug/sumo/src/utils/vehicle/SUMORouteHandler.cpp:102:13
>     #3 0x8bcdb1 in MSRouteHandler::myStartElement(int, SUMOSAXAttributes const&) /home/delphi/clangDebug/sumo/src/microsim/MSRouteHandler.cpp:192:27
>     #4 0x307c9d3 in GenericSAXHandler::startElement(char16_t const*, char16_t const*, char16_t const*, xercesc_3_2::Attributes const&) /home/delphi/clangDebug/sumo/src/utils/xml/GenericSAXHandler.cpp:128:9
>     #5 0x7f389a26f5ae in xercesc_3_2::SAX2XMLReaderImpl::startElement(xercesc_3_2::XMLElementDecl const&, unsigned int, char16_t const*, xercesc_3_2::RefVectorOf<xercesc_3_2::XMLAttr> const&, unsigned long, bool, bool) (/usr/lib/x86_64-linux-gnu/libxerces-c-3.2.so+0x2135ae)
> 
> SUMMARY: AddressSanitizer: 48 byte(s) leaked in 2 allocation(s).
---------- New result in exitcode ----------
1

TEST FAILED on ts-sim-build-ba : demandelements person create default_ride default_ride_busstop ( Last six runs Jun2022 )

---------- Differences in errors ----------
1a2,14
> 
> =================================================================
> ==2658913==ERROR: LeakSanitizer: detected memory leaks
> 
> Direct leak of 24 byte(s) in 1 object(s) allocated from:
>     #0 0x55035d in operator new(unsigned long) (/home/delphi/clangDebug/sumo/bin/sumoD+0x55035d)
>     #1 0x92967b in MSRouteHandler::addPerson(SUMOSAXAttributes const&) /home/delphi/clangDebug/sumo/src/microsim/MSRouteHandler.cpp:1507:33
>     #2 0x2e98ffb in SUMORouteHandler::myStartElement(int, SUMOSAXAttributes const&) /home/delphi/clangDebug/sumo/src/utils/vehicle/SUMORouteHandler.cpp:102:13
>     #3 0x8bcdb1 in MSRouteHandler::myStartElement(int, SUMOSAXAttributes const&) /home/delphi/clangDebug/sumo/src/microsim/MSRouteHandler.cpp:192:27
>     #4 0x307c9d3 in GenericSAXHandler::startElement(char16_t const*, char16_t const*, char16_t const*, xercesc_3_2::Attributes const&) /home/delphi/clangDebug/sumo/src/utils/xml/GenericSAXHandler.cpp:128:9
>     #5 0x7f71430cd5ae in xercesc_3_2::SAX2XMLReaderImpl::startElement(xercesc_3_2::XMLElementDecl const&, unsigned int, char16_t const*, xercesc_3_2::RefVectorOf<xercesc_3_2::XMLAttr> const&, unsigned long, bool, bool) (/usr/lib/x86_64-linux-gnu/libxerces-c-3.2.so+0x2135ae)
> 
> SUMMARY: AddressSanitizer: 24 byte(s) leaked in 1 allocation(s).
---------- New result in exitcode ----------
1

TEST FAILED on ts-sim-build-ba : demandelements person create default_ride default_ride_fromto ( Last six runs Jun2022 )

---------- Differences in errors ----------
1a2,14
> 
> =================================================================
> ==2658912==ERROR: LeakSanitizer: detected memory leaks
> 
> Direct leak of 24 byte(s) in 1 object(s) allocated from:
>     #0 0x55035d in operator new(unsigned long) (/home/delphi/clangDebug/sumo/bin/sumoD+0x55035d)
>     #1 0x92967b in MSRouteHandler::addPerson(SUMOSAXAttributes const&) /home/delphi/clangDebug/sumo/src/microsim/MSRouteHandler.cpp:1507:33
>     #2 0x2e98ffb in SUMORouteHandler::myStartElement(int, SUMOSAXAttributes const&) /home/delphi/clangDebug/sumo/src/utils/vehicle/SUMORouteHandler.cpp:102:13
>     #3 0x8bcdb1 in MSRouteHandler::myStartElement(int, SUMOSAXAttributes const&) /home/delphi/clangDebug/sumo/src/microsim/MSRouteHandler.cpp:192:27
>     #4 0x307c9d3 in GenericSAXHandler::startElement(char16_t const*, char16_t const*, char16_t const*, xercesc_3_2::Attributes const&) /home/delphi/clangDebug/sumo/src/utils/xml/GenericSAXHandler.cpp:128:9
>     #5 0x7fbb317c35ae in xercesc_3_2::SAX2XMLReaderImpl::startElement(xercesc_3_2::XMLElementDecl const&, unsigned int, char16_t const*, xercesc_3_2::RefVectorOf<xercesc_3_2::XMLAttr> const&, unsigned long, bool, bool) (/usr/lib/x86_64-linux-gnu/libxerces-c-3.2.so+0x2135ae)
> 
> SUMMARY: AddressSanitizer: 24 byte(s) leaked in 1 allocation(s).
---------- New result in exitcode ----------
1

TEST FAILED on ts-sim-build-ba : demandelements person create default_stop default_stop_busstop ( Last six runs Jun2022 )

---------- Differences in errors ----------
0a1,13
> 
> =================================================================
> ==2658931==ERROR: LeakSanitizer: detected memory leaks
> 
> Direct leak of 24 byte(s) in 1 object(s) allocated from:
>     #0 0x55035d in operator new(unsigned long) (/home/delphi/clangDebug/sumo/bin/sumoD+0x55035d)
>     #1 0x92967b in MSRouteHandler::addPerson(SUMOSAXAttributes const&) /home/delphi/clangDebug/sumo/src/microsim/MSRouteHandler.cpp:1507:33
>     #2 0x2e98ffb in SUMORouteHandler::myStartElement(int, SUMOSAXAttributes const&) /home/delphi/clangDebug/sumo/src/utils/vehicle/SUMORouteHandler.cpp:102:13
>     #3 0x8bcdb1 in MSRouteHandler::myStartElement(int, SUMOSAXAttributes const&) /home/delphi/clangDebug/sumo/src/microsim/MSRouteHandler.cpp:192:27
>     #4 0x307c9d3 in GenericSAXHandler::startElement(char16_t const*, char16_t const*, char16_t const*, xercesc_3_2::Attributes const&) /home/delphi/clangDebug/sumo/src/utils/xml/GenericSAXHandler.cpp:128:9
>     #5 0x7f41a4be05ae in xercesc_3_2::SAX2XMLReaderImpl::startElement(xercesc_3_2::XMLElementDecl const&, unsigned int, char16_t const*, xercesc_3_2::RefVectorOf<xercesc_3_2::XMLAttr> const&, unsigned long, bool, bool) (/usr/lib/x86_64-linux-gnu/libxerces-c-3.2.so+0x2135ae)
> 
> SUMMARY: AddressSanitizer: 24 byte(s) leaked in 1 allocation(s).
---------- New result in exitcode ----------
1

TEST FAILED on ts-sim-build-ba : demandelements person create default_stop default_stop_lane ( Last six runs Jun2022 )

---------- Differences in errors ----------
0a1,13
> 
> =================================================================
> ==2658925==ERROR: LeakSanitizer: detected memory leaks
> 
> Direct leak of 24 byte(s) in 1 object(s) allocated from:
>     #0 0x55035d in operator new(unsigned long) (/home/delphi/clangDebug/sumo/bin/sumoD+0x55035d)
>     #1 0x92967b in MSRouteHandler::addPerson(SUMOSAXAttributes const&) /home/delphi/clangDebug/sumo/src/microsim/MSRouteHandler.cpp:1507:33
>     #2 0x2e98ffb in SUMORouteHandler::myStartElement(int, SUMOSAXAttributes const&) /home/delphi/clangDebug/sumo/src/utils/vehicle/SUMORouteHandler.cpp:102:13
>     #3 0x8bcdb1 in MSRouteHandler::myStartElement(int, SUMOSAXAttributes const&) /home/delphi/clangDebug/sumo/src/microsim/MSRouteHandler.cpp:192:27
>     #4 0x307c9d3 in GenericSAXHandler::startElement(char16_t const*, char16_t const*, char16_t const*, xercesc_3_2::Attributes const&) /home/delphi/clangDebug/sumo/src/utils/xml/GenericSAXHandler.cpp:128:9
>     #5 0x7f4d19a6a5ae in xercesc_3_2::SAX2XMLReaderImpl::startElement(xercesc_3_2::XMLElementDecl const&, unsigned int, char16_t const*, xercesc_3_2::RefVectorOf<xercesc_3_2::XMLAttr> const&, unsigned long, bool, bool) (/usr/lib/x86_64-linux-gnu/libxerces-c-3.2.so+0x2135ae)
> 
> SUMMARY: AddressSanitizer: 24 byte(s) leaked in 1 allocation(s).
---------- New result in exitcode ----------
1

TEST FAILED on ts-sim-build-ba : demandelements person create default_trip default_trip_busstop ( Last six runs Jun2022 )

---------- Differences in errors ----------
0a1,13
> 
> =================================================================
> ==2658864==ERROR: LeakSanitizer: detected memory leaks
> 
> Direct leak of 24 byte(s) in 1 object(s) allocated from:
>     #0 0x55035d in operator new(unsigned long) (/home/delphi/clangDebug/sumo/bin/sumoD+0x55035d)
>     #1 0x92967b in MSRouteHandler::addPerson(SUMOSAXAttributes const&) /home/delphi/clangDebug/sumo/src/microsim/MSRouteHandler.cpp:1507:33
>     #2 0x2e98ffb in SUMORouteHandler::myStartElement(int, SUMOSAXAttributes const&) /home/delphi/clangDebug/sumo/src/utils/vehicle/SUMORouteHandler.cpp:102:13
>     #3 0x8bcdb1 in MSRouteHandler::myStartElement(int, SUMOSAXAttributes const&) /home/delphi/clangDebug/sumo/src/microsim/MSRouteHandler.cpp:192:27
>     #4 0x307c9d3 in GenericSAXHandler::startElement(char16_t const*, char16_t const*, char16_t const*, xercesc_3_2::Attributes const&) /home/delphi/clangDebug/sumo/src/utils/xml/GenericSAXHandler.cpp:128:9
>     #5 0x7f7a1fc0b5ae in xercesc_3_2::SAX2XMLReaderImpl::startElement(xercesc_3_2::XMLElementDecl const&, unsigned int, char16_t const*, xercesc_3_2::RefVectorOf<xercesc_3_2::XMLAttr> const&, unsigned long, bool, bool) (/usr/lib/x86_64-linux-gnu/libxerces-c-3.2.so+0x2135ae)
> 
> SUMMARY: AddressSanitizer: 24 byte(s) leaked in 1 allocation(s).
---------- New result in exitcode ----------
1

TEST FAILED on ts-sim-build-ba : demandelements person create default_trip default_trip_fromto ( Last six runs Jun2022 )

---------- Differences in errors ----------
0a1,13
> 
> =================================================================
> ==2658859==ERROR: LeakSanitizer: detected memory leaks
> 
> Direct leak of 24 byte(s) in 1 object(s) allocated from:
>     #0 0x55035d in operator new(unsigned long) (/home/delphi/clangDebug/sumo/bin/sumoD+0x55035d)
>     #1 0x92967b in MSRouteHandler::addPerson(SUMOSAXAttributes const&) /home/delphi/clangDebug/sumo/src/microsim/MSRouteHandler.cpp:1507:33
>     #2 0x2e98ffb in SUMORouteHandler::myStartElement(int, SUMOSAXAttributes const&) /home/delphi/clangDebug/sumo/src/utils/vehicle/SUMORouteHandler.cpp:102:13
>     #3 0x8bcdb1 in MSRouteHandler::myStartElement(int, SUMOSAXAttributes const&) /home/delphi/clangDebug/sumo/src/microsim/MSRouteHandler.cpp:192:27
>     #4 0x307c9d3 in GenericSAXHandler::startElement(char16_t const*, char16_t const*, char16_t const*, xercesc_3_2::Attributes const&) /home/delphi/clangDebug/sumo/src/utils/xml/GenericSAXHandler.cpp:128:9
>     #5 0x7fadf437d5ae in xercesc_3_2::SAX2XMLReaderImpl::startElement(xercesc_3_2::XMLElementDecl const&, unsigned int, char16_t const*, xercesc_3_2::RefVectorOf<xercesc_3_2::XMLAttr> const&, unsigned long, bool, bool) (/usr/lib/x86_64-linux-gnu/libxerces-c-3.2.so+0x2135ae)
> 
> SUMMARY: AddressSanitizer: 24 byte(s) leaked in 1 allocation(s).
---------- New result in exitcode ----------
1

TEST FAILED on ts-sim-build-ba : demandelements person create default_walk default_walk_busstop ( Last six runs Jun2022 )

---------- Differences in errors ----------
0a1,13
> 
> =================================================================
> ==2658893==ERROR: LeakSanitizer: detected memory leaks
> 
> Direct leak of 24 byte(s) in 1 object(s) allocated from:
>     #0 0x55035d in operator new(unsigned long) (/home/delphi/clangDebug/sumo/bin/sumoD+0x55035d)
>     #1 0x92967b in MSRouteHandler::addPerson(SUMOSAXAttributes const&) /home/delphi/clangDebug/sumo/src/microsim/MSRouteHandler.cpp:1507:33
>     #2 0x2e98ffb in SUMORouteHandler::myStartElement(int, SUMOSAXAttributes const&) /home/delphi/clangDebug/sumo/src/utils/vehicle/SUMORouteHandler.cpp:102:13
>     #3 0x8bcdb1 in MSRouteHandler::myStartElement(int, SUMOSAXAttributes const&) /home/delphi/clangDebug/sumo/src/microsim/MSRouteHandler.cpp:192:27
>     #4 0x307c9d3 in GenericSAXHandler::startElement(char16_t const*, char16_t const*, char16_t const*, xercesc_3_2::Attributes const&) /home/delphi/clangDebug/sumo/src/utils/xml/GenericSAXHandler.cpp:128:9
>     #5 0x7fb4d8e175ae in xercesc_3_2::SAX2XMLReaderImpl::startElement(xercesc_3_2::XMLElementDecl const&, unsigned int, char16_t const*, xercesc_3_2::RefVectorOf<xercesc_3_2::XMLAttr> const&, unsigned long, bool, bool) (/usr/lib/x86_64-linux-gnu/libxerces-c-3.2.so+0x2135ae)
> 
> SUMMARY: AddressSanitizer: 24 byte(s) leaked in 1 allocation(s).
---------- New result in exitcode ----------
1

TEST FAILED on ts-sim-build-ba : demandelements person create default_walk default_walk_edges ( Last six runs Jun2022 )

---------- Differences in errors ----------
0a1,13
> 
> =================================================================
> ==2658881==ERROR: LeakSanitizer: detected memory leaks
> 
> Direct leak of 24 byte(s) in 1 object(s) allocated from:
>     #0 0x55035d in operator new(unsigned long) (/home/delphi/clangDebug/sumo/bin/sumoD+0x55035d)
>     #1 0x92967b in MSRouteHandler::addPerson(SUMOSAXAttributes const&) /home/delphi/clangDebug/sumo/src/microsim/MSRouteHandler.cpp:1507:33
>     #2 0x2e98ffb in SUMORouteHandler::myStartElement(int, SUMOSAXAttributes const&) /home/delphi/clangDebug/sumo/src/utils/vehicle/SUMORouteHandler.cpp:102:13
>     #3 0x8bcdb1 in MSRouteHandler::myStartElement(int, SUMOSAXAttributes const&) /home/delphi/clangDebug/sumo/src/microsim/MSRouteHandler.cpp:192:27
>     #4 0x307c9d3 in GenericSAXHandler::startElement(char16_t const*, char16_t const*, char16_t const*, xercesc_3_2::Attributes const&) /home/delphi/clangDebug/sumo/src/utils/xml/GenericSAXHandler.cpp:128:9
>     #5 0x7fd4715025ae in xercesc_3_2::SAX2XMLReaderImpl::startElement(xercesc_3_2::XMLElementDecl const&, unsigned int, char16_t const*, xercesc_3_2::RefVectorOf<xercesc_3_2::XMLAttr> const&, unsigned long, bool, bool) (/usr/lib/x86_64-linux-gnu/libxerces-c-3.2.so+0x2135ae)
> 
> SUMMARY: AddressSanitizer: 24 byte(s) leaked in 1 allocation(s).
---------- New result in exitcode ----------
1

TEST FAILED on ts-sim-build-ba : demandelements person create default_walk default_walk_fromto ( Last six runs Jun2022 )

---------- Differences in errors ----------
0a1,13
> 
> =================================================================
> ==2658882==ERROR: LeakSanitizer: detected memory leaks
> 
> Direct leak of 24 byte(s) in 1 object(s) allocated from:
>     #0 0x55035d in operator new(unsigned long) (/home/delphi/clangDebug/sumo/bin/sumoD+0x55035d)
>     #1 0x92967b in MSRouteHandler::addPerson(SUMOSAXAttributes const&) /home/delphi/clangDebug/sumo/src/microsim/MSRouteHandler.cpp:1507:33
>     #2 0x2e98ffb in SUMORouteHandler::myStartElement(int, SUMOSAXAttributes const&) /home/delphi/clangDebug/sumo/src/utils/vehicle/SUMORouteHandler.cpp:102:13
>     #3 0x8bcdb1 in MSRouteHandler::myStartElement(int, SUMOSAXAttributes const&) /home/delphi/clangDebug/sumo/src/microsim/MSRouteHandler.cpp:192:27
>     #4 0x307c9d3 in GenericSAXHandler::startElement(char16_t const*, char16_t const*, char16_t const*, xercesc_3_2::Attributes const&) /home/delphi/clangDebug/sumo/src/utils/xml/GenericSAXHandler.cpp:128:9
>     #5 0x7f7d143275ae in xercesc_3_2::SAX2XMLReaderImpl::startElement(xercesc_3_2::XMLElementDecl const&, unsigned int, char16_t const*, xercesc_3_2::RefVectorOf<xercesc_3_2::XMLAttr> const&, unsigned long, bool, bool) (/usr/lib/x86_64-linux-gnu/libxerces-c-3.2.so+0x2135ae)
> 
> SUMMARY: AddressSanitizer: 24 byte(s) leaked in 1 allocation(s).
---------- New result in exitcode ----------
1

TEST FAILED on ts-sim-build-ba : demandelements person create default_walk default_walk_route ( Last six runs Jun2022 )

---------- Differences in errors ----------
0a1,13
> 
> =================================================================
> ==2658895==ERROR: LeakSanitizer: detected memory leaks
> 
> Direct leak of 24 byte(s) in 1 object(s) allocated from:
>     #0 0x55035d in operator new(unsigned long) (/home/delphi/clangDebug/sumo/bin/sumoD+0x55035d)
>     #1 0x92967b in MSRouteHandler::addPerson(SUMOSAXAttributes const&) /home/delphi/clangDebug/sumo/src/microsim/MSRouteHandler.cpp:1507:33
>     #2 0x2e98ffb in SUMORouteHandler::myStartElement(int, SUMOSAXAttributes const&) /home/delphi/clangDebug/sumo/src/utils/vehicle/SUMORouteHandler.cpp:102:13
>     #3 0x8bcdb1 in MSRouteHandler::myStartElement(int, SUMOSAXAttributes const&) /home/delphi/clangDebug/sumo/src/microsim/MSRouteHandler.cpp:192:27
>     #4 0x307c9d3 in GenericSAXHandler::startElement(char16_t const*, char16_t const*, char16_t const*, xercesc_3_2::Attributes const&) /home/delphi/clangDebug/sumo/src/utils/xml/GenericSAXHandler.cpp:128:9
>     #5 0x7f37ea0d85ae in xercesc_3_2::SAX2XMLReaderImpl::startElement(xercesc_3_2::XMLElementDecl const&, unsigned int, char16_t const*, xercesc_3_2::RefVectorOf<xercesc_3_2::XMLAttr> const&, unsigned long, bool, bool) (/usr/lib/x86_64-linux-gnu/libxerces-c-3.2.so+0x2135ae)
> 
> SUMMARY: AddressSanitizer: 24 byte(s) leaked in 1 allocation(s).
---------- New result in exitcode ----------
1

TEST FAILED on ts-sim-build-ba : demandelements person create depart ( Last six runs Jun2022 )

---------- Differences in errors ----------
0a1,13
> 
> =================================================================
> ==2658956==ERROR: LeakSanitizer: detected memory leaks
> 
> Direct leak of 24 byte(s) in 1 object(s) allocated from:
>     #0 0x55035d in operator new(unsigned long) (/home/delphi/clangDebug/sumo/bin/sumoD+0x55035d)
>     #1 0x92967b in MSRouteHandler::addPerson(SUMOSAXAttributes const&) /home/delphi/clangDebug/sumo/src/microsim/MSRouteHandler.cpp:1507:33
>     #2 0x2e98ffb in SUMORouteHandler::myStartElement(int, SUMOSAXAttributes const&) /home/delphi/clangDebug/sumo/src/utils/vehicle/SUMORouteHandler.cpp:102:13
>     #3 0x8bcdb1 in MSRouteHandler::myStartElement(int, SUMOSAXAttributes const&) /home/delphi/clangDebug/sumo/src/microsim/MSRouteHandler.cpp:192:27
>     #4 0x307c9d3 in GenericSAXHandler::startElement(char16_t const*, char16_t const*, char16_t const*, xercesc_3_2::Attributes const&) /home/delphi/clangDebug/sumo/src/utils/xml/GenericSAXHandler.cpp:128:9
>     #5 0x7fce4da575ae in xercesc_3_2::SAX2XMLReaderImpl::startElement(xercesc_3_2::XMLElementDecl const&, unsigned int, char16_t const*, xercesc_3_2::RefVectorOf<xercesc_3_2::XMLAttr> const&, unsigned long, bool, bool) (/usr/lib/x86_64-linux-gnu/libxerces-c-3.2.so+0x2135ae)
> 
> SUMMARY: AddressSanitizer: 24 byte(s) leaked in 1 allocation(s).
---------- New result in exitcode ----------
1

TEST FAILED on ts-sim-build-ba : demandelements person create departpos ( Last six runs Jun2022 )

---------- Differences in errors ----------
0a1,13
> 
> =================================================================
> ==2658949==ERROR: LeakSanitizer: detected memory leaks
> 
> Direct leak of 48 byte(s) in 2 object(s) allocated from:
>     #0 0x55035d in operator new(unsigned long) (/home/delphi/clangDebug/sumo/bin/sumoD+0x55035d)
>     #1 0x92967b in MSRouteHandler::addPerson(SUMOSAXAttributes const&) /home/delphi/clangDebug/sumo/src/microsim/MSRouteHandler.cpp:1507:33
>     #2 0x2e98ffb in SUMORouteHandler::myStartElement(int, SUMOSAXAttributes const&) /home/delphi/clangDebug/sumo/src/utils/vehicle/SUMORouteHandler.cpp:102:13
>     #3 0x8bcdb1 in MSRouteHandler::myStartElement(int, SUMOSAXAttributes const&) /home/delphi/clangDebug/sumo/src/microsim/MSRouteHandler.cpp:192:27
>     #4 0x307c9d3 in GenericSAXHandler::startElement(char16_t const*, char16_t const*, char16_t const*, xercesc_3_2::Attributes const&) /home/delphi/clangDebug/sumo/src/utils/xml/GenericSAXHandler.cpp:128:9
>     #5 0x7fce2026c5ae in xercesc_3_2::SAX2XMLReaderImpl::startElement(xercesc_3_2::XMLElementDecl const&, unsigned int, char16_t const*, xercesc_3_2::RefVectorOf<xercesc_3_2::XMLAttr> const&, unsigned long, bool, bool) (/usr/lib/x86_64-linux-gnu/libxerces-c-3.2.so+0x2135ae)
> 
> SUMMARY: AddressSanitizer: 48 byte(s) leaked in 2 allocation(s).
---------- New result in exitcode ----------
1

TEST FAILED on ts-sim-build-ba : demandelements person create id ( Last six runs Jun2022 )

---------- Differences in errors ----------
0a1,13
> 
> =================================================================
> ==2658932==ERROR: LeakSanitizer: detected memory leaks
> 
> Direct leak of 48 byte(s) in 2 object(s) allocated from:
>     #0 0x55035d in operator new(unsigned long) (/home/delphi/clangDebug/sumo/bin/sumoD+0x55035d)
>     #1 0x92967b in MSRouteHandler::addPerson(SUMOSAXAttributes const&) /home/delphi/clangDebug/sumo/src/microsim/MSRouteHandler.cpp:1507:33
>     #2 0x2e98ffb in SUMORouteHandler::myStartElement(int, SUMOSAXAttributes const&) /home/delphi/clangDebug/sumo/src/utils/vehicle/SUMORouteHandler.cpp:102:13
>     #3 0x8bcdb1 in MSRouteHandler::myStartElement(int, SUMOSAXAttributes const&) /home/delphi/clangDebug/sumo/src/microsim/MSRouteHandler.cpp:192:27
>     #4 0x307c9d3 in GenericSAXHandler::startElement(char16_t const*, char16_t const*, char16_t const*, xercesc_3_2::Attributes const&) /home/delphi/clangDebug/sumo/src/utils/xml/GenericSAXHandler.cpp:128:9
>     #5 0x7f123faf85ae in xercesc_3_2::SAX2XMLReaderImpl::startElement(xercesc_3_2::XMLElementDecl const&, unsigned int, char16_t const*, xercesc_3_2::RefVectorOf<xercesc_3_2::XMLAttr> const&, unsigned long, bool, bool) (/usr/lib/x86_64-linux-gnu/libxerces-c-3.2.so+0x2135ae)
> 
> SUMMARY: AddressSanitizer: 48 byte(s) leaked in 2 allocation(s).
---------- New result in exitcode ----------
1

TEST FAILED on ts-sim-build-ba : demandelements person inspect color ( Last six runs Jun2022 )

---------- Differences in errors ----------
0a1,13
> 
> =================================================================
> ==2658987==ERROR: LeakSanitizer: detected memory leaks
> 
> Direct leak of 24 byte(s) in 1 object(s) allocated from:
>     #0 0x55035d in operator new(unsigned long) (/home/delphi/clangDebug/sumo/bin/sumoD+0x55035d)
>     #1 0x92967b in MSRouteHandler::addPerson(SUMOSAXAttributes const&) /home/delphi/clangDebug/sumo/src/microsim/MSRouteHandler.cpp:1507:33
>     #2 0x2e98ffb in SUMORouteHandler::myStartElement(int, SUMOSAXAttributes const&) /home/delphi/clangDebug/sumo/src/utils/vehicle/SUMORouteHandler.cpp:102:13
>     #3 0x8bcdb1 in MSRouteHandler::myStartElement(int, SUMOSAXAttributes const&) /home/delphi/clangDebug/sumo/src/microsim/MSRouteHandler.cpp:192:27
>     #4 0x307c9d3 in GenericSAXHandler::startElement(char16_t const*, char16_t const*, char16_t const*, xercesc_3_2::Attributes const&) /home/delphi/clangDebug/sumo/src/utils/xml/GenericSAXHandler.cpp:128:9
>     #5 0x7fe50e3f65ae in xercesc_3_2::SAX2XMLReaderImpl::startElement(xercesc_3_2::XMLElementDecl const&, unsigned int, char16_t const*, xercesc_3_2::RefVectorOf<xercesc_3_2::XMLAttr> const&, unsigned long, bool, bool) (/usr/lib/x86_64-linux-gnu/libxerces-c-3.2.so+0x2135ae)
> 
> SUMMARY: AddressSanitizer: 24 byte(s) leaked in 1 allocation(s).
---------- New result in exitcode ----------
1

TEST FAILED on ts-sim-build-ba : demandelements person inspect depart float ( Last six runs Jun2022 )

---------- Differences in errors ----------
0a1,13
> 
> =================================================================
> ==2658996==ERROR: LeakSanitizer: detected memory leaks
> 
> Direct leak of 24 byte(s) in 1 object(s) allocated from:
>     #0 0x55035d in operator new(unsigned long) (/home/delphi/clangDebug/sumo/bin/sumoD+0x55035d)
>     #1 0x92967b in MSRouteHandler::addPerson(SUMOSAXAttributes const&) /home/delphi/clangDebug/sumo/src/microsim/MSRouteHandler.cpp:1507:33
>     #2 0x2e98ffb in SUMORouteHandler::myStartElement(int, SUMOSAXAttributes const&) /home/delphi/clangDebug/sumo/src/utils/vehicle/SUMORouteHandler.cpp:102:13
>     #3 0x8bcdb1 in MSRouteHandler::myStartElement(int, SUMOSAXAttributes const&) /home/delphi/clangDebug/sumo/src/microsim/MSRouteHandler.cpp:192:27
>     #4 0x307c9d3 in GenericSAXHandler::startElement(char16_t const*, char16_t const*, char16_t const*, xercesc_3_2::Attributes const&) /home/delphi/clangDebug/sumo/src/utils/xml/GenericSAXHandler.cpp:128:9
>     #5 0x7f5835bc55ae in xercesc_3_2::SAX2XMLReaderImpl::startElement(xercesc_3_2::XMLElementDecl const&, unsigned int, char16_t const*, xercesc_3_2::RefVectorOf<xercesc_3_2::XMLAttr> const&, unsigned long, bool, bool) (/usr/lib/x86_64-linux-gnu/libxerces-c-3.2.so+0x2135ae)
> 
> SUMMARY: AddressSanitizer: 24 byte(s) leaked in 1 allocation(s).
---------- New result in exitcode ----------
1

TEST FAILED on ts-sim-build-ba : demandelements person inspect depart triggered ( Last six runs Jun2022 )

---------- Differences in errors ----------
2a3,15
> 
> =================================================================
> ==2659005==ERROR: LeakSanitizer: detected memory leaks
> 
> Direct leak of 24 byte(s) in 1 object(s) allocated from:
>     #0 0x55035d in operator new(unsigned long) (/home/delphi/clangDebug/sumo/bin/sumoD+0x55035d)
>     #1 0x92967b in MSRouteHandler::addPerson(SUMOSAXAttributes const&) /home/delphi/clangDebug/sumo/src/microsim/MSRouteHandler.cpp:1507:33
>     #2 0x2e98ffb in SUMORouteHandler::myStartElement(int, SUMOSAXAttributes const&) /home/delphi/clangDebug/sumo/src/utils/vehicle/SUMORouteHandler.cpp:102:13
>     #3 0x8bcdb1 in MSRouteHandler::myStartElement(int, SUMOSAXAttributes const&) /home/delphi/clangDebug/sumo/src/microsim/MSRouteHandler.cpp:192:27
>     #4 0x307c9d3 in GenericSAXHandler::startElement(char16_t const*, char16_t const*, char16_t const*, xercesc_3_2::Attributes const&) /home/delphi/clangDebug/sumo/src/utils/xml/GenericSAXHandler.cpp:128:9
>     #5 0x7fadfba015ae in xercesc_3_2::SAX2XMLReaderImpl::startElement(xercesc_3_2::XMLElementDecl const&, unsigned int, char16_t const*, xercesc_3_2::RefVectorOf<xercesc_3_2::XMLAttr> const&, unsigned long, bool, bool) (/usr/lib/x86_64-linux-gnu/libxerces-c-3.2.so+0x2135ae)
> 
> SUMMARY: AddressSanitizer: 24 byte(s) leaked in 1 allocation(s).

TEST FAILED on ts-sim-build-ba : demandelements person inspect departpos ( Last six runs Jun2022 )

---------- Differences in errors ----------
0a1,13
> 
> =================================================================
> ==2658995==ERROR: LeakSanitizer: detected memory leaks
> 
> Direct leak of 24 byte(s) in 1 object(s) allocated from:
>     #0 0x55035d in operator new(unsigned long) (/home/delphi/clangDebug/sumo/bin/sumoD+0x55035d)
>     #1 0x92967b in MSRouteHandler::addPerson(SUMOSAXAttributes const&) /home/delphi/clangDebug/sumo/src/microsim/MSRouteHandler.cpp:1507:33
>     #2 0x2e98ffb in SUMORouteHandler::myStartElement(int, SUMOSAXAttributes const&) /home/delphi/clangDebug/sumo/src/utils/vehicle/SUMORouteHandler.cpp:102:13
>     #3 0x8bcdb1 in MSRouteHandler::myStartElement(int, SUMOSAXAttributes const&) /home/delphi/clangDebug/sumo/src/microsim/MSRouteHandler.cpp:192:27
>     #4 0x307c9d3 in GenericSAXHandler::startElement(char16_t const*, char16_t const*, char16_t const*, xercesc_3_2::Attributes const&) /home/delphi/clangDebug/sumo/src/utils/xml/GenericSAXHandler.cpp:128:9
>     #5 0x7f9f3c43c5ae in xercesc_3_2::SAX2XMLReaderImpl::startElement(xercesc_3_2::XMLElementDecl const&, unsigned int, char16_t const*, xercesc_3_2::RefVectorOf<xercesc_3_2::XMLAttr> const&, unsigned long, bool, bool) (/usr/lib/x86_64-linux-gnu/libxerces-c-3.2.so+0x2135ae)
> 
> SUMMARY: AddressSanitizer: 24 byte(s) leaked in 1 allocation(s).
---------- New result in exitcode ----------
1

TEST FAILED on ts-sim-build-ba : demandelements person inspect id ( Last six runs Jun2022 )

---------- Differences in errors ----------
0a1,13
> 
> =================================================================
> ==2658970==ERROR: LeakSanitizer: detected memory leaks
> 
> Direct leak of 48 byte(s) in 2 object(s) allocated from:
>     #0 0x55035d in operator new(unsigned long) (/home/delphi/clangDebug/sumo/bin/sumoD+0x55035d)
>     #1 0x92967b in MSRouteHandler::addPerson(SUMOSAXAttributes const&) /home/delphi/clangDebug/sumo/src/microsim/MSRouteHandler.cpp:1507:33
>     #2 0x2e98ffb in SUMORouteHandler::myStartElement(int, SUMOSAXAttributes const&) /home/delphi/clangDebug/sumo/src/utils/vehicle/SUMORouteHandler.cpp:102:13
>     #3 0x8bcdb1 in MSRouteHandler::myStartElement(int, SUMOSAXAttributes const&) /home/delphi/clangDebug/sumo/src/microsim/MSRouteHandler.cpp:192:27
>     #4 0x307c9d3 in GenericSAXHandler::startElement(char16_t const*, char16_t const*, char16_t const*, xercesc_3_2::Attributes const&) /home/delphi/clangDebug/sumo/src/utils/xml/GenericSAXHandler.cpp:128:9
>     #5 0x7fdba4f3d5ae in xercesc_3_2::SAX2XMLReaderImpl::startElement(xercesc_3_2::XMLElementDecl const&, unsigned int, char16_t const*, xercesc_3_2::RefVectorOf<xercesc_3_2::XMLAttr> const&, unsigned long, bool, bool) (/usr/lib/x86_64-linux-gnu/libxerces-c-3.2.so+0x2135ae)
> 
> SUMMARY: AddressSanitizer: 48 byte(s) leaked in 2 allocation(s).
---------- New result in exitcode ----------
1

TEST FAILED on ts-sim-build-ba : demandelements person inspect parameters ( Last six runs Jun2022 )

---------- Differences in errors ----------
0a1,13
> 
> =================================================================
> ==2659008==ERROR: LeakSanitizer: detected memory leaks
> 
> Direct leak of 24 byte(s) in 1 object(s) allocated from:
>     #0 0x55035d in operator new(unsigned long) (/home/delphi/clangDebug/sumo/bin/sumoD+0x55035d)
>     #1 0x92967b in MSRouteHandler::addPerson(SUMOSAXAttributes const&) /home/delphi/clangDebug/sumo/src/microsim/MSRouteHandler.cpp:1507:33
>     #2 0x2e98ffb in SUMORouteHandler::myStartElement(int, SUMOSAXAttributes const&) /home/delphi/clangDebug/sumo/src/utils/vehicle/SUMORouteHandler.cpp:102:13
>     #3 0x8bcdb1 in MSRouteHandler::myStartElement(int, SUMOSAXAttributes const&) /home/delphi/clangDebug/sumo/src/microsim/MSRouteHandler.cpp:192:27
>     #4 0x307c9d3 in GenericSAXHandler::startElement(char16_t const*, char16_t const*, char16_t const*, xercesc_3_2::Attributes const&) /home/delphi/clangDebug/sumo/src/utils/xml/GenericSAXHandler.cpp:128:9
>     #5 0x7f320cef35ae in xercesc_3_2::SAX2XMLReaderImpl::startElement(xercesc_3_2::XMLElementDecl const&, unsigned int, char16_t const*, xercesc_3_2::RefVectorOf<xercesc_3_2::XMLAttr> const&, unsigned long, bool, bool) (/usr/lib/x86_64-linux-gnu/libxerces-c-3.2.so+0x2135ae)
> 
> SUMMARY: AddressSanitizer: 24 byte(s) leaked in 1 allocation(s).
---------- New result in exitcode ----------
1

TEST FAILED on ts-sim-build-ba : demandelements person inspect type ( Last six runs Jun2022 )

---------- Differences in errors ----------
0a1,13
> 
> =================================================================
> ==2658980==ERROR: LeakSanitizer: detected memory leaks
> 
> Direct leak of 24 byte(s) in 1 object(s) allocated from:
>     #0 0x55035d in operator new(unsigned long) (/home/delphi/clangDebug/sumo/bin/sumoD+0x55035d)
>     #1 0x92967b in MSRouteHandler::addPerson(SUMOSAXAttributes const&) /home/delphi/clangDebug/sumo/src/microsim/MSRouteHandler.cpp:1507:33
>     #2 0x2e98ffb in SUMORouteHandler::myStartElement(int, SUMOSAXAttributes const&) /home/delphi/clangDebug/sumo/src/utils/vehicle/SUMORouteHandler.cpp:102:13
>     #3 0x8bcdb1 in MSRouteHandler::myStartElement(int, SUMOSAXAttributes const&) /home/delphi/clangDebug/sumo/src/microsim/MSRouteHandler.cpp:192:27
>     #4 0x307c9d3 in GenericSAXHandler::startElement(char16_t const*, char16_t const*, char16_t const*, xercesc_3_2::Attributes const&) /home/delphi/clangDebug/sumo/src/utils/xml/GenericSAXHandler.cpp:128:9
>     #5 0x7fbb67caa5ae in xercesc_3_2::SAX2XMLReaderImpl::startElement(xercesc_3_2::XMLElementDecl const&, unsigned int, char16_t const*, xercesc_3_2::RefVectorOf<xercesc_3_2::XMLAttr> const&, unsigned long, bool, bool) (/usr/lib/x86_64-linux-gnu/libxerces-c-3.2.so+0x2135ae)
> 
> SUMMARY: AddressSanitizer: 24 byte(s) leaked in 1 allocation(s).
---------- New result in exitcode ----------
1

TEST FAILED on ts-sim-build-ba : demandelements person inspect_selection color ( Last six runs Jun2022 )

---------- Differences in errors ----------
0a1,13
> 
> =================================================================
> ==2659022==ERROR: LeakSanitizer: detected memory leaks
> 
> Direct leak of 48 byte(s) in 2 object(s) allocated from:
>     #0 0x55035d in operator new(unsigned long) (/home/delphi/clangDebug/sumo/bin/sumoD+0x55035d)
>     #1 0x92967b in MSRouteHandler::addPerson(SUMOSAXAttributes const&) /home/delphi/clangDebug/sumo/src/microsim/MSRouteHandler.cpp:1507:33
>     #2 0x2e98ffb in SUMORouteHandler::myStartElement(int, SUMOSAXAttributes const&) /home/delphi/clangDebug/sumo/src/utils/vehicle/SUMORouteHandler.cpp:102:13
>     #3 0x8bcdb1 in MSRouteHandler::myStartElement(int, SUMOSAXAttributes const&) /home/delphi/clangDebug/sumo/src/microsim/MSRouteHandler.cpp:192:27
>     #4 0x307c9d3 in GenericSAXHandler::startElement(char16_t const*, char16_t const*, char16_t const*, xercesc_3_2::Attributes const&) /home/delphi/clangDebug/sumo/src/utils/xml/GenericSAXHandler.cpp:128:9
>     #5 0x7fdc34fda5ae in xercesc_3_2::SAX2XMLReaderImpl::startElement(xercesc_3_2::XMLElementDecl const&, unsigned int, char16_t const*, xercesc_3_2::RefVectorOf<xercesc_3_2::XMLAttr> const&, unsigned long, bool, bool) (/usr/lib/x86_64-linux-gnu/libxerces-c-3.2.so+0x2135ae)
> 
> SUMMARY: AddressSanitizer: 48 byte(s) leaked in 2 allocation(s).
---------- New result in exitcode ----------
1

TEST FAILED on ts-sim-build-ba : demandelements person inspect_selection depart float ( Last six runs Jun2022 )

---------- Differences in errors ----------
0a1,13
> 
> =================================================================
> ==2659042==ERROR: LeakSanitizer: detected memory leaks
> 
> Direct leak of 48 byte(s) in 2 object(s) allocated from:
>     #0 0x55035d in operator new(unsigned long) (/home/delphi/clangDebug/sumo/bin/sumoD+0x55035d)
>     #1 0x92967b in MSRouteHandler::addPerson(SUMOSAXAttributes const&) /home/delphi/clangDebug/sumo/src/microsim/MSRouteHandler.cpp:1507:33
>     #2 0x2e98ffb in SUMORouteHandler::myStartElement(int, SUMOSAXAttributes const&) /home/delphi/clangDebug/sumo/src/utils/vehicle/SUMORouteHandler.cpp:102:13
>     #3 0x8bcdb1 in MSRouteHandler::myStartElement(int, SUMOSAXAttributes const&) /home/delphi/clangDebug/sumo/src/microsim/MSRouteHandler.cpp:192:27
>     #4 0x307c9d3 in GenericSAXHandler::startElement(char16_t const*, char16_t const*, char16_t const*, xercesc_3_2::Attributes const&) /home/delphi/clangDebug/sumo/src/utils/xml/GenericSAXHandler.cpp:128:9
>     #5 0x7fd7299c25ae in xercesc_3_2::SAX2XMLReaderImpl::startElement(xercesc_3_2::XMLElementDecl const&, unsigned int, char16_t const*, xercesc_3_2::RefVectorOf<xercesc_3_2::XMLAttr> const&, unsigned long, bool, bool) (/usr/lib/x86_64-linux-gnu/libxerces-c-3.2.so+0x2135ae)
> 
> SUMMARY: AddressSanitizer: 48 byte(s) leaked in 2 allocation(s).
---------- New result in exitcode ----------
1

TEST FAILED on ts-sim-build-ba : demandelements person inspect_selection depart triggered ( Last six runs Jun2022 )

---------- Differences in errors ----------
2a3,15
> 
> =================================================================
> ==2659049==ERROR: LeakSanitizer: detected memory leaks
> 
> Direct leak of 24 byte(s) in 1 object(s) allocated from:
>     #0 0x55035d in operator new(unsigned long) (/home/delphi/clangDebug/sumo/bin/sumoD+0x55035d)
>     #1 0x92967b in MSRouteHandler::addPerson(SUMOSAXAttributes const&) /home/delphi/clangDebug/sumo/src/microsim/MSRouteHandler.cpp:1507:33
>     #2 0x2e98ffb in SUMORouteHandler::myStartElement(int, SUMOSAXAttributes const&) /home/delphi/clangDebug/sumo/src/utils/vehicle/SUMORouteHandler.cpp:102:13
>     #3 0x8bcdb1 in MSRouteHandler::myStartElement(int, SUMOSAXAttributes const&) /home/delphi/clangDebug/sumo/src/microsim/MSRouteHandler.cpp:192:27
>     #4 0x307c9d3 in GenericSAXHandler::startElement(char16_t const*, char16_t const*, char16_t const*, xercesc_3_2::Attributes const&) /home/delphi/clangDebug/sumo/src/utils/xml/GenericSAXHandler.cpp:128:9
>     #5 0x7f7cdcfd15ae in xercesc_3_2::SAX2XMLReaderImpl::startElement(xercesc_3_2::XMLElementDecl const&, unsigned int, char16_t const*, xercesc_3_2::RefVectorOf<xercesc_3_2::XMLAttr> const&, unsigned long, bool, bool) (/usr/lib/x86_64-linux-gnu/libxerces-c-3.2.so+0x2135ae)
> 
> SUMMARY: AddressSanitizer: 24 byte(s) leaked in 1 allocation(s).

TEST FAILED on ts-sim-build-ba : demandelements person inspect_selection departpos ( Last six runs Jun2022 )

---------- Differences in errors ----------
0a1,13
> 
> =================================================================
> ==2659030==ERROR: LeakSanitizer: detected memory leaks
> 
> Direct leak of 48 byte(s) in 2 object(s) allocated from:
>     #0 0x55035d in operator new(unsigned long) (/home/delphi/clangDebug/sumo/bin/sumoD+0x55035d)
>     #1 0x92967b in MSRouteHandler::addPerson(SUMOSAXAttributes const&) /home/delphi/clangDebug/sumo/src/microsim/MSRouteHandler.cpp:1507:33
>     #2 0x2e98ffb in SUMORouteHandler::myStartElement(int, SUMOSAXAttributes const&) /home/delphi/clangDebug/sumo/src/utils/vehicle/SUMORouteHandler.cpp:102:13
>     #3 0x8bcdb1 in MSRouteHandler::myStartElement(int, SUMOSAXAttributes const&) /home/delphi/clangDebug/sumo/src/microsim/MSRouteHandler.cpp:192:27
>     #4 0x307c9d3 in GenericSAXHandler::startElement(char16_t const*, char16_t const*, char16_t const*, xercesc_3_2::Attributes const&) /home/delphi/clangDebug/sumo/src/utils/xml/GenericSAXHandler.cpp:128:9
>     #5 0x7fda909765ae in xercesc_3_2::SAX2XMLReaderImpl::startElement(xercesc_3_2::XMLElementDecl const&, unsigned int, char16_t const*, xercesc_3_2::RefVectorOf<xercesc_3_2::XMLAttr> const&, unsigned long, bool, bool) (/usr/lib/x86_64-linux-gnu/libxerces-c-3.2.so+0x2135ae)
> 
> SUMMARY: AddressSanitizer: 48 byte(s) leaked in 2 allocation(s).
---------- New result in exitcode ----------
1

TEST FAILED on ts-sim-build-ba : demandelements person inspect_selection parameters ( Last six runs Jun2022 )

---------- Differences in errors ----------
0a1,13
> 
> =================================================================
> ==2659056==ERROR: LeakSanitizer: detected memory leaks
> 
> Direct leak of 48 byte(s) in 2 object(s) allocated from:
>     #0 0x55035d in operator new(unsigned long) (/home/delphi/clangDebug/sumo/bin/sumoD+0x55035d)
>     #1 0x92967b in MSRouteHandler::addPerson(SUMOSAXAttributes const&) /home/delphi/clangDebug/sumo/src/microsim/MSRouteHandler.cpp:1507:33
>     #2 0x2e98ffb in SUMORouteHandler::myStartElement(int, SUMOSAXAttributes const&) /home/delphi/clangDebug/sumo/src/utils/vehicle/SUMORouteHandler.cpp:102:13
>     #3 0x8bcdb1 in MSRouteHandler::myStartElement(int, SUMOSAXAttributes const&) /home/delphi/clangDebug/sumo/src/microsim/MSRouteHandler.cpp:192:27
>     #4 0x307c9d3 in GenericSAXHandler::startElement(char16_t const*, char16_t const*, char16_t const*, xercesc_3_2::Attributes const&) /home/delphi/clangDebug/sumo/src/utils/xml/GenericSAXHandler.cpp:128:9
>     #5 0x7fe6cd0495ae in xercesc_3_2::SAX2XMLReaderImpl::startElement(xercesc_3_2::XMLElementDecl const&, unsigned int, char16_t const*, xercesc_3_2::RefVectorOf<xercesc_3_2::XMLAttr> const&, unsigned long, bool, bool) (/usr/lib/x86_64-linux-gnu/libxerces-c-3.2.so+0x2135ae)
> 
> SUMMARY: AddressSanitizer: 48 byte(s) leaked in 2 allocation(s).
---------- New result in exitcode ----------
1

TEST FAILED on ts-sim-build-ba : demandelements person inspect_selection type ( Last six runs Jun2022 )

---------- Differences in errors ----------
2a3
> sumo: /home/delphi/clangDebug/sumo/src/microsim/transportables/MSPModel_Striping.cpp:1819: bool MSPModel_Striping::PState::moveToNextLane(SUMOTime): Assertion `OptionsCont::getOptions().getBool("ignore-route-errors")' failed.
---------- New result in exitcode ----------
-6

TEST FAILED on ts-sim-build-ba : demandelements person load color ( Last six runs Jun2022 )

---------- Differences in errors ----------
0a1,13
> 
> =================================================================
> ==2659089==ERROR: LeakSanitizer: detected memory leaks
> 
> Direct leak of 48 byte(s) in 2 object(s) allocated from:
>     #0 0x55035d in operator new(unsigned long) (/home/delphi/clangDebug/sumo/bin/sumoD+0x55035d)
>     #1 0x92967b in MSRouteHandler::addPerson(SUMOSAXAttributes const&) /home/delphi/clangDebug/sumo/src/microsim/MSRouteHandler.cpp:1507:33
>     #2 0x2e98ffb in SUMORouteHandler::myStartElement(int, SUMOSAXAttributes const&) /home/delphi/clangDebug/sumo/src/utils/vehicle/SUMORouteHandler.cpp:102:13
>     #3 0x8bcdb1 in MSRouteHandler::myStartElement(int, SUMOSAXAttributes const&) /home/delphi/clangDebug/sumo/src/microsim/MSRouteHandler.cpp:192:27
>     #4 0x307c9d3 in GenericSAXHandler::startElement(char16_t const*, char16_t const*, char16_t const*, xercesc_3_2::Attributes const&) /home/delphi/clangDebug/sumo/src/utils/xml/GenericSAXHandler.cpp:128:9
>     #5 0x7fec7889c5ae in xercesc_3_2::SAX2XMLReaderImpl::startElement(xercesc_3_2::XMLElementDecl const&, unsigned int, char16_t const*, xercesc_3_2::RefVectorOf<xercesc_3_2::XMLAttr> const&, unsigned long, bool, bool) (/usr/lib/x86_64-linux-gnu/libxerces-c-3.2.so+0x2135ae)
> 
> SUMMARY: AddressSanitizer: 48 byte(s) leaked in 2 allocation(s).
---------- New result in exitcode ----------
1

TEST FAILED on ts-sim-build-ba : demandelements person load default ( Last six runs Jun2022 )

---------- Differences in errors ----------
0a1,13
> 
> =================================================================
> ==2659059==ERROR: LeakSanitizer: detected memory leaks
> 
> Direct leak of 24 byte(s) in 1 object(s) allocated from:
>     #0 0x55035d in operator new(unsigned long) (/home/delphi/clangDebug/sumo/bin/sumoD+0x55035d)
>     #1 0x92967b in MSRouteHandler::addPerson(SUMOSAXAttributes const&) /home/delphi/clangDebug/sumo/src/microsim/MSRouteHandler.cpp:1507:33
>     #2 0x2e98ffb in SUMORouteHandler::myStartElement(int, SUMOSAXAttributes const&) /home/delphi/clangDebug/sumo/src/utils/vehicle/SUMORouteHandler.cpp:102:13
>     #3 0x8bcdb1 in MSRouteHandler::myStartElement(int, SUMOSAXAttributes const&) /home/delphi/clangDebug/sumo/src/microsim/MSRouteHandler.cpp:192:27
>     #4 0x307c9d3 in GenericSAXHandler::startElement(char16_t const*, char16_t const*, char16_t const*, xercesc_3_2::Attributes const&) /home/delphi/clangDebug/sumo/src/utils/xml/GenericSAXHandler.cpp:128:9
>     #5 0x7fdcd5e595ae in xercesc_3_2::SAX2XMLReaderImpl::startElement(xercesc_3_2::XMLElementDecl const&, unsigned int, char16_t const*, xercesc_3_2::RefVectorOf<xercesc_3_2::XMLAttr> const&, unsigned long, bool, bool) (/usr/lib/x86_64-linux-gnu/libxerces-c-3.2.so+0x2135ae)
> 
> SUMMARY: AddressSanitizer: 24 byte(s) leaked in 1 allocation(s).
---------- New result in exitcode ----------
1

TEST FAILED on ts-sim-build-ba : demandelements person load depart ( Last six runs Jun2022 )

---------- Differences in errors ----------
0a1,13
> 
> =================================================================
> ==2659102==ERROR: LeakSanitizer: detected memory leaks
> 
> Direct leak of 48 byte(s) in 2 object(s) allocated from:
>     #0 0x55035d in operator new(unsigned long) (/home/delphi/clangDebug/sumo/bin/sumoD+0x55035d)
>     #1 0x92967b in MSRouteHandler::addPerson(SUMOSAXAttributes const&) /home/delphi/clangDebug/sumo/src/microsim/MSRouteHandler.cpp:1507:33
>     #2 0x2e98ffb in SUMORouteHandler::myStartElement(int, SUMOSAXAttributes const&) /home/delphi/clangDebug/sumo/src/utils/vehicle/SUMORouteHandler.cpp:102:13
>     #3 0x8bcdb1 in MSRouteHandler::myStartElement(int, SUMOSAXAttributes const&) /home/delphi/clangDebug/sumo/src/microsim/MSRouteHandler.cpp:192:27
>     #4 0x307c9d3 in GenericSAXHandler::startElement(char16_t const*, char16_t const*, char16_t const*, xercesc_3_2::Attributes const&) /home/delphi/clangDebug/sumo/src/utils/xml/GenericSAXHandler.cpp:128:9
>     #5 0x7f0cab5ba5ae in xercesc_3_2::SAX2XMLReaderImpl::startElement(xercesc_3_2::XMLElementDecl const&, unsigned int, char16_t const*, xercesc_3_2::RefVectorOf<xercesc_3_2::XMLAttr> const&, unsigned long, bool, bool) (/usr/lib/x86_64-linux-gnu/libxerces-c-3.2.so+0x2135ae)
> 
> SUMMARY: AddressSanitizer: 48 byte(s) leaked in 2 allocation(s).
---------- New result in exitcode ----------
1

TEST FAILED on ts-sim-build-ba : demandelements person load departpos ( Last six runs Jun2022 )

---------- Differences in errors ----------
0a1,13
> 
> =================================================================
> ==2659095==ERROR: LeakSanitizer: detected memory leaks
> 
> Direct leak of 96 byte(s) in 4 object(s) allocated from:
>     #0 0x55035d in operator new(unsigned long) (/home/delphi/clangDebug/sumo/bin/sumoD+0x55035d)
>     #1 0x92967b in MSRouteHandler::addPerson(SUMOSAXAttributes const&) /home/delphi/clangDebug/sumo/src/microsim/MSRouteHandler.cpp:1507:33
>     #2 0x2e98ffb in SUMORouteHandler::myStartElement(int, SUMOSAXAttributes const&) /home/delphi/clangDebug/sumo/src/utils/vehicle/SUMORouteHandler.cpp:102:13
>     #3 0x8bcdb1 in MSRouteHandler::myStartElement(int, SUMOSAXAttributes const&) /home/delphi/clangDebug/sumo/src/microsim/MSRouteHandler.cpp:192:27
>     #4 0x307c9d3 in GenericSAXHandler::startElement(char16_t const*, char16_t const*, char16_t const*, xercesc_3_2::Attributes const&) /home/delphi/clangDebug/sumo/src/utils/xml/GenericSAXHandler.cpp:128:9
>     #5 0x7f47514305ae in xercesc_3_2::SAX2XMLReaderImpl::startElement(xercesc_3_2::XMLElementDecl const&, unsigned int, char16_t const*, xercesc_3_2::RefVectorOf<xercesc_3_2::XMLAttr> const&, unsigned long, bool, bool) (/usr/lib/x86_64-linux-gnu/libxerces-c-3.2.so+0x2135ae)
> 
> SUMMARY: AddressSanitizer: 96 byte(s) leaked in 4 allocation(s).
---------- New result in exitcode ----------
1

TEST FAILED on ts-sim-build-ba : demandelements person load parameters ( Last six runs Jun2022 )

---------- Differences in errors ----------
0a1,13
> 
> =================================================================
> ==2659105==ERROR: LeakSanitizer: detected memory leaks
> 
> Direct leak of 24 byte(s) in 1 object(s) allocated from:
>     #0 0x55035d in operator new(unsigned long) (/home/delphi/clangDebug/sumo/bin/sumoD+0x55035d)
>     #1 0x92967b in MSRouteHandler::addPerson(SUMOSAXAttributes const&) /home/delphi/clangDebug/sumo/src/microsim/MSRouteHandler.cpp:1507:33
>     #2 0x2e98ffb in SUMORouteHandler::myStartElement(int, SUMOSAXAttributes const&) /home/delphi/clangDebug/sumo/src/utils/vehicle/SUMORouteHandler.cpp:102:13
>     #3 0x8bcdb1 in MSRouteHandler::myStartElement(int, SUMOSAXAttributes const&) /home/delphi/clangDebug/sumo/src/microsim/MSRouteHandler.cpp:192:27
>     #4 0x307c9d3 in GenericSAXHandler::startElement(char16_t const*, char16_t const*, char16_t const*, xercesc_3_2::Attributes const&) /home/delphi/clangDebug/sumo/src/utils/xml/GenericSAXHandler.cpp:128:9
>     #5 0x7f0a8b8d25ae in xercesc_3_2::SAX2XMLReaderImpl::startElement(xercesc_3_2::XMLElementDecl const&, unsigned int, char16_t const*, xercesc_3_2::RefVectorOf<xercesc_3_2::XMLAttr> const&, unsigned long, bool, bool) (/usr/lib/x86_64-linux-gnu/libxerces-c-3.2.so+0x2135ae)
> 
> SUMMARY: AddressSanitizer: 24 byte(s) leaked in 1 allocation(s).
---------- New result in exitcode ----------
1

TEST FAILED on ts-sim-build-ba : demandelements person load type ( Last six runs Jun2022 )

---------- Differences in errors ----------
1a2,14
> 
> =================================================================
> ==2659088==ERROR: LeakSanitizer: detected memory leaks
> 
> Direct leak of 48 byte(s) in 2 object(s) allocated from:
>     #0 0x55035d in operator new(unsigned long) (/home/delphi/clangDebug/sumo/bin/sumoD+0x55035d)
>     #1 0x92967b in MSRouteHandler::addPerson(SUMOSAXAttributes const&) /home/delphi/clangDebug/sumo/src/microsim/MSRouteHandler.cpp:1507:33
>     #2 0x2e98ffb in SUMORouteHandler::myStartElement(int, SUMOSAXAttributes const&) /home/delphi/clangDebug/sumo/src/utils/vehicle/SUMORouteHandler.cpp:102:13
>     #3 0x8bcdb1 in MSRouteHandler::myStartElement(int, SUMOSAXAttributes const&) /home/delphi/clangDebug/sumo/src/microsim/MSRouteHandler.cpp:192:27
>     #4 0x307c9d3 in GenericSAXHandler::startElement(char16_t const*, char16_t const*, char16_t const*, xercesc_3_2::Attributes const&) /home/delphi/clangDebug/sumo/src/utils/xml/GenericSAXHandler.cpp:128:9
>     #5 0x7fb942b855ae in xercesc_3_2::SAX2XMLReaderImpl::startElement(xercesc_3_2::XMLElementDecl const&, unsigned int, char16_t const*, xercesc_3_2::RefVectorOf<xercesc_3_2::XMLAttr> const&, unsigned long, bool, bool) (/usr/lib/x86_64-linux-gnu/libxerces-c-3.2.so+0x2135ae)
> 
> SUMMARY: AddressSanitizer: 48 byte(s) leaked in 2 allocation(s).
---------- New result in exitcode ----------
1

TEST FAILED on ts-sim-build-ba : demandelements personflow inspect_selection type ( Last six runs Jun2022 )

---------- Differences in errors ----------
1,26603c1
< Warning: Collision of person 'f_1.8' and person 'f_1.6', lane='gneE5_0', time=17.00.
< Warning: Collision of person 'f_1.6' and person 'f_1.14', lane='gneE5_0', time=18.00.
< Warning: Collision of person 'f_1.8' and person 'f_1.14', lane='gneE5_0', time=18.00.
< Warning: Collision of person 'f_1.8' and person 'f_1.6', lane='gneE5_0', time=18.00.
< Warning: Collision of person 'f_1.14' and person 'f_1.16', lane='gneE5_0', time=19.00.
< Warning: Collision of person 'f_1.6' and person 'f_1.14', lane='gneE5_0', time=19.00.
< Warning: Collision of person 'f_1.8' and person 'f_1.14', lane='gneE5_0', time=19.00.
< Warning: Collision of person 'f_1.8' and person 'f_1.6', lane='gneE5_0', time=19.00.
< Warning: Collision of person 'f_1.14' and person 'f_1.20', lane='gneE5_0', time=20.00.
< Warning: Collision of person 'f_1.6' and person 'f_1.14', lane='gneE5_0', time=20.00.
< Warning: Collision of person 'f_1.8' and person 'f_1.14', lane='gneE5_0', time=20.00.
< Warning: Collision of person 'f_1.8' and person 'f_1.6', lane='gneE5_0', time=20.00.
< Warning: Collision of person 'f_1.17' and person 'f_1.14', lane='gneE5_0', time=20.00.
< Warning: Collision of person 'f_1.17' and person 'f_1.6', lane='gneE5_0', time=20.00.
< Warning: Collision of person 'f_1.17' and person 'f_1.8', lane='gneE5_0', time=20.00.
< Warning: Collision of person 'f_1.14' and person 'f_1.22', lane='gneE5_0', time=21.00.
< Warning: Collision of person 'f_1.6' and person 'f_1.14', lane='gneE5_0', time=21.00.
< Warning: Collision of person 'f_1.6' and person 'f_1.23', lane='gneE5_0', time=21.00.
< Warning: Collision of person 'f_1.8' and person 'f_1.14', lane='gneE5_0', time=21.00.
< Warning: Collision of person 'f_1.8' and person 'f_1.23', lane='gneE5_0', time=21.00.
< Warning: Collision of person 'f_1.8' and person 'f_1.6', lane='gneE5_0', time=21.00.
< Warning: Collision of person 'f_1.17' and person 'f_1.14', lane='gneE5_0', time=21.00.
< Warning: Collision of person 'f_1.17' and person 'f_1.23', lane='gneE5_0', time=21.00.
< Warning: Collision of person 'f_1.17' and person 'f_1.6', lane='gneE5_0', time=21.00.
< Warning: Collision of person 'f_1.17' and person 'f_1.8', lane='gneE5_0', time=21.00.
< Warning: Collision of person 'f_1.23' and person 'f_1.14', lane='gneE5_0', time=22.00.
< Warning: Collision of person 'f_1.23' and person 'f_1.26', lane='gneE5_0', time=22.00.
< Warning: Collision of person 'f_1.6' and person 'f_1.14', lane='gneE5_0', time=22.00.
< Warning: Collision of person 'f_1.6' and person 'f_1.26', lane='gneE5_0', time=22.00.
<truncated after showing first 30 lines>
---------- New result in exitcode ----------
-6

TEST FAILED on ts-sim-build-ba : demandelements personflow load type ( Last six runs Jun2022 )

---------- Differences in errors ----------
0a1
> sumo: /home/delphi/clangDebug/sumo/src/microsim/transportables/MSPModel_Striping.cpp:1819: bool MSPModel_Striping::PState::moveToNextLane(SUMOTime): Assertion `OptionsCont::getOptions().getBool("ignore-route-errors")' failed.
---------- New result in exitcode ----------
-6

TEST FAILED on ts-sim-build-ba : demandelements vehicletype load carfollowingmodel_params cf_cc_c1 ( Last six runs Jun2022 )

---------- Differences in errors ----------
0a1,14
> 
> =================================================================
> ==2648450==ERROR: LeakSanitizer: detected memory leaks
> 
> Direct leak of 384 byte(s) in 4 object(s) allocated from:
>     #0 0x55035d in operator new(unsigned long) (/home/delphi/clangDebug/sumo/bin/sumoD+0x55035d)
>     #1 0x1989a0f in MSCFModel_CC::MSCFModel_CC(MSVehicleType const*) /home/delphi/clangDebug/sumo/src/microsim/cfmodels/MSCFModel_CC.cpp:70:21
>     #2 0xcb07a7 in MSVehicleType::build(SUMOVTypeParameter&) /home/delphi/clangDebug/sumo/src/microsim/MSVehicleType.cpp:361:43
>     #3 0x8f1f86 in MSRouteHandler::closeVType() /home/delphi/clangDebug/sumo/src/microsim/MSRouteHandler.cpp:898:30
>     #4 0x2e9fd87 in SUMORouteHandler::myEndElement(int) /home/delphi/clangDebug/sumo/src/utils/vehicle/SUMORouteHandler.cpp:238:13
>     #5 0x307e758 in GenericSAXHandler::endElement(char16_t const*, char16_t const*, char16_t const*) /home/delphi/clangDebug/sumo/src/utils/xml/GenericSAXHandler.cpp:167:9
>     #6 0x7f7bd92f9f52 in xercesc_3_2::SAX2XMLReaderImpl::endElement(xercesc_3_2::XMLElementDecl const&, unsigned int, bool, char16_t const*) (/usr/lib/x86_64-linux-gnu/libxerces-c-3.2.so+0x212f52)
> 
> SUMMARY: AddressSanitizer: 384 byte(s) leaked in 4 allocation(s).
---------- New result in exitcode ----------
1

TEST FAILED on ts-sim-build-ba : demandelements vehicletype load carfollowingmodel_params cf_cc_ccaccel ( Last six runs Jun2022 )

---------- Differences in errors ----------
0a1,14
> 
> =================================================================
> ==2648486==ERROR: LeakSanitizer: detected memory leaks
> 
> Direct leak of 384 byte(s) in 4 object(s) allocated from:
>     #0 0x55035d in operator new(unsigned long) (/home/delphi/clangDebug/sumo/bin/sumoD+0x55035d)
>     #1 0x1989a0f in MSCFModel_CC::MSCFModel_CC(MSVehicleType const*) /home/delphi/clangDebug/sumo/src/microsim/cfmodels/MSCFModel_CC.cpp:70:21
>     #2 0xcb07a7 in MSVehicleType::build(SUMOVTypeParameter&) /home/delphi/clangDebug/sumo/src/microsim/MSVehicleType.cpp:361:43
>     #3 0x8f1f86 in MSRouteHandler::closeVType() /home/delphi/clangDebug/sumo/src/microsim/MSRouteHandler.cpp:898:30
>     #4 0x2e9fd87 in SUMORouteHandler::myEndElement(int) /home/delphi/clangDebug/sumo/src/utils/vehicle/SUMORouteHandler.cpp:238:13
>     #5 0x307e758 in GenericSAXHandler::endElement(char16_t const*, char16_t const*, char16_t const*) /home/delphi/clangDebug/sumo/src/utils/xml/GenericSAXHandler.cpp:167:9
>     #6 0x7feb39399f52 in xercesc_3_2::SAX2XMLReaderImpl::endElement(xercesc_3_2::XMLElementDecl const&, unsigned int, bool, char16_t const*) (/usr/lib/x86_64-linux-gnu/libxerces-c-3.2.so+0x212f52)
> 
> SUMMARY: AddressSanitizer: 384 byte(s) leaked in 4 allocation(s).
---------- New result in exitcode ----------
1

TEST FAILED on ts-sim-build-ba : demandelements vehicletype load carfollowingmodel_params cf_cc_ccdecel ( Last six runs Jun2022 )

---------- Differences in errors ----------
0a1,14
> 
> =================================================================
> ==2648458==ERROR: LeakSanitizer: detected memory leaks
> 
> Direct leak of 384 byte(s) in 4 object(s) allocated from:
>     #0 0x55035d in operator new(unsigned long) (/home/delphi/clangDebug/sumo/bin/sumoD+0x55035d)
>     #1 0x1989a0f in MSCFModel_CC::MSCFModel_CC(MSVehicleType const*) /home/delphi/clangDebug/sumo/src/microsim/cfmodels/MSCFModel_CC.cpp:70:21
>     #2 0xcb07a7 in MSVehicleType::build(SUMOVTypeParameter&) /home/delphi/clangDebug/sumo/src/microsim/MSVehicleType.cpp:361:43
>     #3 0x8f1f86 in MSRouteHandler::closeVType() /home/delphi/clangDebug/sumo/src/microsim/MSRouteHandler.cpp:898:30
>     #4 0x2e9fd87 in SUMORouteHandler::myEndElement(int) /home/delphi/clangDebug/sumo/src/utils/vehicle/SUMORouteHandler.cpp:238:13
>     #5 0x307e758 in GenericSAXHandler::endElement(char16_t const*, char16_t const*, char16_t const*) /home/delphi/clangDebug/sumo/src/utils/xml/GenericSAXHandler.cpp:167:9
>     #6 0x7fdb432dcf52 in xercesc_3_2::SAX2XMLReaderImpl::endElement(xercesc_3_2::XMLElementDecl const&, unsigned int, bool, char16_t const*) (/usr/lib/x86_64-linux-gnu/libxerces-c-3.2.so+0x212f52)
> 
> SUMMARY: AddressSanitizer: 384 byte(s) leaked in 4 allocation(s).
---------- New result in exitcode ----------
1

TEST FAILED on ts-sim-build-ba : demandelements vehicletype load carfollowingmodel_params cf_cc_constspacing ( Last six runs Jun2022 )

---------- Differences in errors ----------
0a1,14
> 
> =================================================================
> ==2648460==ERROR: LeakSanitizer: detected memory leaks
> 
> Direct leak of 384 byte(s) in 4 object(s) allocated from:
>     #0 0x55035d in operator new(unsigned long) (/home/delphi/clangDebug/sumo/bin/sumoD+0x55035d)
>     #1 0x1989a0f in MSCFModel_CC::MSCFModel_CC(MSVehicleType const*) /home/delphi/clangDebug/sumo/src/microsim/cfmodels/MSCFModel_CC.cpp:70:21
>     #2 0xcb07a7 in MSVehicleType::build(SUMOVTypeParameter&) /home/delphi/clangDebug/sumo/src/microsim/MSVehicleType.cpp:361:43
>     #3 0x8f1f86 in MSRouteHandler::closeVType() /home/delphi/clangDebug/sumo/src/microsim/MSRouteHandler.cpp:898:30
>     #4 0x2e9fd87 in SUMORouteHandler::myEndElement(int) /home/delphi/clangDebug/sumo/src/utils/vehicle/SUMORouteHandler.cpp:238:13
>     #5 0x307e758 in GenericSAXHandler::endElement(char16_t const*, char16_t const*, char16_t const*) /home/delphi/clangDebug/sumo/src/utils/xml/GenericSAXHandler.cpp:167:9
>     #6 0x7fc09927bf52 in xercesc_3_2::SAX2XMLReaderImpl::endElement(xercesc_3_2::XMLElementDecl const&, unsigned int, bool, char16_t const*) (/usr/lib/x86_64-linux-gnu/libxerces-c-3.2.so+0x212f52)
> 
> SUMMARY: AddressSanitizer: 384 byte(s) leaked in 4 allocation(s).
---------- New result in exitcode ----------
1

TEST FAILED on ts-sim-build-ba : demandelements vehicletype load carfollowingmodel_params cf_cc_flatbed_d ( Last six runs Jun2022 )

---------- Differences in errors ----------
0a1,14
> 
> =================================================================
> ==2648545==ERROR: LeakSanitizer: detected memory leaks
> 
> Direct leak of 384 byte(s) in 4 object(s) allocated from:
>     #0 0x55035d in operator new(unsigned long) (/home/delphi/clangDebug/sumo/bin/sumoD+0x55035d)
>     #1 0x1989a0f in MSCFModel_CC::MSCFModel_CC(MSVehicleType const*) /home/delphi/clangDebug/sumo/src/microsim/cfmodels/MSCFModel_CC.cpp:70:21
>     #2 0xcb07a7 in MSVehicleType::build(SUMOVTypeParameter&) /home/delphi/clangDebug/sumo/src/microsim/MSVehicleType.cpp:361:43
>     #3 0x8f1f86 in MSRouteHandler::closeVType() /home/delphi/clangDebug/sumo/src/microsim/MSRouteHandler.cpp:898:30
>     #4 0x2e9fd87 in SUMORouteHandler::myEndElement(int) /home/delphi/clangDebug/sumo/src/utils/vehicle/SUMORouteHandler.cpp:238:13
>     #5 0x307e758 in GenericSAXHandler::endElement(char16_t const*, char16_t const*, char16_t const*) /home/delphi/clangDebug/sumo/src/utils/xml/GenericSAXHandler.cpp:167:9
>     #6 0x7f774b113f52 in xercesc_3_2::SAX2XMLReaderImpl::endElement(xercesc_3_2::XMLElementDecl const&, unsigned int, bool, char16_t const*) (/usr/lib/x86_64-linux-gnu/libxerces-c-3.2.so+0x212f52)
> 
> SUMMARY: AddressSanitizer: 384 byte(s) leaked in 4 allocation(s).
---------- New result in exitcode ----------
1

TEST FAILED on ts-sim-build-ba : demandelements vehicletype load carfollowingmodel_params cf_cc_flatbed_h ( Last six runs Jun2022 )

---------- Differences in errors ----------
0a1,14
> 
> =================================================================
> ==2648556==ERROR: LeakSanitizer: detected memory leaks
> 
> Direct leak of 384 byte(s) in 4 object(s) allocated from:
>     #0 0x55035d in operator new(unsigned long) (/home/delphi/clangDebug/sumo/bin/sumoD+0x55035d)
>     #1 0x1989a0f in MSCFModel_CC::MSCFModel_CC(MSVehicleType const*) /home/delphi/clangDebug/sumo/src/microsim/cfmodels/MSCFModel_CC.cpp:70:21
>     #2 0xcb07a7 in MSVehicleType::build(SUMOVTypeParameter&) /home/delphi/clangDebug/sumo/src/microsim/MSVehicleType.cpp:361:43
>     #3 0x8f1f86 in MSRouteHandler::closeVType() /home/delphi/clangDebug/sumo/src/microsim/MSRouteHandler.cpp:898:30
>     #4 0x2e9fd87 in SUMORouteHandler::myEndElement(int) /home/delphi/clangDebug/sumo/src/utils/vehicle/SUMORouteHandler.cpp:238:13
>     #5 0x307e758 in GenericSAXHandler::endElement(char16_t const*, char16_t const*, char16_t const*) /home/delphi/clangDebug/sumo/src/utils/xml/GenericSAXHandler.cpp:167:9
>     #6 0x7f3b17858f52 in xercesc_3_2::SAX2XMLReaderImpl::endElement(xercesc_3_2::XMLElementDecl const&, unsigned int, bool, char16_t const*) (/usr/lib/x86_64-linux-gnu/libxerces-c-3.2.so+0x212f52)
> 
> SUMMARY: AddressSanitizer: 384 byte(s) leaked in 4 allocation(s).
---------- New result in exitcode ----------
1

TEST FAILED on ts-sim-build-ba : demandelements vehicletype load carfollowingmodel_params cf_cc_flatbed_ka ( Last six runs Jun2022 )

---------- Differences in errors ----------
0a1,14
> 
> =================================================================
> ==2648523==ERROR: LeakSanitizer: detected memory leaks
> 
> Direct leak of 384 byte(s) in 4 object(s) allocated from:
>     #0 0x55035d in operator new(unsigned long) (/home/delphi/clangDebug/sumo/bin/sumoD+0x55035d)
>     #1 0x1989a0f in MSCFModel_CC::MSCFModel_CC(MSVehicleType const*) /home/delphi/clangDebug/sumo/src/microsim/cfmodels/MSCFModel_CC.cpp:70:21
>     #2 0xcb07a7 in MSVehicleType::build(SUMOVTypeParameter&) /home/delphi/clangDebug/sumo/src/microsim/MSVehicleType.cpp:361:43
>     #3 0x8f1f86 in MSRouteHandler::closeVType() /home/delphi/clangDebug/sumo/src/microsim/MSRouteHandler.cpp:898:30
>     #4 0x2e9fd87 in SUMORouteHandler::myEndElement(int) /home/delphi/clangDebug/sumo/src/utils/vehicle/SUMORouteHandler.cpp:238:13
>     #5 0x307e758 in GenericSAXHandler::endElement(char16_t const*, char16_t const*, char16_t const*) /home/delphi/clangDebug/sumo/src/utils/xml/GenericSAXHandler.cpp:167:9
>     #6 0x7f8663330f52 in xercesc_3_2::SAX2XMLReaderImpl::endElement(xercesc_3_2::XMLElementDecl const&, unsigned int, bool, char16_t const*) (/usr/lib/x86_64-linux-gnu/libxerces-c-3.2.so+0x212f52)
> 
> SUMMARY: AddressSanitizer: 384 byte(s) leaked in 4 allocation(s).
---------- New result in exitcode ----------
1

TEST FAILED on ts-sim-build-ba : demandelements vehicletype load carfollowingmodel_params cf_cc_flatbed_kp ( Last six runs Jun2022 )

---------- Differences in errors ----------
0a1,14
> 
> =================================================================
> ==2648544==ERROR: LeakSanitizer: detected memory leaks
> 
> Direct leak of 384 byte(s) in 4 object(s) allocated from:
>     #0 0x55035d in operator new(unsigned long) (/home/delphi/clangDebug/sumo/bin/sumoD+0x55035d)
>     #1 0x1989a0f in MSCFModel_CC::MSCFModel_CC(MSVehicleType const*) /home/delphi/clangDebug/sumo/src/microsim/cfmodels/MSCFModel_CC.cpp:70:21
>     #2 0xcb07a7 in MSVehicleType::build(SUMOVTypeParameter&) /home/delphi/clangDebug/sumo/src/microsim/MSVehicleType.cpp:361:43
>     #3 0x8f1f86 in MSRouteHandler::closeVType() /home/delphi/clangDebug/sumo/src/microsim/MSRouteHandler.cpp:898:30
>     #4 0x2e9fd87 in SUMORouteHandler::myEndElement(int) /home/delphi/clangDebug/sumo/src/utils/vehicle/SUMORouteHandler.cpp:238:13
>     #5 0x307e758 in GenericSAXHandler::endElement(char16_t const*, char16_t const*, char16_t const*) /home/delphi/clangDebug/sumo/src/utils/xml/GenericSAXHandler.cpp:167:9
>     #6 0x7f0fa2805f52 in xercesc_3_2::SAX2XMLReaderImpl::endElement(xercesc_3_2::XMLElementDecl const&, unsigned int, bool, char16_t const*) (/usr/lib/x86_64-linux-gnu/libxerces-c-3.2.so+0x212f52)
> 
> SUMMARY: AddressSanitizer: 384 byte(s) leaked in 4 allocation(s).
---------- New result in exitcode ----------
1

TEST FAILED on ts-sim-build-ba : demandelements vehicletype load carfollowingmodel_params cf_cc_flatbed_kv ( Last six runs Jun2022 )

---------- Differences in errors ----------
0a1,14
> 
> =================================================================
> ==2648534==ERROR: LeakSanitizer: detected memory leaks
> 
> Direct leak of 384 byte(s) in 4 object(s) allocated from:
>     #0 0x55035d in operator new(unsigned long) (/home/delphi/clangDebug/sumo/bin/sumoD+0x55035d)
>     #1 0x1989a0f in MSCFModel_CC::MSCFModel_CC(MSVehicleType const*) /home/delphi/clangDebug/sumo/src/microsim/cfmodels/MSCFModel_CC.cpp:70:21
>     #2 0xcb07a7 in MSVehicleType::build(SUMOVTypeParameter&) /home/delphi/clangDebug/sumo/src/microsim/MSVehicleType.cpp:361:43
>     #3 0x8f1f86 in MSRouteHandler::closeVType() /home/delphi/clangDebug/sumo/src/microsim/MSRouteHandler.cpp:898:30
>     #4 0x2e9fd87 in SUMORouteHandler::myEndElement(int) /home/delphi/clangDebug/sumo/src/utils/vehicle/SUMORouteHandler.cpp:238:13
>     #5 0x307e758 in GenericSAXHandler::endElement(char16_t const*, char16_t const*, char16_t const*) /home/delphi/clangDebug/sumo/src/utils/xml/GenericSAXHandler.cpp:167:9
>     #6 0x7fb1d20b6f52 in xercesc_3_2::SAX2XMLReaderImpl::endElement(xercesc_3_2::XMLElementDecl const&, unsigned int, bool, char16_t const*) (/usr/lib/x86_64-linux-gnu/libxerces-c-3.2.so+0x212f52)
> 
> SUMMARY: AddressSanitizer: 384 byte(s) leaked in 4 allocation(s).
---------- New result in exitcode ----------
1

TEST FAILED on ts-sim-build-ba : demandelements vehicletype load carfollowingmodel_params cf_cc_kp ( Last six runs Jun2022 )

---------- Differences in errors ----------
0a1,14
> 
> =================================================================
> ==2648461==ERROR: LeakSanitizer: detected memory leaks
> 
> Direct leak of 384 byte(s) in 4 object(s) allocated from:
>     #0 0x55035d in operator new(unsigned long) (/home/delphi/clangDebug/sumo/bin/sumoD+0x55035d)
>     #1 0x1989a0f in MSCFModel_CC::MSCFModel_CC(MSVehicleType const*) /home/delphi/clangDebug/sumo/src/microsim/cfmodels/MSCFModel_CC.cpp:70:21
>     #2 0xcb07a7 in MSVehicleType::build(SUMOVTypeParameter&) /home/delphi/clangDebug/sumo/src/microsim/MSVehicleType.cpp:361:43
>     #3 0x8f1f86 in MSRouteHandler::closeVType() /home/delphi/clangDebug/sumo/src/microsim/MSRouteHandler.cpp:898:30
>     #4 0x2e9fd87 in SUMORouteHandler::myEndElement(int) /home/delphi/clangDebug/sumo/src/utils/vehicle/SUMORouteHandler.cpp:238:13
>     #5 0x307e758 in GenericSAXHandler::endElement(char16_t const*, char16_t const*, char16_t const*) /home/delphi/clangDebug/sumo/src/utils/xml/GenericSAXHandler.cpp:167:9
>     #6 0x7f900f8ecf52 in xercesc_3_2::SAX2XMLReaderImpl::endElement(xercesc_3_2::XMLElementDecl const&, unsigned int, bool, char16_t const*) (/usr/lib/x86_64-linux-gnu/libxerces-c-3.2.so+0x212f52)
> 
> SUMMARY: AddressSanitizer: 384 byte(s) leaked in 4 allocation(s).
---------- New result in exitcode ----------
1

TEST FAILED on ts-sim-build-ba : demandelements vehicletype load carfollowingmodel_params cf_cc_lambda ( Last six runs Jun2022 )

---------- Differences in errors ----------
0a1,14
> 
> =================================================================
> ==2648464==ERROR: LeakSanitizer: detected memory leaks
> 
> Direct leak of 384 byte(s) in 4 object(s) allocated from:
>     #0 0x55035d in operator new(unsigned long) (/home/delphi/clangDebug/sumo/bin/sumoD+0x55035d)
>     #1 0x1989a0f in MSCFModel_CC::MSCFModel_CC(MSVehicleType const*) /home/delphi/clangDebug/sumo/src/microsim/cfmodels/MSCFModel_CC.cpp:70:21
>     #2 0xcb07a7 in MSVehicleType::build(SUMOVTypeParameter&) /home/delphi/clangDebug/sumo/src/microsim/MSVehicleType.cpp:361:43
>     #3 0x8f1f86 in MSRouteHandler::closeVType() /home/delphi/clangDebug/sumo/src/microsim/MSRouteHandler.cpp:898:30
>     #4 0x2e9fd87 in SUMORouteHandler::myEndElement(int) /home/delphi/clangDebug/sumo/src/utils/vehicle/SUMORouteHandler.cpp:238:13
>     #5 0x307e758 in GenericSAXHandler::endElement(char16_t const*, char16_t const*, char16_t const*) /home/delphi/clangDebug/sumo/src/utils/xml/GenericSAXHandler.cpp:167:9
>     #6 0x7f009be50f52 in xercesc_3_2::SAX2XMLReaderImpl::endElement(xercesc_3_2::XMLElementDecl const&, unsigned int, bool, char16_t const*) (/usr/lib/x86_64-linux-gnu/libxerces-c-3.2.so+0x212f52)
> 
> SUMMARY: AddressSanitizer: 384 byte(s) leaked in 4 allocation(s).
---------- New result in exitcode ----------
1

TEST FAILED on ts-sim-build-ba : demandelements vehicletype load carfollowingmodel_params cf_cc_lanes_count ( Last six runs Jun2022 )

---------- Differences in errors ----------
0a1,14
> 
> =================================================================
> ==2648485==ERROR: LeakSanitizer: detected memory leaks
> 
> Direct leak of 288 byte(s) in 3 object(s) allocated from:
>     #0 0x55035d in operator new(unsigned long) (/home/delphi/clangDebug/sumo/bin/sumoD+0x55035d)
>     #1 0x1989a0f in MSCFModel_CC::MSCFModel_CC(MSVehicleType const*) /home/delphi/clangDebug/sumo/src/microsim/cfmodels/MSCFModel_CC.cpp:70:21
>     #2 0xcb07a7 in MSVehicleType::build(SUMOVTypeParameter&) /home/delphi/clangDebug/sumo/src/microsim/MSVehicleType.cpp:361:43
>     #3 0x8f1f86 in MSRouteHandler::closeVType() /home/delphi/clangDebug/sumo/src/microsim/MSRouteHandler.cpp:898:30
>     #4 0x2e9fd87 in SUMORouteHandler::myEndElement(int) /home/delphi/clangDebug/sumo/src/utils/vehicle/SUMORouteHandler.cpp:238:13
>     #5 0x307e758 in GenericSAXHandler::endElement(char16_t const*, char16_t const*, char16_t const*) /home/delphi/clangDebug/sumo/src/utils/xml/GenericSAXHandler.cpp:167:9
>     #6 0x7f43dc93cf52 in xercesc_3_2::SAX2XMLReaderImpl::endElement(xercesc_3_2::XMLElementDecl const&, unsigned int, bool, char16_t const*) (/usr/lib/x86_64-linux-gnu/libxerces-c-3.2.so+0x212f52)
> 
> SUMMARY: AddressSanitizer: 288 byte(s) leaked in 3 allocation(s).
---------- New result in exitcode ----------
1

TEST FAILED on ts-sim-build-ba : demandelements vehicletype load carfollowingmodel_params cf_cc_omegan ( Last six runs Jun2022 )

---------- Differences in errors ----------
0a1,14
> 
> =================================================================
> ==2648468==ERROR: LeakSanitizer: detected memory leaks
> 
> Direct leak of 384 byte(s) in 4 object(s) allocated from:
>     #0 0x55035d in operator new(unsigned long) (/home/delphi/clangDebug/sumo/bin/sumoD+0x55035d)
>     #1 0x1989a0f in MSCFModel_CC::MSCFModel_CC(MSVehicleType const*) /home/delphi/clangDebug/sumo/src/microsim/cfmodels/MSCFModel_CC.cpp:70:21
>     #2 0xcb07a7 in MSVehicleType::build(SUMOVTypeParameter&) /home/delphi/clangDebug/sumo/src/microsim/MSVehicleType.cpp:361:43
>     #3 0x8f1f86 in MSRouteHandler::closeVType() /home/delphi/clangDebug/sumo/src/microsim/MSRouteHandler.cpp:898:30
>     #4 0x2e9fd87 in SUMORouteHandler::myEndElement(int) /home/delphi/clangDebug/sumo/src/utils/vehicle/SUMORouteHandler.cpp:238:13
>     #5 0x307e758 in GenericSAXHandler::endElement(char16_t const*, char16_t const*, char16_t const*) /home/delphi/clangDebug/sumo/src/utils/xml/GenericSAXHandler.cpp:167:9
>     #6 0x7f5329d90f52 in xercesc_3_2::SAX2XMLReaderImpl::endElement(xercesc_3_2::XMLElementDecl const&, unsigned int, bool, char16_t const*) (/usr/lib/x86_64-linux-gnu/libxerces-c-3.2.so+0x212f52)
> 
> SUMMARY: AddressSanitizer: 384 byte(s) leaked in 4 allocation(s).
---------- New result in exitcode ----------
1

TEST FAILED on ts-sim-build-ba : demandelements vehicletype load carfollowingmodel_params cf_cc_ploeg_h ( Last six runs Jun2022 )

---------- Differences in errors ----------
0a1,14
> 
> =================================================================
> ==2648516==ERROR: LeakSanitizer: detected memory leaks
> 
> Direct leak of 384 byte(s) in 4 object(s) allocated from:
>     #0 0x55035d in operator new(unsigned long) (/home/delphi/clangDebug/sumo/bin/sumoD+0x55035d)
>     #1 0x1989a0f in MSCFModel_CC::MSCFModel_CC(MSVehicleType const*) /home/delphi/clangDebug/sumo/src/microsim/cfmodels/MSCFModel_CC.cpp:70:21
>     #2 0xcb07a7 in MSVehicleType::build(SUMOVTypeParameter&) /home/delphi/clangDebug/sumo/src/microsim/MSVehicleType.cpp:361:43
>     #3 0x8f1f86 in MSRouteHandler::closeVType() /home/delphi/clangDebug/sumo/src/microsim/MSRouteHandler.cpp:898:30
>     #4 0x2e9fd87 in SUMORouteHandler::myEndElement(int) /home/delphi/clangDebug/sumo/src/utils/vehicle/SUMORouteHandler.cpp:238:13
>     #5 0x307e758 in GenericSAXHandler::endElement(char16_t const*, char16_t const*, char16_t const*) /home/delphi/clangDebug/sumo/src/utils/xml/GenericSAXHandler.cpp:167:9
>     #6 0x7fcbfa48ff52 in xercesc_3_2::SAX2XMLReaderImpl::endElement(xercesc_3_2::XMLElementDecl const&, unsigned int, bool, char16_t const*) (/usr/lib/x86_64-linux-gnu/libxerces-c-3.2.so+0x212f52)
> 
> SUMMARY: AddressSanitizer: 384 byte(s) leaked in 4 allocation(s).
---------- New result in exitcode ----------
1

TEST FAILED on ts-sim-build-ba : demandelements vehicletype load carfollowingmodel_params cf_cc_ploeg_kd ( Last six runs Jun2022 )

---------- Differences in errors ----------
0a1,14
> 
> =================================================================
> ==2648506==ERROR: LeakSanitizer: detected memory leaks
> 
> Direct leak of 384 byte(s) in 4 object(s) allocated from:
>     #0 0x55035d in operator new(unsigned long) (/home/delphi/clangDebug/sumo/bin/sumoD+0x55035d)
>     #1 0x1989a0f in MSCFModel_CC::MSCFModel_CC(MSVehicleType const*) /home/delphi/clangDebug/sumo/src/microsim/cfmodels/MSCFModel_CC.cpp:70:21
>     #2 0xcb07a7 in MSVehicleType::build(SUMOVTypeParameter&) /home/delphi/clangDebug/sumo/src/microsim/MSVehicleType.cpp:361:43
>     #3 0x8f1f86 in MSRouteHandler::closeVType() /home/delphi/clangDebug/sumo/src/microsim/MSRouteHandler.cpp:898:30
>     #4 0x2e9fd87 in SUMORouteHandler::myEndElement(int) /home/delphi/clangDebug/sumo/src/utils/vehicle/SUMORouteHandler.cpp:238:13
>     #5 0x307e758 in GenericSAXHandler::endElement(char16_t const*, char16_t const*, char16_t const*) /home/delphi/clangDebug/sumo/src/utils/xml/GenericSAXHandler.cpp:167:9
>     #6 0x7fdea90e3f52 in xercesc_3_2::SAX2XMLReaderImpl::endElement(xercesc_3_2::XMLElementDecl const&, unsigned int, bool, char16_t const*) (/usr/lib/x86_64-linux-gnu/libxerces-c-3.2.so+0x212f52)
> 
> SUMMARY: AddressSanitizer: 384 byte(s) leaked in 4 allocation(s).
---------- New result in exitcode ----------
1

TEST FAILED on ts-sim-build-ba : demandelements vehicletype load carfollowingmodel_params cf_cc_ploeg_kp ( Last six runs Jun2022 )

---------- Differences in errors ----------
0a1,14
> 
> =================================================================
> ==2648496==ERROR: LeakSanitizer: detected memory leaks
> 
> Direct leak of 384 byte(s) in 4 object(s) allocated from:
>     #0 0x55035d in operator new(unsigned long) (/home/delphi/clangDebug/sumo/bin/sumoD+0x55035d)
>     #1 0x1989a0f in MSCFModel_CC::MSCFModel_CC(MSVehicleType const*) /home/delphi/clangDebug/sumo/src/microsim/cfmodels/MSCFModel_CC.cpp:70:21
>     #2 0xcb07a7 in MSVehicleType::build(SUMOVTypeParameter&) /home/delphi/clangDebug/sumo/src/microsim/MSVehicleType.cpp:361:43
>     #3 0x8f1f86 in MSRouteHandler::closeVType() /home/delphi/clangDebug/sumo/src/microsim/MSRouteHandler.cpp:898:30
>     #4 0x2e9fd87 in SUMORouteHandler::myEndElement(int) /home/delphi/clangDebug/sumo/src/utils/vehicle/SUMORouteHandler.cpp:238:13
>     #5 0x307e758 in GenericSAXHandler::endElement(char16_t const*, char16_t const*, char16_t const*) /home/delphi/clangDebug/sumo/src/utils/xml/GenericSAXHandler.cpp:167:9
>     #6 0x7fba5e5caf52 in xercesc_3_2::SAX2XMLReaderImpl::endElement(xercesc_3_2::XMLElementDecl const&, unsigned int, bool, char16_t const*) (/usr/lib/x86_64-linux-gnu/libxerces-c-3.2.so+0x212f52)
> 
> SUMMARY: AddressSanitizer: 384 byte(s) leaked in 4 allocation(s).
---------- New result in exitcode ----------
1

TEST FAILED on ts-sim-build-ba : demandelements vehicletype load carfollowingmodel_params cf_cc_tau ( Last six runs Jun2022 )

---------- Differences in errors ----------
0a1,14
> 
> =================================================================
> ==2648476==ERROR: LeakSanitizer: detected memory leaks
> 
> Direct leak of 384 byte(s) in 4 object(s) allocated from:
>     #0 0x55035d in operator new(unsigned long) (/home/delphi/clangDebug/sumo/bin/sumoD+0x55035d)
>     #1 0x1989a0f in MSCFModel_CC::MSCFModel_CC(MSVehicleType const*) /home/delphi/clangDebug/sumo/src/microsim/cfmodels/MSCFModel_CC.cpp:70:21
>     #2 0xcb07a7 in MSVehicleType::build(SUMOVTypeParameter&) /home/delphi/clangDebug/sumo/src/microsim/MSVehicleType.cpp:361:43
>     #3 0x8f1f86 in MSRouteHandler::closeVType() /home/delphi/clangDebug/sumo/src/microsim/MSRouteHandler.cpp:898:30
>     #4 0x2e9fd87 in SUMORouteHandler::myEndElement(int) /home/delphi/clangDebug/sumo/src/utils/vehicle/SUMORouteHandler.cpp:238:13
>     #5 0x307e758 in GenericSAXHandler::endElement(char16_t const*, char16_t const*, char16_t const*) /home/delphi/clangDebug/sumo/src/utils/xml/GenericSAXHandler.cpp:167:9
>     #6 0x7fb8fda43f52 in xercesc_3_2::SAX2XMLReaderImpl::endElement(xercesc_3_2::XMLElementDecl const&, unsigned int, bool, char16_t const*) (/usr/lib/x86_64-linux-gnu/libxerces-c-3.2.so+0x212f52)
> 
> SUMMARY: AddressSanitizer: 384 byte(s) leaked in 4 allocation(s).
---------- New result in exitcode ----------
1

TEST FAILED on ts-sim-build-ba : demandelements vehicletype load carfollowingmodel_params cf_cc_xi ( Last six runs Jun2022 )

---------- Differences in errors ----------
0a1,14
> 
> =================================================================
> ==2648480==ERROR: LeakSanitizer: detected memory leaks
> 
> Direct leak of 384 byte(s) in 4 object(s) allocated from:
>     #0 0x55035d in operator new(unsigned long) (/home/delphi/clangDebug/sumo/bin/sumoD+0x55035d)
>     #1 0x1989a0f in MSCFModel_CC::MSCFModel_CC(MSVehicleType const*) /home/delphi/clangDebug/sumo/src/microsim/cfmodels/MSCFModel_CC.cpp:70:21
>     #2 0xcb07a7 in MSVehicleType::build(SUMOVTypeParameter&) /home/delphi/clangDebug/sumo/src/microsim/MSVehicleType.cpp:361:43
>     #3 0x8f1f86 in MSRouteHandler::closeVType() /home/delphi/clangDebug/sumo/src/microsim/MSRouteHandler.cpp:898:30
>     #4 0x2e9fd87 in SUMORouteHandler::myEndElement(int) /home/delphi/clangDebug/sumo/src/utils/vehicle/SUMORouteHandler.cpp:238:13
>     #5 0x307e758 in GenericSAXHandler::endElement(char16_t const*, char16_t const*, char16_t const*) /home/delphi/clangDebug/sumo/src/utils/xml/GenericSAXHandler.cpp:167:9
>     #6 0x7f1facaf3f52 in xercesc_3_2::SAX2XMLReaderImpl::endElement(xercesc_3_2::XMLElementDecl const&, unsigned int, bool, char16_t const*) (/usr/lib/x86_64-linux-gnu/libxerces-c-3.2.so+0x212f52)
> 
> SUMMARY: AddressSanitizer: 384 byte(s) leaked in 4 allocation(s).
---------- New result in exitcode ----------
1

TEST FAILED on ts-sim-build-ba : netelements crossings with_tls inspect_selected linkindex ( Last six runs Jun2022 )

---------- Differences in errors ----------
1c1
< Warning: Unused states in tlLogic 'Center', program '0' in phase 0 after tl-index 19
---
> Warning: Unused states in tlLogic 'Center', program '0' in phase 0 after tl-index 15

TEST FAILED on ts-sim-build-ba : netelements junctions inspect type internal ( Last six runs Jun2022 )

---------- Differences in errors ----------
0a1,52
> 
> =================================================================
> ==2639300==ERROR: LeakSanitizer: detected memory leaks
> 
> Direct leak of 64 byte(s) in 1 object(s) allocated from:
>     #0 0x55035d in operator new(unsigned long) (/home/delphi/clangDebug/sumo/bin/sumoD+0x55035d)
>     #1 0x18757d0 in NLJunctionControlBuilder::closeJunctionLogic() /home/delphi/clangDebug/sumo/src/netload/NLJunctionControlBuilder.cpp:483:30
>     #2 0x17b442a in NLHandler::myEndElement(int) /home/delphi/clangDebug/sumo/src/netload/NLHandler.cpp:316:46
>     #3 0x307e758 in GenericSAXHandler::endElement(char16_t const*, char16_t const*, char16_t const*) /home/delphi/clangDebug/sumo/src/utils/xml/GenericSAXHandler.cpp:167:9
>     #4 0x7f7371449f52 in xercesc_3_2::SAX2XMLReaderImpl::endElement(xercesc_3_2::XMLElementDecl const&, unsigned int, bool, char16_t const*) (/usr/lib/x86_64-linux-gnu/libxerces-c-3.2.so+0x212f52)
> 
> Indirect leak of 704 byte(s) in 1 object(s) allocated from:
>     #0 0x55035d in operator new(unsigned long) (/home/delphi/clangDebug/sumo/bin/sumoD+0x55035d)
>     #1 0x1899180 in __gnu_cxx::new_allocator<std::bitset<256ul> >::allocate(unsigned long, void const*) /usr/bin/../lib/gcc/x86_64-linux-gnu/9/../../../../include/c++/9/ext/new_allocator.h:114:27
>     #2 0x18990ad in std::allocator_traits<std::allocator<std::bitset<256ul> > >::allocate(std::allocator<std::bitset<256ul> >&, unsigned long) /usr/bin/../lib/gcc/x86_64-linux-gnu/9/../../../../include/c++/9/bits/alloc_traits.h:443:20
>     #3 0x18989df in std::_Vector_base<std::bitset<256ul>, std::allocator<std::bitset<256ul> > >::_M_allocate(unsigned long) /usr/bin/../lib/gcc/x86_64-linux-gnu/9/../../../../include/c++/9/bits/stl_vector.h:343:20
>     #4 0x18a60af in std::_Vector_base<std::bitset<256ul>, std::allocator<std::bitset<256ul> > >::_M_create_storage(unsigned long) /usr/bin/../lib/gcc/x86_64-linux-gnu/9/../../../../include/c++/9/bits/stl_vector.h:358:33
>     #5 0x18a55b2 in std::_Vector_base<std::bitset<256ul>, std::allocator<std::bitset<256ul> > >::_Vector_base(unsigned long, std::allocator<std::bitset<256ul> > const&) /usr/bin/../lib/gcc/x86_64-linux-gnu/9/../../../../include/c++/9/bits/stl_vector.h:302:9
>     #6 0x187bd55 in std::vector<std::bitset<256ul>, std::allocator<std::bitset<256ul> > >::vector(std::vector<std::bitset<256ul>, std::allocator<std::bitset<256ul> > > const&) /usr/bin/../lib/gcc/x86_64-linux-gnu/9/../../../../include/c++/9/bits/stl_vector.h:551:9
>     #7 0x1875b6b in NLJunctionControlBuilder::closeJunctionLogic() /home/delphi/clangDebug/sumo/src/netload/NLJunctionControlBuilder.cpp:485:17
>     #8 0x17b442a in NLHandler::myEndElement(int) /home/delphi/clangDebug/sumo/src/netload/NLHandler.cpp:316:46
>     #9 0x307e758 in GenericSAXHandler::endElement(char16_t const*, char16_t const*, char16_t const*) /home/delphi/clangDebug/sumo/src/utils/xml/GenericSAXHandler.cpp:167:9
>     #10 0x7f7371449f52 in xercesc_3_2::SAX2XMLReaderImpl::endElement(xercesc_3_2::XMLElementDecl const&, unsigned int, bool, char16_t const*) (/usr/lib/x86_64-linux-gnu/libxerces-c-3.2.so+0x212f52)
> 
> Indirect leak of 704 byte(s) in 1 object(s) allocated from:
>     #0 0x55035d in operator new(unsigned long) (/home/delphi/clangDebug/sumo/bin/sumoD+0x55035d)
>     #1 0x1899180 in __gnu_cxx::new_allocator<std::bitset<256ul> >::allocate(unsigned long, void const*) /usr/bin/../lib/gcc/x86_64-linux-gnu/9/../../../../include/c++/9/ext/new_allocator.h:114:27
>     #2 0x18990ad in std::allocator_traits<std::allocator<std::bitset<256ul> > >::allocate(std::allocator<std::bitset<256ul> >&, unsigned long) /usr/bin/../lib/gcc/x86_64-linux-gnu/9/../../../../include/c++/9/bits/alloc_traits.h:443:20
>     #3 0x18989df in std::_Vector_base<std::bitset<256ul>, std::allocator<std::bitset<256ul> > >::_M_allocate(unsigned long) /usr/bin/../lib/gcc/x86_64-linux-gnu/9/../../../../include/c++/9/bits/stl_vector.h:343:20
<truncated after showing first 30 lines>
---------- New result in exitcode ----------
1

TEST FAILED on ts-sim-build-ba : netelements junctions inspect_tls type internal ( Last six runs Jun2022 )

---------- Differences in errors ----------
0a1,52
> 
> =================================================================
> ==2639579==ERROR: LeakSanitizer: detected memory leaks
> 
> Direct leak of 64 byte(s) in 1 object(s) allocated from:
>     #0 0x55035d in operator new(unsigned long) (/home/delphi/clangDebug/sumo/bin/sumoD+0x55035d)
>     #1 0x18757d0 in NLJunctionControlBuilder::closeJunctionLogic() /home/delphi/clangDebug/sumo/src/netload/NLJunctionControlBuilder.cpp:483:30
>     #2 0x17b442a in NLHandler::myEndElement(int) /home/delphi/clangDebug/sumo/src/netload/NLHandler.cpp:316:46
>     #3 0x307e758 in GenericSAXHandler::endElement(char16_t const*, char16_t const*, char16_t const*) /home/delphi/clangDebug/sumo/src/utils/xml/GenericSAXHandler.cpp:167:9
>     #4 0x7f969f678f52 in xercesc_3_2::SAX2XMLReaderImpl::endElement(xercesc_3_2::XMLElementDecl const&, unsigned int, bool, char16_t const*) (/usr/lib/x86_64-linux-gnu/libxerces-c-3.2.so+0x212f52)
> 
> Indirect leak of 704 byte(s) in 1 object(s) allocated from:
>     #0 0x55035d in operator new(unsigned long) (/home/delphi/clangDebug/sumo/bin/sumoD+0x55035d)
>     #1 0x1899180 in __gnu_cxx::new_allocator<std::bitset<256ul> >::allocate(unsigned long, void const*) /usr/bin/../lib/gcc/x86_64-linux-gnu/9/../../../../include/c++/9/ext/new_allocator.h:114:27
>     #2 0x18990ad in std::allocator_traits<std::allocator<std::bitset<256ul> > >::allocate(std::allocator<std::bitset<256ul> >&, unsigned long) /usr/bin/../lib/gcc/x86_64-linux-gnu/9/../../../../include/c++/9/bits/alloc_traits.h:443:20
>     #3 0x18989df in std::_Vector_base<std::bitset<256ul>, std::allocator<std::bitset<256ul> > >::_M_allocate(unsigned long) /usr/bin/../lib/gcc/x86_64-linux-gnu/9/../../../../include/c++/9/bits/stl_vector.h:343:20
>     #4 0x18a60af in std::_Vector_base<std::bitset<256ul>, std::allocator<std::bitset<256ul> > >::_M_create_storage(unsigned long) /usr/bin/../lib/gcc/x86_64-linux-gnu/9/../../../../include/c++/9/bits/stl_vector.h:358:33
>     #5 0x18a55b2 in std::_Vector_base<std::bitset<256ul>, std::allocator<std::bitset<256ul> > >::_Vector_base(unsigned long, std::allocator<std::bitset<256ul> > const&) /usr/bin/../lib/gcc/x86_64-linux-gnu/9/../../../../include/c++/9/bits/stl_vector.h:302:9
>     #6 0x187bd55 in std::vector<std::bitset<256ul>, std::allocator<std::bitset<256ul> > >::vector(std::vector<std::bitset<256ul>, std::allocator<std::bitset<256ul> > > const&) /usr/bin/../lib/gcc/x86_64-linux-gnu/9/../../../../include/c++/9/bits/stl_vector.h:551:9
>     #7 0x1875b6b in NLJunctionControlBuilder::closeJunctionLogic() /home/delphi/clangDebug/sumo/src/netload/NLJunctionControlBuilder.cpp:485:17
>     #8 0x17b442a in NLHandler::myEndElement(int) /home/delphi/clangDebug/sumo/src/netload/NLHandler.cpp:316:46
>     #9 0x307e758 in GenericSAXHandler::endElement(char16_t const*, char16_t const*, char16_t const*) /home/delphi/clangDebug/sumo/src/utils/xml/GenericSAXHandler.cpp:167:9
>     #10 0x7f969f678f52 in xercesc_3_2::SAX2XMLReaderImpl::endElement(xercesc_3_2::XMLElementDecl const&, unsigned int, bool, char16_t const*) (/usr/lib/x86_64-linux-gnu/libxerces-c-3.2.so+0x212f52)
> 
> Indirect leak of 704 byte(s) in 1 object(s) allocated from:
>     #0 0x55035d in operator new(unsigned long) (/home/delphi/clangDebug/sumo/bin/sumoD+0x55035d)
>     #1 0x1899180 in __gnu_cxx::new_allocator<std::bitset<256ul> >::allocate(unsigned long, void const*) /usr/bin/../lib/gcc/x86_64-linux-gnu/9/../../../../include/c++/9/ext/new_allocator.h:114:27
>     #2 0x18990ad in std::allocator_traits<std::allocator<std::bitset<256ul> > >::allocate(std::allocator<std::bitset<256ul> >&, unsigned long) /usr/bin/../lib/gcc/x86_64-linux-gnu/9/../../../../include/c++/9/bits/alloc_traits.h:443:20
>     #3 0x18989df in std::_Vector_base<std::bitset<256ul>, std::allocator<std::bitset<256ul> > >::_M_allocate(unsigned long) /usr/bin/../lib/gcc/x86_64-linux-gnu/9/../../../../include/c++/9/bits/stl_vector.h:343:20
<truncated after showing first 30 lines>
---------- New result in exitcode ----------
1

Detailed information for the tests that had known bugs:

17 TESTS had known bugs (Test needed #3045) on ts-sim-build-ba :

#3045
(This bug was triggered by text found in file 'errors' matching 'File 'net.netedit' is not accessible')
---------- New result in errors ----------
Error: File 'net.netedit' is not accessible (No such file or directory).
Quitting (on error).
demandelements container fix ( Last six runs Jun2022 )
demandelements container volatilerecomputing ( Last six runs Jun2022 )
demandelements containerflow fix ( Last six runs Jun2022 )
demandelements containerflow volatilerecomputing ( Last six runs Jun2022 )
demandelements flow fix ( Last six runs Jun2022 )
demandelements flow_embedded fix ( Last six runs Jun2022 )
demandelements flow_junctions fix ( Last six runs Jun2022 )
demandelements person fix ( Last six runs Jun2022 )
demandelements person volatilerecomputing ( Last six runs Jun2022 )
demandelements personflow fix ( Last six runs Jun2022 )
demandelements personflow volatilerecomputing ( Last six runs Jun2022 )
demandelements routeflow fix ( Last six runs Jun2022 )
demandelements trip fix ( Last six runs Jun2022 )
demandelements trip_junctions fix ( Last six runs Jun2022 )
demandelements vehicle fix ( Last six runs Jun2022 )
demandelements vehicle_embedded fix ( Last six runs Jun2022 )
selection basic contextual_menu ( Last six runs Jun2022 )

Detailed information for the tests that were terminated before completion:

7 TESTS were terminated before completion (TIMEOUT) on ts-sim-build-ba :

Test exceeded wallclock time limit of 600.0 seconds
---------- Differences in output ----------
0a1
> Interrupt signal received, trying to exit gracefully.
demandelements flow create poisson ( Last six runs Jun2022 )
demandelements flow inspect poisson ( Last six runs Jun2022 )
demandelements flow_embedded create poisson ( Last six runs Jun2022 )
demandelements flow_junctions create begin ( Last six runs Jun2022 )
demandelements flow_junctions create poisson ( Last six runs Jun2022 )
demandelements flow_junctions inspect poisson ( Last six runs Jun2022 )
demandelements routeflow create poisson ( Last six runs Jun2022 )

TEST were terminated before completion (TIMEOUT) on ts-sim-build-ba : demandelements flow inspect_selection poisson ( Last six runs Jun2022 )

Test exceeded wallclock time limit of 600.0 seconds
---------- Differences in errors ----------
4257,9489d4256
< Error: Vehicle 'flowB.4117' will not be able to depart using the given velocity (junction 'gneJ6' too close)!
< Error: Vehicle 'flowB.4118' will not be able to depart using the given velocity (junction 'gneJ6' too close)!
< Error: Vehicle 'flowB.4119' will not be able to depart using the given velocity (junction 'gneJ6' too close)!
< Error: Vehicle 'flowB.4120' will not be able to depart using the given velocity (junction 'gneJ6' too close)!
< Error: Vehicle 'flowB.4121' will not be able to depart using the given velocity (junction 'gneJ6' too close)!
< Error: Vehicle 'flowB.4122' will not be able to depart using the given velocity (junction 'gneJ6' too close)!
< Error: Vehicle 'flowB.4123' will not be able to depart using the given velocity (junction 'gneJ6' too close)!
< Error: Vehicle 'flowB.4124' will not be able to depart using the given velocity (junction 'gneJ6' too close)!
< Error: Vehicle 'flowB.4125' will not be able to depart using the given velocity (junction 'gneJ6' too close)!
< Error: Vehicle 'flowB.4126' will not be able to depart using the given velocity (junction 'gneJ6' too close)!
< Error: Vehicle 'flowB.4127' will not be able to depart using the given velocity (junction 'gneJ6' too close)!
< Error: Vehicle 'flowB.4128' will not be able to depart using the given velocity (junction 'gneJ6' too close)!
< Error: Vehicle 'flowB.4129' will not be able to depart using the given velocity (junction 'gneJ6' too close)!
< Error: Vehicle 'flowB.4130' will not be able to depart using the given velocity (junction 'gneJ6' too close)!
< Error: Vehicle 'flowB.4131' will not be able to depart using the given velocity (junction 'gneJ6' too close)!
< Error: Vehicle 'flowB.4132' will not be able to depart using the given velocity (junction 'gneJ6' too close)!
< Error: Vehicle 'flowB.4133' will not be able to depart using the given velocity (junction 'gneJ6' too close)!
< Error: Vehicle 'flowB.4134' will not be able to depart using the given velocity (junction 'gneJ6' too close)!
< Error: Vehicle 'flowB.4135' will not be able to depart using the given velocity (junction 'gneJ6' too close)!
< Error: Vehicle 'flowB.4136' will not be able to depart using the given velocity (junction 'gneJ6' too close)!
< Error: Vehicle 'flowB.4137' will not be able to depart using the given velocity (junction 'gneJ6' too close)!
< Error: Vehicle 'flowB.4138' will not be able to depart using the given velocity (junction 'gneJ6' too close)!
< Error: Vehicle 'flowB.4139' will not be able to depart using the given velocity (junction 'gneJ6' too close)!
< Error: Vehicle 'flowB.4140' will not be able to depart using the given velocity (junction 'gneJ6' too close)!
< Error: Vehicle 'flowB.4141' will not be able to depart using the given velocity (junction 'gneJ6' too close)!
< Error: Vehicle 'flowB.4142' will not be able to depart using the given velocity (junction 'gneJ6' too close)!
< Error: Vehicle 'flowB.4143' will not be able to depart using the given velocity (junction 'gneJ6' too close)!
< Error: Vehicle 'flowB.4144' will not be able to depart using the given velocity (junction 'gneJ6' too close)!
< Error: Vehicle 'flowB.4145' will not be able to depart using the given velocity (junction 'gneJ6' too close)!
<truncated after showing first 30 lines>
---------- Differences in output ----------
0a1
> Interrupt signal received, trying to exit gracefully.

TEST were terminated before completion (TIMEOUT) on ts-sim-build-ba : demandelements personflow inspect_selection poisson ( Last six runs Jun2022 )

Test exceeded wallclock time limit of 600.0 seconds
---------- Differences in errors ----------
4933,11401d4932
< Warning: Person 'f_1.6565' is jammed on edge 'gneE4', time=2876.00.
< Warning: Person 'f_1.6566' is jammed on edge 'gneE4', time=2876.00.
< Warning: Person 'f_1.6567' is jammed on edge 'gneE4', time=2876.00.
< Warning: Person 'f_1.6568' is jammed on edge 'gneE4', time=2876.00.
< Warning: Person 'f_0.6574' is jammed on edge 'gneE2', time=2876.00.
< Warning: Person 'f_0.6575' is jammed on edge 'gneE2', time=2876.00.
< Warning: Person 'f_0.6576' is jammed on edge 'gneE2', time=2876.00.
< Warning: Person 'f_0.6577' is jammed on edge 'gneE2', time=2876.00.
< Warning: Person 'f_1.6569' is jammed on edge 'gneE4', time=2877.00.
< Warning: Person 'f_1.6570' is jammed on edge 'gneE4', time=2877.00.
< Warning: Person 'f_1.6571' is jammed on edge 'gneE4', time=2877.00.
< Warning: Person 'f_1.6572' is jammed on edge 'gneE4', time=2877.00.
< Warning: Person 'f_1.6573' is jammed on edge 'gneE4', time=2877.00.
< Warning: Person 'f_0.6578' is jammed on edge 'gneE2', time=2877.00.
< Warning: Person 'f_0.6579' is jammed on edge 'gneE2', time=2877.00.
< Warning: Person 'f_0.6580' is jammed on edge 'gneE2', time=2877.00.
< Warning: Person 'f_0.6581' is jammed on edge 'gneE2', time=2877.00.
< Warning: Person 'f_1.6574' is jammed on edge 'gneE4', time=2878.00.
< Warning: Person 'f_0.6582' is jammed on edge 'gneE2', time=2878.00.
< Warning: Person 'f_0.6583' is jammed on edge 'gneE2', time=2878.00.
< Warning: Person 'f_1.6575' is jammed on edge 'gneE4', time=2879.00.
< Warning: Person 'f_1.6576' is jammed on edge 'gneE4', time=2879.00.
< Warning: Person 'f_1.6577' is jammed on edge 'gneE4', time=2879.00.
< Warning: Person 'f_1.6578' is jammed on edge 'gneE4', time=2879.00.
< Warning: Person 'f_0.6584' is jammed on edge 'gneE2', time=2879.00.
< Warning: Person 'f_0.6585' is jammed on edge 'gneE2', time=2879.00.
< Warning: Person 'f_1.6579' is jammed on edge 'gneE4', time=2880.00.
< Warning: Person 'f_1.6580' is jammed on edge 'gneE4', time=2880.00.
< Warning: Person 'f_1.6581' is jammed on edge 'gneE4', time=2880.00.
<truncated after showing first 30 lines>
---------- Differences in output ----------
0a1
> Interrupt signal received, trying to exit gracefully.

TEST were terminated before completion (TIMEOUT) on ts-sim-build-ba : demandelements routeflow inspect_selection poisson ( Last six runs Jun2022 )

Test exceeded wallclock time limit of 600.0 seconds
---------- Differences in errors ----------
1547,3311d1546
< Error: Vehicle 'flowB.3375' will not be able to depart using the given velocity (slow lane ahead)!
< Error: Vehicle 'flowB.3379' will not be able to depart using the given velocity (slow lane ahead)!
< Error: Vehicle 'flowB.3381' will not be able to depart using the given velocity (slow lane ahead)!
< Error: Vehicle 'flowB.3385' will not be able to depart using the given velocity (slow lane ahead)!
< Error: Vehicle 'flowB.3388' will not be able to depart using the given velocity (slow lane ahead)!
< Error: Vehicle 'flowB.3390' will not be able to depart using the given velocity (slow lane ahead)!
< Error: Vehicle 'flowB.3392' will not be able to depart using the given velocity (slow lane ahead)!
< Error: Vehicle 'flowB.3393' will not be able to depart using the given velocity (slow lane ahead)!
< Error: Vehicle 'flowB.3395' will not be able to depart using the given velocity (slow lane ahead)!
< Error: Vehicle 'flowB.3396' will not be able to depart using the given velocity (slow lane ahead)!
< Error: Vehicle 'flowB.3401' will not be able to depart using the given velocity (slow lane ahead)!
< Error: Vehicle 'flowB.3404' will not be able to depart using the given velocity (slow lane ahead)!
< Error: Vehicle 'flowB.3406' will not be able to depart using the given velocity (slow lane ahead)!
< Error: Vehicle 'flowB.3408' will not be able to depart using the given velocity (slow lane ahead)!
< Error: Vehicle 'flowB.3413' will not be able to depart using the given velocity (slow lane ahead)!
< Error: Vehicle 'flowB.3422' will not be able to depart using the given velocity (slow lane ahead)!
< Error: Vehicle 'flowB.3424' will not be able to depart using the given velocity (slow lane ahead)!
< Error: Vehicle 'flowB.3428' will not be able to depart using the given velocity (slow lane ahead)!
< Error: Vehicle 'flowB.3433' will not be able to depart using the given velocity (slow lane ahead)!
< Error: Vehicle 'flowB.3436' will not be able to depart using the given velocity (slow lane ahead)!
< Error: Vehicle 'flowB.3443' will not be able to depart using the given velocity (slow lane ahead)!
< Error: Vehicle 'flowB.3445' will not be able to depart using the given velocity (slow lane ahead)!
< Error: Vehicle 'flowB.3451' will not be able to depart using the given velocity (slow lane ahead)!
< Error: Vehicle 'flowB.3453' will not be able to depart using the given velocity (slow lane ahead)!
< Error: Vehicle 'flowB.3466' will not be able to depart using the given velocity (slow lane ahead)!
< Error: Vehicle 'flowB.3468' will not be able to depart using the given velocity (slow lane ahead)!
< Error: Vehicle 'flowB.3474' will not be able to depart using the given velocity (slow lane ahead)!
< Error: Vehicle 'flowB.3478' will not be able to depart using the given velocity (slow lane ahead)!
< Error: Vehicle 'flowB.3484' will not be able to depart using the given velocity (slow lane ahead)!
<truncated after showing first 30 lines>
---------- Differences in output ----------
0a1
> Interrupt signal received, trying to exit gracefully.