Test results for TRACI

(generated by unknown at 25Aug04:14)

Last six runs

Jul2019 Aug2019

test_default.png
Test20Aug19rv1_2_0+1656-290006a3f521Aug19rv1_3_0+0004-8d6298d34022Aug19rv1_3_0+0021-afbe584ecf23Aug19rv1_3_0+0043-3ea23d5e4c24Aug19rv1_3_0+0043-3ea23d5e4c25Aug19rv1_3_0+0070-cd73ec83ef
Summary589 tests: 589 FAILED 589 tests: 589 FAILED 589 tests: 589 FAILED 589 tests: 589 FAILED 589 tests: 589 FAILED 589 tests: 589 FAILED
context_subscription VAR_LANE2VEH_SPEED+POS errors different ts-sim-build-baerrors different ts-sim-build-baerrors different ts-sim-build-baerrors different ts-sim-build-baerrors different ts-sim-build-baerrors different ts-sim-build-ba
context_subscription VAR_VEH2LANE_SPEED+LENGTH errors different ts-sim-build-baerrors different ts-sim-build-baerrors different ts-sim-build-baerrors different ts-sim-build-baerrors different ts-sim-build-baerrors different ts-sim-build-ba
context_subscription bugs after_removal errors different ts-sim-build-baerrors different ts-sim-build-baerrors different ts-sim-build-baerrors different ts-sim-build-baerrors different ts-sim-build-baerrors different ts-sim-build-ba
get_variable ArealDetector ID_COUNT no_detectors errors different ts-sim-build-baerrors different ts-sim-build-baerrors different ts-sim-build-baerrors different ts-sim-build-baerrors different ts-sim-build-baerrors different ts-sim-build-ba
get_variable ArealDetector ID_COUNT one_detector errors different ts-sim-build-baerrors different ts-sim-build-baerrors different ts-sim-build-baerrors different ts-sim-build-baerrors different ts-sim-build-baerrors different ts-sim-build-ba
get_variable ArealDetector ID_COUNT two_detectors errors different ts-sim-build-baerrors different ts-sim-build-baerrors different ts-sim-build-baerrors different ts-sim-build-baerrors different ts-sim-build-baerrors different ts-sim-build-ba
get_variable ArealDetector ID_LIST no_detectors errors different ts-sim-build-baerrors different ts-sim-build-baerrors different ts-sim-build-baerrors different ts-sim-build-baerrors different ts-sim-build-baerrors different ts-sim-build-ba
get_variable ArealDetector ID_LIST one_detector errors different ts-sim-build-baerrors different ts-sim-build-baerrors different ts-sim-build-baerrors different ts-sim-build-baerrors different ts-sim-build-baerrors different ts-sim-build-ba
get_variable ArealDetector ID_LIST two_detectors errors different ts-sim-build-baerrors different ts-sim-build-baerrors different ts-sim-build-baerrors different ts-sim-build-baerrors different ts-sim-build-baerrors different ts-sim-build-ba
get_variable ArealDetector VAR_LANE_ID errors different ts-sim-build-baerrors different ts-sim-build-baerrors different ts-sim-build-baerrors different ts-sim-build-baerrors different ts-sim-build-baerrors different ts-sim-build-ba
get_variable ArealDetector VAR_LENGTH errors different ts-sim-build-baerrors different ts-sim-build-baerrors different ts-sim-build-baerrors different ts-sim-build-baerrors different ts-sim-build-baerrors different ts-sim-build-ba
get_variable ArealDetector VAR_POSITION errors different ts-sim-build-baerrors different ts-sim-build-baerrors different ts-sim-build-baerrors different ts-sim-build-baerrors different ts-sim-build-baerrors different ts-sim-build-ba
get_variable ArealDetector errors UnknownAD errors different ts-sim-build-baerrors different ts-sim-build-baerrors different ts-sim-build-baerrors different ts-sim-build-baerrors different ts-sim-build-baerrors different ts-sim-build-ba
get_variable ArealDetector errors UnsupportedVariable errors different ts-sim-build-baerrors different ts-sim-build-baerrors different ts-sim-build-baerrors different ts-sim-build-baerrors different ts-sim-build-baerrors different ts-sim-build-ba
get_variable Edge ID_COUNT errors different ts-sim-build-baerrors different ts-sim-build-baerrors different ts-sim-build-baerrors different ts-sim-build-baerrors different ts-sim-build-baerrors different ts-sim-build-ba
get_variable Edge ID_COUNT_subseconds errors different ts-sim-build-baerrors different ts-sim-build-baerrors different ts-sim-build-baerrors different ts-sim-build-baerrors different ts-sim-build-baerrors different ts-sim-build-ba
get_variable Edge ID_LIST errors different ts-sim-build-baerrors different ts-sim-build-baerrors different ts-sim-build-baerrors different ts-sim-build-baerrors different ts-sim-build-baerrors different ts-sim-build-ba
get_variable Edge ID_LIST_subseconds errors different ts-sim-build-baerrors different ts-sim-build-baerrors different ts-sim-build-baerrors different ts-sim-build-baerrors different ts-sim-build-baerrors different ts-sim-build-ba
get_variable Edge LAST_STEP_LENGTH errors different ts-sim-build-baerrors different ts-sim-build-baerrors different ts-sim-build-baerrors different ts-sim-build-baerrors different ts-sim-build-baerrors different ts-sim-build-ba
get_variable Edge LAST_STEP_LENGTH_subseconds errors different ts-sim-build-baerrors different ts-sim-build-baerrors different ts-sim-build-baerrors different ts-sim-build-baerrors different ts-sim-build-baerrors different ts-sim-build-ba
get_variable Edge LAST_STEP_MEAN_SPEED errors different ts-sim-build-baerrors different ts-sim-build-baerrors different ts-sim-build-baerrors different ts-sim-build-baerrors different ts-sim-build-baerrors different ts-sim-build-ba
get_variable Edge LAST_STEP_MEAN_SPEED_subseconds errors different ts-sim-build-baerrors different ts-sim-build-baerrors different ts-sim-build-baerrors different ts-sim-build-baerrors different ts-sim-build-baerrors different ts-sim-build-ba
get_variable Edge LAST_STEP_OCCUPANCY errors different ts-sim-build-baerrors different ts-sim-build-baerrors different ts-sim-build-baerrors different ts-sim-build-baerrors different ts-sim-build-baerrors different ts-sim-build-ba
get_variable Edge LAST_STEP_OCCUPANCY_subseconds errors different ts-sim-build-baerrors different ts-sim-build-baerrors different ts-sim-build-baerrors different ts-sim-build-baerrors different ts-sim-build-baerrors different ts-sim-build-ba
get_variable Edge LAST_STEP_PERSON_ID_LIST errors different ts-sim-build-baerrors different ts-sim-build-baerrors different ts-sim-build-baerrors different ts-sim-build-baerrors different ts-sim-build-baerrors different ts-sim-build-ba
get_variable Edge LAST_STEP_VEHICLE_HALTING_NUMBER errors different ts-sim-build-baerrors different ts-sim-build-baerrors different ts-sim-build-baerrors different ts-sim-build-baerrors different ts-sim-build-baerrors different ts-sim-build-ba
get_variable Edge LAST_STEP_VEHICLE_HALTING_NUMBER_subseconds errors different ts-sim-build-baerrors different ts-sim-build-baerrors different ts-sim-build-baerrors different ts-sim-build-baerrors different ts-sim-build-baerrors different ts-sim-build-ba
get_variable Edge LAST_STEP_VEHICLE_IDS errors different ts-sim-build-baerrors different ts-sim-build-baerrors different ts-sim-build-baerrors different ts-sim-build-baerrors different ts-sim-build-baerrors different ts-sim-build-ba
get_variable Edge LAST_STEP_VEHICLE_IDS_subseconds errors different ts-sim-build-baerrors different ts-sim-build-baerrors different ts-sim-build-baerrors different ts-sim-build-baerrors different ts-sim-build-baerrors different ts-sim-build-ba
get_variable Edge LAST_STEP_VEHICLE_ID_LIST errors different ts-sim-build-baerrors different ts-sim-build-baerrors different ts-sim-build-baerrors different ts-sim-build-baerrors different ts-sim-build-baerrors different ts-sim-build-ba
get_variable Edge LAST_STEP_VEHICLE_ID_LIST_subseconds errors different ts-sim-build-baerrors different ts-sim-build-baerrors different ts-sim-build-baerrors different ts-sim-build-baerrors different ts-sim-build-baerrors different ts-sim-build-ba
get_variable Edge LAST_STEP_VEHICLE_NUMBER errors different ts-sim-build-baerrors different ts-sim-build-baerrors different ts-sim-build-baerrors different ts-sim-build-baerrors different ts-sim-build-baerrors different ts-sim-build-ba
get_variable Edge LAST_STEP_VEHICLE_NUMBER_subseconds errors different ts-sim-build-baerrors different ts-sim-build-baerrors different ts-sim-build-baerrors different ts-sim-build-baerrors different ts-sim-build-baerrors different ts-sim-build-ba
get_variable Edge VAR_CO2EMISSION errors different ts-sim-build-baerrors different ts-sim-build-baerrors different ts-sim-build-baerrors different ts-sim-build-baerrors different ts-sim-build-baerrors different ts-sim-build-ba
get_variable Edge VAR_CO2EMISSION_subseconds errors different ts-sim-build-baerrors different ts-sim-build-baerrors different ts-sim-build-baerrors different ts-sim-build-baerrors different ts-sim-build-baerrors different ts-sim-build-ba
get_variable Edge VAR_COEMISSION errors different ts-sim-build-baerrors different ts-sim-build-baerrors different ts-sim-build-baerrors different ts-sim-build-baerrors different ts-sim-build-baerrors different ts-sim-build-ba
get_variable Edge VAR_COEMISSION_subseconds errors different ts-sim-build-baerrors different ts-sim-build-baerrors different ts-sim-build-baerrors different ts-sim-build-baerrors different ts-sim-build-baerrors different ts-sim-build-ba
get_variable Edge VAR_CURRENT_TRAVELTIME errors different ts-sim-build-baerrors different ts-sim-build-baerrors different ts-sim-build-baerrors different ts-sim-build-baerrors different ts-sim-build-baerrors different ts-sim-build-ba
get_variable Edge VAR_CURRENT_TRAVELTIME_subseconds errors different ts-sim-build-baerrors different ts-sim-build-baerrors different ts-sim-build-baerrors different ts-sim-build-baerrors different ts-sim-build-baerrors different ts-sim-build-ba
get_variable Edge VAR_EDGE_EFFORT errors different ts-sim-build-baerrors different ts-sim-build-baerrors different ts-sim-build-baerrors different ts-sim-build-baerrors different ts-sim-build-baerrors different ts-sim-build-ba
get_variable Edge VAR_EDGE_EFFORT_subseconds errors different ts-sim-build-baerrors different ts-sim-build-baerrors different ts-sim-build-baerrors different ts-sim-build-baerrors different ts-sim-build-baerrors different ts-sim-build-ba
get_variable Edge VAR_EDGE_TRAVELTIME errors different ts-sim-build-baerrors different ts-sim-build-baerrors different ts-sim-build-baerrors different ts-sim-build-baerrors different ts-sim-build-baerrors different ts-sim-build-ba
get_variable Edge VAR_EDGE_TRAVELTIME_subseconds errors different ts-sim-build-baerrors different ts-sim-build-baerrors different ts-sim-build-baerrors different ts-sim-build-baerrors different ts-sim-build-baerrors different ts-sim-build-ba
get_variable Edge VAR_FUELCONSUMPTION errors different ts-sim-build-baerrors different ts-sim-build-baerrors different ts-sim-build-baerrors different ts-sim-build-baerrors different ts-sim-build-baerrors different ts-sim-build-ba
get_variable Edge VAR_FUELCONSUMPTION_subseconds errors different ts-sim-build-baerrors different ts-sim-build-baerrors different ts-sim-build-baerrors different ts-sim-build-baerrors different ts-sim-build-baerrors different ts-sim-build-ba
get_variable Edge VAR_HCEMISSION errors different ts-sim-build-baerrors different ts-sim-build-baerrors different ts-sim-build-baerrors different ts-sim-build-baerrors different ts-sim-build-baerrors different ts-sim-build-ba
get_variable Edge VAR_HCEMISSION_subseconds errors different ts-sim-build-baerrors different ts-sim-build-baerrors different ts-sim-build-baerrors different ts-sim-build-baerrors different ts-sim-build-baerrors different ts-sim-build-ba
get_variable Edge VAR_NOISEEMISSION errors different ts-sim-build-baerrors different ts-sim-build-baerrors different ts-sim-build-baerrors different ts-sim-build-baerrors different ts-sim-build-baerrors different ts-sim-build-ba
get_variable Edge VAR_NOISEEMISSION_subseconds errors different ts-sim-build-baerrors different ts-sim-build-baerrors different ts-sim-build-baerrors different ts-sim-build-baerrors different ts-sim-build-baerrors different ts-sim-build-ba
get_variable Edge VAR_NOXEMISSION errors different ts-sim-build-baerrors different ts-sim-build-baerrors different ts-sim-build-baerrors different ts-sim-build-baerrors different ts-sim-build-baerrors different ts-sim-build-ba
get_variable Edge VAR_NOXEMISSION_subseconds errors different ts-sim-build-baerrors different ts-sim-build-baerrors different ts-sim-build-baerrors different ts-sim-build-baerrors different ts-sim-build-baerrors different ts-sim-build-ba
get_variable Edge VAR_PMXEMISSION errors different ts-sim-build-baerrors different ts-sim-build-baerrors different ts-sim-build-baerrors different ts-sim-build-baerrors different ts-sim-build-baerrors different ts-sim-build-ba
get_variable Edge VAR_PMXEMISSION_subseconds errors different ts-sim-build-baerrors different ts-sim-build-baerrors different ts-sim-build-baerrors different ts-sim-build-baerrors different ts-sim-build-baerrors different ts-sim-build-ba
get_variable Edge VAR_WAITINGTIME errors different ts-sim-build-baerrors different ts-sim-build-baerrors different ts-sim-build-baerrors different ts-sim-build-baerrors different ts-sim-build-baerrors different ts-sim-build-ba
get_variable Edge errors UnknownID errors different ts-sim-build-baerrors different ts-sim-build-baerrors different ts-sim-build-baerrors different ts-sim-build-baerrors different ts-sim-build-baerrors different ts-sim-build-ba
get_variable Edge errors UnsupportedVariable errors different ts-sim-build-baerrors different ts-sim-build-baerrors different ts-sim-build-baerrors different ts-sim-build-baerrors different ts-sim-build-baerrors different ts-sim-build-ba
get_variable Edge errors_subseconds UnknownID errors different ts-sim-build-baerrors different ts-sim-build-baerrors different ts-sim-build-baerrors different ts-sim-build-baerrors different ts-sim-build-baerrors different ts-sim-build-ba
get_variable Edge errors_subseconds UnsupportedVariable errors different ts-sim-build-baerrors different ts-sim-build-baerrors different ts-sim-build-baerrors different ts-sim-build-baerrors different ts-sim-build-baerrors different ts-sim-build-ba
get_variable InductionLoop ID_COUNT no_detectors errors different ts-sim-build-baerrors different ts-sim-build-baerrors different ts-sim-build-baerrors different ts-sim-build-baerrors different ts-sim-build-baerrors different ts-sim-build-ba
get_variable InductionLoop ID_COUNT one_detector errors different ts-sim-build-baerrors different ts-sim-build-baerrors different ts-sim-build-baerrors different ts-sim-build-baerrors different ts-sim-build-baerrors different ts-sim-build-ba
get_variable InductionLoop ID_COUNT two_detectors errors different ts-sim-build-baerrors different ts-sim-build-baerrors different ts-sim-build-baerrors different ts-sim-build-baerrors different ts-sim-build-baerrors different ts-sim-build-ba
get_variable InductionLoop ID_LIST no_detectors errors different ts-sim-build-baerrors different ts-sim-build-baerrors different ts-sim-build-baerrors different ts-sim-build-baerrors different ts-sim-build-baerrors different ts-sim-build-ba
get_variable InductionLoop ID_LIST one_detector errors different ts-sim-build-baerrors different ts-sim-build-baerrors different ts-sim-build-baerrors different ts-sim-build-baerrors different ts-sim-build-baerrors different ts-sim-build-ba
get_variable InductionLoop ID_LIST two_detectors errors different ts-sim-build-baerrors different ts-sim-build-baerrors different ts-sim-build-baerrors different ts-sim-build-baerrors different ts-sim-build-baerrors different ts-sim-build-ba
get_variable InductionLoop VAR_LANE_ID errors different ts-sim-build-baerrors different ts-sim-build-baerrors different ts-sim-build-baerrors different ts-sim-build-baerrors different ts-sim-build-baerrors different ts-sim-build-ba
get_variable InductionLoop VAR_POSITION errors different ts-sim-build-baerrors different ts-sim-build-baerrors different ts-sim-build-baerrors different ts-sim-build-baerrors different ts-sim-build-baerrors different ts-sim-build-ba
get_variable InductionLoop errors UnknownIL errors different ts-sim-build-baerrors different ts-sim-build-baerrors different ts-sim-build-baerrors different ts-sim-build-baerrors different ts-sim-build-baerrors different ts-sim-build-ba
get_variable InductionLoop errors UnsupportedVariable errors different ts-sim-build-baerrors different ts-sim-build-baerrors different ts-sim-build-baerrors different ts-sim-build-baerrors different ts-sim-build-baerrors different ts-sim-build-ba
get_variable InductionLoop one_vehicle one1s_1vehicle_10m_s errors different ts-sim-build-baerrors different ts-sim-build-baerrors different ts-sim-build-baerrors different ts-sim-build-baerrors different ts-sim-build-baerrors different ts-sim-build-ba
get_variable InductionLoop one_vehicle two10s_1vehicle_10m_s errors different ts-sim-build-baerrors different ts-sim-build-baerrors different ts-sim-build-baerrors different ts-sim-build-baerrors different ts-sim-build-baerrors different ts-sim-build-ba
get_variable InductionLoop one_vehicle two1s_1vehicle_10m_s errors different ts-sim-build-baerrors different ts-sim-build-baerrors different ts-sim-build-baerrors different ts-sim-build-baerrors different ts-sim-build-baerrors different ts-sim-build-ba
get_variable InductionLoop two_vehicles_diff_speed one1s_1vehicle_10m_s errors different ts-sim-build-baerrors different ts-sim-build-baerrors different ts-sim-build-baerrors different ts-sim-build-baerrors different ts-sim-build-baerrors different ts-sim-build-ba
get_variable InductionLoop two_vehicles_diff_speed two10s_1vehicle_10m_s errors different ts-sim-build-baerrors different ts-sim-build-baerrors different ts-sim-build-baerrors different ts-sim-build-baerrors different ts-sim-build-baerrors different ts-sim-build-ba
get_variable InductionLoop two_vehicles_diff_speed two1s_1vehicle_10m_s errors different ts-sim-build-baerrors different ts-sim-build-baerrors different ts-sim-build-baerrors different ts-sim-build-baerrors different ts-sim-build-baerrors different ts-sim-build-ba
get_variable Junction ID_COUNT errors different ts-sim-build-baerrors different ts-sim-build-baerrors different ts-sim-build-baerrors different ts-sim-build-baerrors different ts-sim-build-baerrors different ts-sim-build-ba
get_variable Junction ID_COUNT_subseconds errors different ts-sim-build-baerrors different ts-sim-build-baerrors different ts-sim-build-baerrors different ts-sim-build-baerrors different ts-sim-build-baerrors different ts-sim-build-ba
get_variable Junction ID_LIST errors different ts-sim-build-baerrors different ts-sim-build-baerrors different ts-sim-build-baerrors different ts-sim-build-baerrors different ts-sim-build-baerrors different ts-sim-build-ba
get_variable Junction ID_LIST_subseconds errors different ts-sim-build-baerrors different ts-sim-build-baerrors different ts-sim-build-baerrors different ts-sim-build-baerrors different ts-sim-build-baerrors different ts-sim-build-ba
get_variable Junction VAR_POSITION errors different ts-sim-build-baerrors different ts-sim-build-baerrors different ts-sim-build-baerrors different ts-sim-build-baerrors different ts-sim-build-baerrors different ts-sim-build-ba
get_variable Junction VAR_POSITION_subseconds errors different ts-sim-build-baerrors different ts-sim-build-baerrors different ts-sim-build-baerrors different ts-sim-build-baerrors different ts-sim-build-baerrors different ts-sim-build-ba
get_variable Junction VAR_SHAPE errors different ts-sim-build-baerrors different ts-sim-build-baerrors different ts-sim-build-baerrors different ts-sim-build-baerrors different ts-sim-build-baerrors different ts-sim-build-ba
get_variable Junction VAR_SHAPE_subseconds errors different ts-sim-build-baerrors different ts-sim-build-baerrors different ts-sim-build-baerrors different ts-sim-build-baerrors different ts-sim-build-baerrors different ts-sim-build-ba
get_variable Junction errors UnknownID errors different ts-sim-build-baerrors different ts-sim-build-baerrors different ts-sim-build-baerrors different ts-sim-build-baerrors different ts-sim-build-baerrors different ts-sim-build-ba
get_variable Junction errors UnsupportedVariable errors different ts-sim-build-baerrors different ts-sim-build-baerrors different ts-sim-build-baerrors different ts-sim-build-baerrors different ts-sim-build-baerrors different ts-sim-build-ba
get_variable Junction errors_subseconds UnknownID errors different ts-sim-build-baerrors different ts-sim-build-baerrors different ts-sim-build-baerrors different ts-sim-build-baerrors different ts-sim-build-baerrors different ts-sim-build-ba
get_variable Junction errors_subseconds UnsupportedVariable errors different ts-sim-build-baerrors different ts-sim-build-baerrors different ts-sim-build-baerrors different ts-sim-build-baerrors different ts-sim-build-baerrors different ts-sim-build-ba
get_variable Lane ID_COUNT errors different ts-sim-build-baerrors different ts-sim-build-baerrors different ts-sim-build-baerrors different ts-sim-build-baerrors different ts-sim-build-baerrors different ts-sim-build-ba
get_variable Lane ID_COUNT_subseconds errors different ts-sim-build-baerrors different ts-sim-build-baerrors different ts-sim-build-baerrors different ts-sim-build-baerrors different ts-sim-build-baerrors different ts-sim-build-ba
get_variable Lane ID_LIST errors different ts-sim-build-baerrors different ts-sim-build-baerrors different ts-sim-build-baerrors different ts-sim-build-baerrors different ts-sim-build-baerrors different ts-sim-build-ba
get_variable Lane ID_LIST_subseconds errors different ts-sim-build-baerrors different ts-sim-build-baerrors different ts-sim-build-baerrors different ts-sim-build-baerrors different ts-sim-build-baerrors different ts-sim-build-ba
get_variable Lane LANE_ALLOWED errors different ts-sim-build-baerrors different ts-sim-build-baerrors different ts-sim-build-baerrors different ts-sim-build-baerrors different ts-sim-build-baerrors different ts-sim-build-ba
get_variable Lane LANE_ALLOWED_subseconds errors different ts-sim-build-baerrors different ts-sim-build-baerrors different ts-sim-build-baerrors different ts-sim-build-baerrors different ts-sim-build-baerrors different ts-sim-build-ba
get_variable Lane LANE_DISALLOWED errors different ts-sim-build-baerrors different ts-sim-build-baerrors different ts-sim-build-baerrors different ts-sim-build-baerrors different ts-sim-build-baerrors different ts-sim-build-ba
get_variable Lane LANE_DISALLOWED_subseconds errors different ts-sim-build-baerrors different ts-sim-build-baerrors different ts-sim-build-baerrors different ts-sim-build-baerrors different ts-sim-build-baerrors different ts-sim-build-ba
get_variable Lane LANE_EDGE_ID errors different ts-sim-build-baerrors different ts-sim-build-baerrors different ts-sim-build-baerrors different ts-sim-build-baerrors different ts-sim-build-baerrors different ts-sim-build-ba
get_variable Lane LANE_EDGE_ID_subseconds errors different ts-sim-build-baerrors different ts-sim-build-baerrors different ts-sim-build-baerrors different ts-sim-build-baerrors different ts-sim-build-baerrors different ts-sim-build-ba
get_variable Lane LANE_LINKS errors different ts-sim-build-baerrors different ts-sim-build-baerrors different ts-sim-build-baerrors different ts-sim-build-baerrors different ts-sim-build-baerrors different ts-sim-build-ba
get_variable Lane LANE_LINKS_subseconds errors different ts-sim-build-baerrors different ts-sim-build-baerrors different ts-sim-build-baerrors different ts-sim-build-baerrors different ts-sim-build-baerrors different ts-sim-build-ba
get_variable Lane LANE_LINK_NUMBER errors different ts-sim-build-baerrors different ts-sim-build-baerrors different ts-sim-build-baerrors different ts-sim-build-baerrors different ts-sim-build-baerrors different ts-sim-build-ba
get_variable Lane LANE_LINK_NUMBER_subseconds errors different ts-sim-build-baerrors different ts-sim-build-baerrors different ts-sim-build-baerrors different ts-sim-build-baerrors different ts-sim-build-baerrors different ts-sim-build-ba
get_variable Lane LAST_STEP_LENGTH errors different ts-sim-build-baerrors different ts-sim-build-baerrors different ts-sim-build-baerrors different ts-sim-build-baerrors different ts-sim-build-baerrors different ts-sim-build-ba
get_variable Lane LAST_STEP_LENGTH_subseconds errors different ts-sim-build-baerrors different ts-sim-build-baerrors different ts-sim-build-baerrors different ts-sim-build-baerrors different ts-sim-build-baerrors different ts-sim-build-ba
get_variable Lane LAST_STEP_MEAN_SPEED errors different ts-sim-build-baerrors different ts-sim-build-baerrors different ts-sim-build-baerrors different ts-sim-build-baerrors different ts-sim-build-baerrors different ts-sim-build-ba
get_variable Lane LAST_STEP_MEAN_SPEED_subseconds errors different ts-sim-build-baerrors different ts-sim-build-baerrors different ts-sim-build-baerrors different ts-sim-build-baerrors different ts-sim-build-baerrors different ts-sim-build-ba
get_variable Lane LAST_STEP_OCCUPANCY errors different ts-sim-build-baerrors different ts-sim-build-baerrors different ts-sim-build-baerrors different ts-sim-build-baerrors different ts-sim-build-baerrors different ts-sim-build-ba
get_variable Lane LAST_STEP_OCCUPANCY_subseconds errors different ts-sim-build-baerrors different ts-sim-build-baerrors different ts-sim-build-baerrors different ts-sim-build-baerrors different ts-sim-build-baerrors different ts-sim-build-ba
get_variable Lane LAST_STEP_VEHICLE_HALTING_NUMBER errors different ts-sim-build-baerrors different ts-sim-build-baerrors different ts-sim-build-baerrors different ts-sim-build-baerrors different ts-sim-build-baerrors different ts-sim-build-ba
get_variable Lane LAST_STEP_VEHICLE_HALTING_NUMBER_subseconds errors different ts-sim-build-baerrors different ts-sim-build-baerrors different ts-sim-build-baerrors different ts-sim-build-baerrors different ts-sim-build-baerrors different ts-sim-build-ba
get_variable Lane LAST_STEP_VEHICLE_ID_LIST errors different ts-sim-build-baerrors different ts-sim-build-baerrors different ts-sim-build-baerrors different ts-sim-build-baerrors different ts-sim-build-baerrors different ts-sim-build-ba
get_variable Lane LAST_STEP_VEHICLE_ID_LIST_subseconds errors different ts-sim-build-baerrors different ts-sim-build-baerrors different ts-sim-build-baerrors different ts-sim-build-baerrors different ts-sim-build-baerrors different ts-sim-build-ba
get_variable Lane LAST_STEP_VEHICLE_NUMBER errors different ts-sim-build-baerrors different ts-sim-build-baerrors different ts-sim-build-baerrors different ts-sim-build-baerrors different ts-sim-build-baerrors different ts-sim-build-ba
get_variable Lane LAST_STEP_VEHICLE_NUMBER_subseconds errors different ts-sim-build-baerrors different ts-sim-build-baerrors different ts-sim-build-baerrors different ts-sim-build-baerrors different ts-sim-build-baerrors different ts-sim-build-ba
get_variable Lane VAR_CO2EMISSION errors different ts-sim-build-baerrors different ts-sim-build-baerrors different ts-sim-build-baerrors different ts-sim-build-baerrors different ts-sim-build-baerrors different ts-sim-build-ba
get_variable Lane VAR_CO2EMISSION_subseconds errors different ts-sim-build-baerrors different ts-sim-build-baerrors different ts-sim-build-baerrors different ts-sim-build-baerrors different ts-sim-build-baerrors different ts-sim-build-ba
get_variable Lane VAR_COEMISSION errors different ts-sim-build-baerrors different ts-sim-build-baerrors different ts-sim-build-baerrors different ts-sim-build-baerrors different ts-sim-build-baerrors different ts-sim-build-ba
get_variable Lane VAR_COEMISSION_subseconds errors different ts-sim-build-baerrors different ts-sim-build-baerrors different ts-sim-build-baerrors different ts-sim-build-baerrors different ts-sim-build-baerrors different ts-sim-build-ba
get_variable Lane VAR_CURRENT_TRAVELTIME errors different ts-sim-build-baerrors different ts-sim-build-baerrors different ts-sim-build-baerrors different ts-sim-build-baerrors different ts-sim-build-baerrors different ts-sim-build-ba
get_variable Lane VAR_CURRENT_TRAVELTIME_subseconds errors different ts-sim-build-baerrors different ts-sim-build-baerrors different ts-sim-build-baerrors different ts-sim-build-baerrors different ts-sim-build-baerrors different ts-sim-build-ba
get_variable Lane VAR_FUELCONSUMPTION errors different ts-sim-build-baerrors different ts-sim-build-baerrors different ts-sim-build-baerrors different ts-sim-build-baerrors different ts-sim-build-baerrors different ts-sim-build-ba
get_variable Lane VAR_FUELCONSUMPTION_subseconds errors different ts-sim-build-baerrors different ts-sim-build-baerrors different ts-sim-build-baerrors different ts-sim-build-baerrors different ts-sim-build-baerrors different ts-sim-build-ba
get_variable Lane VAR_HCEMISSION errors different ts-sim-build-baerrors different ts-sim-build-baerrors different ts-sim-build-baerrors different ts-sim-build-baerrors different ts-sim-build-baerrors different ts-sim-build-ba
get_variable Lane VAR_HCEMISSION_subseconds errors different ts-sim-build-baerrors different ts-sim-build-baerrors different ts-sim-build-baerrors different ts-sim-build-baerrors different ts-sim-build-baerrors different ts-sim-build-ba
get_variable Lane VAR_LENGTH errors different ts-sim-build-baerrors different ts-sim-build-baerrors different ts-sim-build-baerrors different ts-sim-build-baerrors different ts-sim-build-baerrors different ts-sim-build-ba
get_variable Lane VAR_LENGTH_subseconds errors different ts-sim-build-baerrors different ts-sim-build-baerrors different ts-sim-build-baerrors different ts-sim-build-baerrors different ts-sim-build-baerrors different ts-sim-build-ba
get_variable Lane VAR_MAXSPEED errors different ts-sim-build-baerrors different ts-sim-build-baerrors different ts-sim-build-baerrors different ts-sim-build-baerrors different ts-sim-build-baerrors different ts-sim-build-ba
get_variable Lane VAR_MAXSPEED_subseconds errors different ts-sim-build-baerrors different ts-sim-build-baerrors different ts-sim-build-baerrors different ts-sim-build-baerrors different ts-sim-build-baerrors different ts-sim-build-ba
get_variable Lane VAR_NOISEEMISSION errors different ts-sim-build-baerrors different ts-sim-build-baerrors different ts-sim-build-baerrors different ts-sim-build-baerrors different ts-sim-build-baerrors different ts-sim-build-ba
get_variable Lane VAR_NOISEEMISSION_subseconds errors different ts-sim-build-baerrors different ts-sim-build-baerrors different ts-sim-build-baerrors different ts-sim-build-baerrors different ts-sim-build-baerrors different ts-sim-build-ba
get_variable Lane VAR_NOXEMISSION errors different ts-sim-build-baerrors different ts-sim-build-baerrors different ts-sim-build-baerrors different ts-sim-build-baerrors different ts-sim-build-baerrors different ts-sim-build-ba
get_variable Lane VAR_NOXEMISSION_subseconds errors different ts-sim-build-baerrors different ts-sim-build-baerrors different ts-sim-build-baerrors different ts-sim-build-baerrors different ts-sim-build-baerrors different ts-sim-build-ba
get_variable Lane VAR_PMXEMISSION errors different ts-sim-build-baerrors different ts-sim-build-baerrors different ts-sim-build-baerrors different ts-sim-build-baerrors different ts-sim-build-baerrors different ts-sim-build-ba
get_variable Lane VAR_PMXEMISSION_subseconds errors different ts-sim-build-baerrors different ts-sim-build-baerrors different ts-sim-build-baerrors different ts-sim-build-baerrors different ts-sim-build-baerrors different ts-sim-build-ba
get_variable Lane VAR_SHAPE errors different ts-sim-build-baerrors different ts-sim-build-baerrors different ts-sim-build-baerrors different ts-sim-build-baerrors different ts-sim-build-baerrors different ts-sim-build-ba
get_variable Lane VAR_SHAPE_subseconds errors different ts-sim-build-baerrors different ts-sim-build-baerrors different ts-sim-build-baerrors different ts-sim-build-baerrors different ts-sim-build-baerrors different ts-sim-build-ba
get_variable Lane VAR_WAITINGTIME errors different ts-sim-build-baerrors different ts-sim-build-baerrors different ts-sim-build-baerrors different ts-sim-build-baerrors different ts-sim-build-baerrors different ts-sim-build-ba
get_variable Lane VAR_WIDTH errors different ts-sim-build-baerrors different ts-sim-build-baerrors different ts-sim-build-baerrors different ts-sim-build-baerrors different ts-sim-build-baerrors different ts-sim-build-ba
get_variable Lane VAR_WIDTH_subseconds errors different ts-sim-build-baerrors different ts-sim-build-baerrors different ts-sim-build-baerrors different ts-sim-build-baerrors different ts-sim-build-baerrors different ts-sim-build-ba
get_variable Lane errors UnknownID errors different ts-sim-build-baerrors different ts-sim-build-baerrors different ts-sim-build-baerrors different ts-sim-build-baerrors different ts-sim-build-baerrors different ts-sim-build-ba
get_variable Lane errors UnsupportedVariable errors different ts-sim-build-baerrors different ts-sim-build-baerrors different ts-sim-build-baerrors different ts-sim-build-baerrors different ts-sim-build-baerrors different ts-sim-build-ba
get_variable Lane errors_subseconds UnknownID errors different ts-sim-build-baerrors different ts-sim-build-baerrors different ts-sim-build-baerrors different ts-sim-build-baerrors different ts-sim-build-baerrors different ts-sim-build-ba
get_variable Lane errors_subseconds UnsupportedVariable errors different ts-sim-build-baerrors different ts-sim-build-baerrors different ts-sim-build-baerrors different ts-sim-build-baerrors different ts-sim-build-baerrors different ts-sim-build-ba
get_variable MeMeDetector ID_COUNT no_detectors errors different ts-sim-build-baerrors different ts-sim-build-baerrors different ts-sim-build-baerrors different ts-sim-build-baerrors different ts-sim-build-baerrors different ts-sim-build-ba
get_variable MeMeDetector ID_COUNT one_detector errors different ts-sim-build-baerrors different ts-sim-build-baerrors different ts-sim-build-baerrors different ts-sim-build-baerrors different ts-sim-build-baerrors different ts-sim-build-ba
get_variable MeMeDetector ID_COUNT two_detectors errors different ts-sim-build-baerrors different ts-sim-build-baerrors different ts-sim-build-baerrors different ts-sim-build-baerrors different ts-sim-build-baerrors different ts-sim-build-ba
get_variable MeMeDetector ID_LIST no_detectors errors different ts-sim-build-baerrors different ts-sim-build-baerrors different ts-sim-build-baerrors different ts-sim-build-baerrors different ts-sim-build-baerrors different ts-sim-build-ba
get_variable MeMeDetector ID_LIST one_detector errors different ts-sim-build-baerrors different ts-sim-build-baerrors different ts-sim-build-baerrors different ts-sim-build-baerrors different ts-sim-build-baerrors different ts-sim-build-ba
get_variable MeMeDetector ID_LIST two_detectors errors different ts-sim-build-baerrors different ts-sim-build-baerrors different ts-sim-build-baerrors different ts-sim-build-baerrors different ts-sim-build-baerrors different ts-sim-build-ba
get_variable MeMeDetector errors UnknownAD errors different ts-sim-build-baerrors different ts-sim-build-baerrors different ts-sim-build-baerrors different ts-sim-build-baerrors different ts-sim-build-baerrors different ts-sim-build-ba
get_variable MeMeDetector errors UnsupportedVariable errors different ts-sim-build-baerrors different ts-sim-build-baerrors different ts-sim-build-baerrors different ts-sim-build-baerrors different ts-sim-build-baerrors different ts-sim-build-ba
get_variable MeMeDetector one_vehicle one1s_1vehicle_10m_s errors different ts-sim-build-baerrors different ts-sim-build-baerrors different ts-sim-build-baerrors different ts-sim-build-baerrors different ts-sim-build-baerrors different ts-sim-build-ba
get_variable MeMeDetector one_vehicle two10s_1vehicle_10m_s errors different ts-sim-build-baerrors different ts-sim-build-baerrors different ts-sim-build-baerrors different ts-sim-build-baerrors different ts-sim-build-baerrors different ts-sim-build-ba
get_variable MeMeDetector one_vehicle two1s_1vehicle_10m_s errors different ts-sim-build-baerrors different ts-sim-build-baerrors different ts-sim-build-baerrors different ts-sim-build-baerrors different ts-sim-build-baerrors different ts-sim-build-ba
get_variable MeMeDetector two_vehicles_diff_speed one1s_1vehicle_10m_s errors different ts-sim-build-baerrors different ts-sim-build-baerrors different ts-sim-build-baerrors different ts-sim-build-baerrors different ts-sim-build-baerrors different ts-sim-build-ba
get_variable MeMeDetector two_vehicles_diff_speed two10s_10m_s_near errors different ts-sim-build-baerrors different ts-sim-build-baerrors different ts-sim-build-baerrors different ts-sim-build-baerrors different ts-sim-build-baerrors different ts-sim-build-ba
get_variable MeMeDetector two_vehicles_diff_speed two10s_1vehicle_10m_s errors different ts-sim-build-baerrors different ts-sim-build-baerrors different ts-sim-build-baerrors different ts-sim-build-baerrors different ts-sim-build-baerrors different ts-sim-build-ba
get_variable MeMeDetector two_vehicles_diff_speed two1s_10m_s_near errors different ts-sim-build-baerrors different ts-sim-build-baerrors different ts-sim-build-baerrors different ts-sim-build-baerrors different ts-sim-build-baerrors different ts-sim-build-ba
get_variable MeMeDetector two_vehicles_diff_speed two1s_1vehicle_10m_s errors different ts-sim-build-baerrors different ts-sim-build-baerrors different ts-sim-build-baerrors different ts-sim-build-baerrors different ts-sim-build-baerrors different ts-sim-build-ba
get_variable POI ID_COUNT errors different ts-sim-build-baerrors different ts-sim-build-baerrors different ts-sim-build-baerrors different ts-sim-build-baerrors different ts-sim-build-baerrors different ts-sim-build-ba
get_variable POI ID_COUNT_subseconds errors different ts-sim-build-baerrors different ts-sim-build-baerrors different ts-sim-build-baerrors different ts-sim-build-baerrors different ts-sim-build-baerrors different ts-sim-build-ba
get_variable POI ID_LIST errors different ts-sim-build-baerrors different ts-sim-build-baerrors different ts-sim-build-baerrors different ts-sim-build-baerrors different ts-sim-build-baerrors different ts-sim-build-ba
get_variable POI ID_LIST_subseconds errors different ts-sim-build-baerrors different ts-sim-build-baerrors different ts-sim-build-baerrors different ts-sim-build-baerrors different ts-sim-build-baerrors different ts-sim-build-ba
get_variable POI VAR_COLOR errors different ts-sim-build-baerrors different ts-sim-build-baerrors different ts-sim-build-baerrors different ts-sim-build-baerrors different ts-sim-build-baerrors different ts-sim-build-ba
get_variable POI VAR_COLOR_subseconds errors different ts-sim-build-baerrors different ts-sim-build-baerrors different ts-sim-build-baerrors different ts-sim-build-baerrors different ts-sim-build-baerrors different ts-sim-build-ba
get_variable POI VAR_POSITION errors different ts-sim-build-baerrors different ts-sim-build-baerrors different ts-sim-build-baerrors different ts-sim-build-baerrors different ts-sim-build-baerrors different ts-sim-build-ba
get_variable POI VAR_POSITION_subseconds errors different ts-sim-build-baerrors different ts-sim-build-baerrors different ts-sim-build-baerrors different ts-sim-build-baerrors different ts-sim-build-baerrors different ts-sim-build-ba
get_variable POI VAR_TYPE errors different ts-sim-build-baerrors different ts-sim-build-baerrors different ts-sim-build-baerrors different ts-sim-build-baerrors different ts-sim-build-baerrors different ts-sim-build-ba
get_variable POI VAR_TYPE_subseconds errors different ts-sim-build-baerrors different ts-sim-build-baerrors different ts-sim-build-baerrors different ts-sim-build-baerrors different ts-sim-build-baerrors different ts-sim-build-ba
get_variable POI errors UnknownID errors different ts-sim-build-baerrors different ts-sim-build-baerrors different ts-sim-build-baerrors different ts-sim-build-baerrors different ts-sim-build-baerrors different ts-sim-build-ba
get_variable POI errors UnsupportedVariable errors different ts-sim-build-baerrors different ts-sim-build-baerrors different ts-sim-build-baerrors different ts-sim-build-baerrors different ts-sim-build-baerrors different ts-sim-build-ba
get_variable POI errors_subseconds UnknownID errors different ts-sim-build-baerrors different ts-sim-build-baerrors different ts-sim-build-baerrors different ts-sim-build-baerrors different ts-sim-build-baerrors different ts-sim-build-ba
get_variable POI errors_subseconds UnsupportedVariable errors different ts-sim-build-baerrors different ts-sim-build-baerrors different ts-sim-build-baerrors different ts-sim-build-baerrors different ts-sim-build-baerrors different ts-sim-build-ba
get_variable Person ID_COUNT errors different ts-sim-build-baerrors different ts-sim-build-baerrors different ts-sim-build-baerrors different ts-sim-build-baerrors different ts-sim-build-baerrors different ts-sim-build-ba
get_variable Person ID_COUNT_subseconds errors different ts-sim-build-baerrors different ts-sim-build-baerrors different ts-sim-build-baerrors different ts-sim-build-baerrors different ts-sim-build-baerrors different ts-sim-build-ba
get_variable Person ID_LIST errors different ts-sim-build-baerrors different ts-sim-build-baerrors different ts-sim-build-baerrors different ts-sim-build-baerrors different ts-sim-build-baerrors different ts-sim-build-ba
get_variable Person ID_LIST_subseconds errors different ts-sim-build-baerrors different ts-sim-build-baerrors different ts-sim-build-baerrors different ts-sim-build-baerrors different ts-sim-build-baerrors different ts-sim-build-ba
get_variable Person VAR_ANGLE errors different ts-sim-build-baerrors different ts-sim-build-baerrors different ts-sim-build-baerrors different ts-sim-build-baerrors different ts-sim-build-baerrors different ts-sim-build-ba
get_variable Person VAR_ANGLE_subseconds errors different ts-sim-build-baerrors different ts-sim-build-baerrors different ts-sim-build-baerrors different ts-sim-build-baerrors different ts-sim-build-baerrors different ts-sim-build-ba
get_variable Person VAR_COLOR errors different ts-sim-build-baerrors different ts-sim-build-baerrors different ts-sim-build-baerrors different ts-sim-build-baerrors different ts-sim-build-baerrors different ts-sim-build-ba
get_variable Person VAR_COLOR_subseconds errors different ts-sim-build-baerrors different ts-sim-build-baerrors different ts-sim-build-baerrors different ts-sim-build-baerrors different ts-sim-build-baerrors different ts-sim-build-ba
get_variable Person VAR_LANEPOSITION errors different ts-sim-build-baerrors different ts-sim-build-baerrors different ts-sim-build-baerrors different ts-sim-build-baerrors different ts-sim-build-baerrors different ts-sim-build-ba
get_variable Person VAR_LANEPOSITION_subseconds errors different ts-sim-build-baerrors different ts-sim-build-baerrors different ts-sim-build-baerrors different ts-sim-build-baerrors different ts-sim-build-baerrors different ts-sim-build-ba
get_variable Person VAR_NEXT_EDGE errors different ts-sim-build-baerrors different ts-sim-build-baerrors different ts-sim-build-baerrors different ts-sim-build-baerrors different ts-sim-build-baerrors different ts-sim-build-ba
get_variable Person VAR_POSITION errors different ts-sim-build-baerrors different ts-sim-build-baerrors different ts-sim-build-baerrors different ts-sim-build-baerrors different ts-sim-build-baerrors different ts-sim-build-ba
get_variable Person VAR_POSITION3D errors different ts-sim-build-baerrors different ts-sim-build-baerrors different ts-sim-build-baerrors different ts-sim-build-baerrors different ts-sim-build-baerrors different ts-sim-build-ba
get_variable Person VAR_POSITION3D_subseconds errors different ts-sim-build-baerrors different ts-sim-build-baerrors different ts-sim-build-baerrors different ts-sim-build-baerrors different ts-sim-build-baerrors different ts-sim-build-ba
get_variable Person VAR_POSITION_subseconds errors different ts-sim-build-baerrors different ts-sim-build-baerrors different ts-sim-build-baerrors different ts-sim-build-baerrors different ts-sim-build-baerrors different ts-sim-build-ba
get_variable Person VAR_ROAD_ID errors different ts-sim-build-baerrors different ts-sim-build-baerrors different ts-sim-build-baerrors different ts-sim-build-baerrors different ts-sim-build-baerrors different ts-sim-build-ba
get_variable Person VAR_ROAD_ID_subseconds errors different ts-sim-build-baerrors different ts-sim-build-baerrors different ts-sim-build-baerrors different ts-sim-build-baerrors different ts-sim-build-baerrors different ts-sim-build-ba
get_variable Person VAR_SPEED errors different ts-sim-build-baerrors different ts-sim-build-baerrors different ts-sim-build-baerrors different ts-sim-build-baerrors different ts-sim-build-baerrors different ts-sim-build-ba
get_variable Person VAR_SPEED_subseconds errors different ts-sim-build-baerrors different ts-sim-build-baerrors different ts-sim-build-baerrors different ts-sim-build-baerrors different ts-sim-build-baerrors different ts-sim-build-ba
get_variable Person VAR_TYPE errors different ts-sim-build-baerrors different ts-sim-build-baerrors different ts-sim-build-baerrors different ts-sim-build-baerrors different ts-sim-build-baerrors different ts-sim-build-ba
get_variable Person VAR_TYPE_subseconds errors different ts-sim-build-baerrors different ts-sim-build-baerrors different ts-sim-build-baerrors different ts-sim-build-baerrors different ts-sim-build-baerrors different ts-sim-build-ba
get_variable Person VAR_WAITINGTIME errors different ts-sim-build-baerrors different ts-sim-build-baerrors different ts-sim-build-baerrors different ts-sim-build-baerrors different ts-sim-build-baerrors different ts-sim-build-ba
get_variable Person errors UnknownID errors different ts-sim-build-baerrors different ts-sim-build-baerrors different ts-sim-build-baerrors different ts-sim-build-baerrors different ts-sim-build-baerrors different ts-sim-build-ba
get_variable Person errors UnsupportedVariable errors different ts-sim-build-baerrors different ts-sim-build-baerrors different ts-sim-build-baerrors different ts-sim-build-baerrors different ts-sim-build-baerrors different ts-sim-build-ba
get_variable Person errors_subseconds UnknownID errors different ts-sim-build-baerrors different ts-sim-build-baerrors different ts-sim-build-baerrors different ts-sim-build-baerrors different ts-sim-build-baerrors different ts-sim-build-ba
get_variable Person errors_subseconds UnsupportedVariable errors different ts-sim-build-baerrors different ts-sim-build-baerrors different ts-sim-build-baerrors different ts-sim-build-baerrors different ts-sim-build-baerrors different ts-sim-build-ba
get_variable Polygon ID_COUNT errors different ts-sim-build-baerrors different ts-sim-build-baerrors different ts-sim-build-baerrors different ts-sim-build-baerrors different ts-sim-build-baerrors different ts-sim-build-ba
get_variable Polygon ID_COUNT_subseconds errors different ts-sim-build-baerrors different ts-sim-build-baerrors different ts-sim-build-baerrors different ts-sim-build-baerrors different ts-sim-build-baerrors different ts-sim-build-ba
get_variable Polygon ID_LIST errors different ts-sim-build-baerrors different ts-sim-build-baerrors different ts-sim-build-baerrors different ts-sim-build-baerrors different ts-sim-build-baerrors different ts-sim-build-ba
get_variable Polygon ID_LIST_subseconds errors different ts-sim-build-baerrors different ts-sim-build-baerrors different ts-sim-build-baerrors different ts-sim-build-baerrors different ts-sim-build-baerrors different ts-sim-build-ba
get_variable Polygon VAR_COLOR errors different ts-sim-build-baerrors different ts-sim-build-baerrors different ts-sim-build-baerrors different ts-sim-build-baerrors different ts-sim-build-baerrors different ts-sim-build-ba
get_variable Polygon VAR_COLOR_subseconds errors different ts-sim-build-baerrors different ts-sim-build-baerrors different ts-sim-build-baerrors different ts-sim-build-baerrors different ts-sim-build-baerrors different ts-sim-build-ba
get_variable Polygon VAR_FILL errors different ts-sim-build-baerrors different ts-sim-build-baerrors different ts-sim-build-baerrors different ts-sim-build-baerrors different ts-sim-build-baerrors different ts-sim-build-ba
get_variable Polygon VAR_FILL_subseconds errors different ts-sim-build-baerrors different ts-sim-build-baerrors different ts-sim-build-baerrors different ts-sim-build-baerrors different ts-sim-build-baerrors different ts-sim-build-ba
get_variable Polygon VAR_SHAPE errors different ts-sim-build-baerrors different ts-sim-build-baerrors different ts-sim-build-baerrors different ts-sim-build-baerrors different ts-sim-build-baerrors different ts-sim-build-ba
get_variable Polygon VAR_SHAPE_subseconds errors different ts-sim-build-baerrors different ts-sim-build-baerrors different ts-sim-build-baerrors different ts-sim-build-baerrors different ts-sim-build-baerrors different ts-sim-build-ba
get_variable Polygon VAR_TYPE errors different ts-sim-build-baerrors different ts-sim-build-baerrors different ts-sim-build-baerrors different ts-sim-build-baerrors different ts-sim-build-baerrors different ts-sim-build-ba
get_variable Polygon VAR_TYPE_subseconds errors different ts-sim-build-baerrors different ts-sim-build-baerrors different ts-sim-build-baerrors different ts-sim-build-baerrors different ts-sim-build-baerrors different ts-sim-build-ba
get_variable Polygon errors UnknownID errors different ts-sim-build-baerrors different ts-sim-build-baerrors different ts-sim-build-baerrors different ts-sim-build-baerrors different ts-sim-build-baerrors different ts-sim-build-ba
get_variable Polygon errors UnsupportedVariable errors different ts-sim-build-baerrors different ts-sim-build-baerrors different ts-sim-build-baerrors different ts-sim-build-baerrors different ts-sim-build-baerrors different ts-sim-build-ba
get_variable Polygon errors_subseconds UnknownID errors different ts-sim-build-baerrors different ts-sim-build-baerrors different ts-sim-build-baerrors different ts-sim-build-baerrors different ts-sim-build-baerrors different ts-sim-build-ba
get_variable Polygon errors_subseconds UnsupportedVariable errors different ts-sim-build-baerrors different ts-sim-build-baerrors different ts-sim-build-baerrors different ts-sim-build-baerrors different ts-sim-build-baerrors different ts-sim-build-ba
get_variable Route ID_COUNT errors different ts-sim-build-baerrors different ts-sim-build-baerrors different ts-sim-build-baerrors different ts-sim-build-baerrors different ts-sim-build-baerrors different ts-sim-build-ba
get_variable Route ID_COUNT_subseconds errors different ts-sim-build-baerrors different ts-sim-build-baerrors different ts-sim-build-baerrors different ts-sim-build-baerrors different ts-sim-build-baerrors different ts-sim-build-ba
get_variable Route ID_LIST errors different ts-sim-build-baerrors different ts-sim-build-baerrors different ts-sim-build-baerrors different ts-sim-build-baerrors different ts-sim-build-baerrors different ts-sim-build-ba
get_variable Route ID_LIST_subseconds errors different ts-sim-build-baerrors different ts-sim-build-baerrors different ts-sim-build-baerrors different ts-sim-build-baerrors different ts-sim-build-baerrors different ts-sim-build-ba
get_variable Route VAR_EDGES errors different ts-sim-build-baerrors different ts-sim-build-baerrors different ts-sim-build-baerrors different ts-sim-build-baerrors different ts-sim-build-baerrors different ts-sim-build-ba
get_variable Route VAR_EDGES_subseconds errors different ts-sim-build-baerrors different ts-sim-build-baerrors different ts-sim-build-baerrors different ts-sim-build-baerrors different ts-sim-build-baerrors different ts-sim-build-ba
get_variable Route errors UnknownID errors different ts-sim-build-baerrors different ts-sim-build-baerrors different ts-sim-build-baerrors different ts-sim-build-baerrors different ts-sim-build-baerrors different ts-sim-build-ba
get_variable Route errors UnsupportedVariable errors different ts-sim-build-baerrors different ts-sim-build-baerrors different ts-sim-build-baerrors different ts-sim-build-baerrors different ts-sim-build-baerrors different ts-sim-build-ba
get_variable Route errors_subseconds UnknownID errors different ts-sim-build-baerrors different ts-sim-build-baerrors different ts-sim-build-baerrors different ts-sim-build-baerrors different ts-sim-build-baerrors different ts-sim-build-ba
get_variable Route errors_subseconds UnsupportedVariable errors different ts-sim-build-baerrors different ts-sim-build-baerrors different ts-sim-build-baerrors different ts-sim-build-baerrors different ts-sim-build-baerrors different ts-sim-build-ba
get_variable Simulation DISTANCE_REQUEST 3D3DAir errors different ts-sim-build-baerrors different ts-sim-build-baerrors different ts-sim-build-baerrors different ts-sim-build-baerrors different ts-sim-build-baerrors different ts-sim-build-ba
get_variable Simulation DISTANCE_REQUEST 3D3DDrive errors different ts-sim-build-baerrors different ts-sim-build-baerrors different ts-sim-build-baerrors different ts-sim-build-baerrors different ts-sim-build-baerrors different ts-sim-build-ba
get_variable Simulation DISTANCE_REQUEST 3DRoadPosAir errors different ts-sim-build-baerrors different ts-sim-build-baerrors different ts-sim-build-baerrors different ts-sim-build-baerrors different ts-sim-build-baerrors different ts-sim-build-ba
get_variable Simulation DISTANCE_REQUEST 3DRoadpPosDrive errors different ts-sim-build-baerrors different ts-sim-build-baerrors different ts-sim-build-baerrors different ts-sim-build-baerrors different ts-sim-build-baerrors different ts-sim-build-ba
get_variable Simulation DISTANCE_REQUEST RoadPos3DAir errors different ts-sim-build-baerrors different ts-sim-build-baerrors different ts-sim-build-baerrors different ts-sim-build-baerrors different ts-sim-build-baerrors different ts-sim-build-ba
get_variable Simulation DISTANCE_REQUEST RoadPos3DDrive errors different ts-sim-build-baerrors different ts-sim-build-baerrors different ts-sim-build-baerrors different ts-sim-build-baerrors different ts-sim-build-baerrors different ts-sim-build-ba
get_variable Simulation DISTANCE_REQUEST RoadPosRoadPosAir errors different ts-sim-build-baerrors different ts-sim-build-baerrors different ts-sim-build-baerrors different ts-sim-build-baerrors different ts-sim-build-baerrors different ts-sim-build-ba
get_variable Simulation DISTANCE_REQUEST RoadPosRoadPosDrive errors different ts-sim-build-baerrors different ts-sim-build-baerrors different ts-sim-build-baerrors different ts-sim-build-baerrors different ts-sim-build-baerrors different ts-sim-build-ba
get_variable Simulation POSITION_CONVERSION 2DToRoadPos errors different ts-sim-build-baerrors different ts-sim-build-baerrors different ts-sim-build-baerrors different ts-sim-build-baerrors different ts-sim-build-baerrors different ts-sim-build-ba
get_variable Simulation POSITION_CONVERSION 3DToRoadPos errors different ts-sim-build-baerrors different ts-sim-build-baerrors different ts-sim-build-baerrors different ts-sim-build-baerrors different ts-sim-build-baerrors different ts-sim-build-ba
get_variable Simulation POSITION_CONVERSION InvalidLaneId errors different ts-sim-build-baerrors different ts-sim-build-baerrors different ts-sim-build-baerrors different ts-sim-build-baerrors different ts-sim-build-baerrors different ts-sim-build-ba
get_variable Simulation POSITION_CONVERSION InvalidPosOnRoad errors different ts-sim-build-baerrors different ts-sim-build-baerrors different ts-sim-build-baerrors different ts-sim-build-baerrors different ts-sim-build-baerrors different ts-sim-build-ba
get_variable Simulation POSITION_CONVERSION InvalidRoadId errors different ts-sim-build-baerrors different ts-sim-build-baerrors different ts-sim-build-baerrors different ts-sim-build-baerrors different ts-sim-build-baerrors different ts-sim-build-ba
get_variable Simulation POSITION_CONVERSION RoadPosTo2D errors different ts-sim-build-baerrors different ts-sim-build-baerrors different ts-sim-build-baerrors different ts-sim-build-baerrors different ts-sim-build-baerrors different ts-sim-build-ba
get_variable Simulation POSITION_CONVERSION RoadPosTo3D errors different ts-sim-build-baerrors different ts-sim-build-baerrors different ts-sim-build-baerrors different ts-sim-build-baerrors different ts-sim-build-baerrors different ts-sim-build-ba
get_variable Simulation POSITION_CONVERSION SameType3D errors different ts-sim-build-baerrors different ts-sim-build-baerrors different ts-sim-build-baerrors different ts-sim-build-baerrors different ts-sim-build-baerrors different ts-sim-build-ba
get_variable Simulation POSITION_CONVERSION SameTypeRoadPos errors different ts-sim-build-baerrors different ts-sim-build-baerrors different ts-sim-build-baerrors different ts-sim-build-baerrors different ts-sim-build-baerrors different ts-sim-build-ba
get_variable Simulation VAR_TIME_STEP errors different ts-sim-build-baerrors different ts-sim-build-baerrors different ts-sim-build-baerrors different ts-sim-build-baerrors different ts-sim-build-baerrors different ts-sim-build-ba
get_variable Simulation errors UnsupportedVariable errors different ts-sim-build-baerrors different ts-sim-build-baerrors different ts-sim-build-baerrors different ts-sim-build-baerrors different ts-sim-build-baerrors different ts-sim-build-ba
get_variable Simulation vehicle_state_changes VAR_ARRIVED_VEHICLES_IDS errors different ts-sim-build-baerrors different ts-sim-build-baerrors different ts-sim-build-baerrors different ts-sim-build-baerrors different ts-sim-build-baerrors different ts-sim-build-ba
get_variable Simulation vehicle_state_changes VAR_ARRIVED_VEHICLES_NUMBER errors different ts-sim-build-baerrors different ts-sim-build-baerrors different ts-sim-build-baerrors different ts-sim-build-baerrors different ts-sim-build-baerrors different ts-sim-build-ba
get_variable Simulation vehicle_state_changes VAR_DEPARTED_VEHICLES_IDS errors different ts-sim-build-baerrors different ts-sim-build-baerrors different ts-sim-build-baerrors different ts-sim-build-baerrors different ts-sim-build-baerrors different ts-sim-build-ba
get_variable Simulation vehicle_state_changes VAR_DEPARTED_VEHICLES_NUMBER errors different ts-sim-build-baerrors different ts-sim-build-baerrors different ts-sim-build-baerrors different ts-sim-build-baerrors different ts-sim-build-baerrors different ts-sim-build-ba
get_variable Simulation vehicle_state_changes VAR_LOADED_VEHICLES_IDS errors different ts-sim-build-baerrors different ts-sim-build-baerrors different ts-sim-build-baerrors different ts-sim-build-baerrors different ts-sim-build-baerrors different ts-sim-build-ba
get_variable Simulation vehicle_state_changes VAR_LOADED_VEHICLES_NUMBER errors different ts-sim-build-baerrors different ts-sim-build-baerrors different ts-sim-build-baerrors different ts-sim-build-baerrors different ts-sim-build-baerrors different ts-sim-build-ba
get_variable Simulation vehicle_state_changes VAR_PARKING_ENDING_VEHICLES_IDS errors different ts-sim-build-baerrors different ts-sim-build-baerrors different ts-sim-build-baerrors different ts-sim-build-baerrors different ts-sim-build-baerrors different ts-sim-build-ba
get_variable Simulation vehicle_state_changes VAR_PARKING_ENDING_VEHICLES_NUMBER errors different ts-sim-build-baerrors different ts-sim-build-baerrors different ts-sim-build-baerrors different ts-sim-build-baerrors different ts-sim-build-baerrors different ts-sim-build-ba
get_variable Simulation vehicle_state_changes VAR_PARKING_STARTING_VEHICLES_IDS errors different ts-sim-build-baerrors different ts-sim-build-baerrors different ts-sim-build-baerrors different ts-sim-build-baerrors different ts-sim-build-baerrors different ts-sim-build-ba
get_variable Simulation vehicle_state_changes VAR_PARKING_STARTING_VEHICLES_NUMBER errors different ts-sim-build-baerrors different ts-sim-build-baerrors different ts-sim-build-baerrors different ts-sim-build-baerrors different ts-sim-build-baerrors different ts-sim-build-ba
get_variable Simulation vehicle_state_changes VAR_STOP_ENDING_VEHICLES_IDS errors different ts-sim-build-baerrors different ts-sim-build-baerrors different ts-sim-build-baerrors different ts-sim-build-baerrors different ts-sim-build-baerrors different ts-sim-build-ba
get_variable Simulation vehicle_state_changes VAR_STOP_ENDING_VEHICLES_NUMBER errors different ts-sim-build-baerrors different ts-sim-build-baerrors different ts-sim-build-baerrors different ts-sim-build-baerrors different ts-sim-build-baerrors different ts-sim-build-ba
get_variable Simulation vehicle_state_changes VAR_STOP_STARTING_VEHICLES_IDS errors different ts-sim-build-baerrors different ts-sim-build-baerrors different ts-sim-build-baerrors different ts-sim-build-baerrors different ts-sim-build-baerrors different ts-sim-build-ba
get_variable Simulation vehicle_state_changes VAR_STOP_STARTING_VEHICLES_NUMBER errors different ts-sim-build-baerrors different ts-sim-build-baerrors different ts-sim-build-baerrors different ts-sim-build-baerrors different ts-sim-build-baerrors different ts-sim-build-ba
get_variable Simulation vehicle_state_changes VAR_TELEPORT_ENDING_VEHICLES_IDS errors different ts-sim-build-baerrors different ts-sim-build-baerrors different ts-sim-build-baerrors different ts-sim-build-baerrors different ts-sim-build-baerrors different ts-sim-build-ba
get_variable Simulation vehicle_state_changes VAR_TELEPORT_ENDING_VEHICLES_NUMBER errors different ts-sim-build-baerrors different ts-sim-build-baerrors different ts-sim-build-baerrors different ts-sim-build-baerrors different ts-sim-build-baerrors different ts-sim-build-ba
get_variable Simulation vehicle_state_changes VAR_TELEPORT_STARTING_VEHICLES_IDS errors different ts-sim-build-baerrors different ts-sim-build-baerrors different ts-sim-build-baerrors different ts-sim-build-baerrors different ts-sim-build-baerrors different ts-sim-build-ba
get_variable Simulation vehicle_state_changes VAR_TELEPORT_STARTING_VEHICLES_NUMBER errors different ts-sim-build-baerrors different ts-sim-build-baerrors different ts-sim-build-baerrors different ts-sim-build-baerrors different ts-sim-build-baerrors different ts-sim-build-ba
get_variable TrafficLight ID_COUNT no_tl errors different ts-sim-build-baerrors different ts-sim-build-baerrors different ts-sim-build-baerrors different ts-sim-build-baerrors different ts-sim-build-baerrors different ts-sim-build-ba
get_variable TrafficLight ID_COUNT one_tl errors different ts-sim-build-baerrors different ts-sim-build-baerrors different ts-sim-build-baerrors different ts-sim-build-baerrors different ts-sim-build-baerrors different ts-sim-build-ba
get_variable TrafficLight ID_COUNT two_tl errors different ts-sim-build-baerrors different ts-sim-build-baerrors different ts-sim-build-baerrors different ts-sim-build-baerrors different ts-sim-build-baerrors different ts-sim-build-ba
get_variable TrafficLight ID_COUNT_subseconds no_tl errors different ts-sim-build-baerrors different ts-sim-build-baerrors different ts-sim-build-baerrors different ts-sim-build-baerrors different ts-sim-build-baerrors different ts-sim-build-ba
get_variable TrafficLight ID_COUNT_subseconds one_tl errors different ts-sim-build-baerrors different ts-sim-build-baerrors different ts-sim-build-baerrors different ts-sim-build-baerrors different ts-sim-build-baerrors different ts-sim-build-ba
get_variable TrafficLight ID_COUNT_subseconds two_tl errors different ts-sim-build-baerrors different ts-sim-build-baerrors different ts-sim-build-baerrors different ts-sim-build-baerrors different ts-sim-build-baerrors different ts-sim-build-ba
get_variable TrafficLight ID_LIST no_tl errors different ts-sim-build-baerrors different ts-sim-build-baerrors different ts-sim-build-baerrors different ts-sim-build-baerrors different ts-sim-build-baerrors different ts-sim-build-ba
get_variable TrafficLight ID_LIST one_tl errors different ts-sim-build-baerrors different ts-sim-build-baerrors different ts-sim-build-baerrors different ts-sim-build-baerrors different ts-sim-build-baerrors different ts-sim-build-ba
get_variable TrafficLight ID_LIST two_tl errors different ts-sim-build-baerrors different ts-sim-build-baerrors different ts-sim-build-baerrors different ts-sim-build-baerrors different ts-sim-build-baerrors different ts-sim-build-ba
get_variable TrafficLight ID_LIST_subseconds no_tl errors different ts-sim-build-baerrors different ts-sim-build-baerrors different ts-sim-build-baerrors different ts-sim-build-baerrors different ts-sim-build-baerrors different ts-sim-build-ba
get_variable TrafficLight ID_LIST_subseconds one_tl errors different ts-sim-build-baerrors different ts-sim-build-baerrors different ts-sim-build-baerrors different ts-sim-build-baerrors different ts-sim-build-baerrors different ts-sim-build-ba
get_variable TrafficLight ID_LIST_subseconds two_tl errors different ts-sim-build-baerrors different ts-sim-build-baerrors different ts-sim-build-baerrors different ts-sim-build-baerrors different ts-sim-build-baerrors different ts-sim-build-ba
get_variable TrafficLight TL_CURRENT_PHASE errors different ts-sim-build-baerrors different ts-sim-build-baerrors different ts-sim-build-baerrors different ts-sim-build-baerrors different ts-sim-build-baerrors different ts-sim-build-ba
get_variable TrafficLight TL_CURRENT_PHASE_subseconds errors different ts-sim-build-baerrors different ts-sim-build-baerrors different ts-sim-build-baerrors different ts-sim-build-baerrors different ts-sim-build-baerrors different ts-sim-build-ba
get_variable TrafficLight TL_CURRENT_PROGRAM errors different ts-sim-build-baerrors different ts-sim-build-baerrors different ts-sim-build-baerrors different ts-sim-build-baerrors different ts-sim-build-baerrors different ts-sim-build-ba
get_variable TrafficLight TL_CURRENT_PROGRAM_subseconds errors different ts-sim-build-baerrors different ts-sim-build-baerrors different ts-sim-build-baerrors different ts-sim-build-baerrors different ts-sim-build-baerrors different ts-sim-build-ba
get_variable TrafficLight TL_DURATION errors different ts-sim-build-baerrors different ts-sim-build-baerrors different ts-sim-build-baerrors different ts-sim-build-baerrors different ts-sim-build-baerrors different ts-sim-build-ba
get_variable TrafficLight TL_DURATION_subseconds errors different ts-sim-build-baerrors different ts-sim-build-baerrors different ts-sim-build-baerrors different ts-sim-build-baerrors different ts-sim-build-baerrors different ts-sim-build-ba
get_variable TrafficLight TL_LANES errors different ts-sim-build-baerrors different ts-sim-build-baerrors different ts-sim-build-baerrors different ts-sim-build-baerrors different ts-sim-build-baerrors different ts-sim-build-ba
get_variable TrafficLight TL_LANES_subseconds errors different ts-sim-build-baerrors different ts-sim-build-baerrors different ts-sim-build-baerrors different ts-sim-build-baerrors different ts-sim-build-baerrors different ts-sim-build-ba
get_variable TrafficLight TL_LINKS errors different ts-sim-build-baerrors different ts-sim-build-baerrors different ts-sim-build-baerrors different ts-sim-build-baerrors different ts-sim-build-baerrors different ts-sim-build-ba
get_variable TrafficLight TL_LINKS_subseconds errors different ts-sim-build-baerrors different ts-sim-build-baerrors different ts-sim-build-baerrors different ts-sim-build-baerrors different ts-sim-build-baerrors different ts-sim-build-ba
get_variable TrafficLight TL_NEXT_SWITCH errors different ts-sim-build-baerrors different ts-sim-build-baerrors different ts-sim-build-baerrors different ts-sim-build-baerrors different ts-sim-build-baerrors different ts-sim-build-ba
get_variable TrafficLight TL_NEXT_SWITCH_subseconds errors different ts-sim-build-baerrors different ts-sim-build-baerrors different ts-sim-build-baerrors different ts-sim-build-baerrors different ts-sim-build-baerrors different ts-sim-build-ba
get_variable TrafficLight TL_RYG_COMPLETE errors different ts-sim-build-baerrors different ts-sim-build-baerrors different ts-sim-build-baerrors different ts-sim-build-baerrors different ts-sim-build-baerrors different ts-sim-build-ba
get_variable TrafficLight TL_RYG_COMPLETE_subseconds errors different ts-sim-build-baerrors different ts-sim-build-baerrors different ts-sim-build-baerrors different ts-sim-build-baerrors different ts-sim-build-baerrors different ts-sim-build-ba
get_variable TrafficLight TL_RYG_STATE errors different ts-sim-build-baerrors different ts-sim-build-baerrors different ts-sim-build-baerrors different ts-sim-build-baerrors different ts-sim-build-baerrors different ts-sim-build-ba
get_variable TrafficLight TL_RYG_STATE_subseconds errors different ts-sim-build-baerrors different ts-sim-build-baerrors different ts-sim-build-baerrors different ts-sim-build-baerrors different ts-sim-build-baerrors different ts-sim-build-ba
get_variable TrafficLight errors UnknownTL errors different ts-sim-build-baerrors different ts-sim-build-baerrors different ts-sim-build-baerrors different ts-sim-build-baerrors different ts-sim-build-baerrors different ts-sim-build-ba
get_variable TrafficLight errors UnsupportedVariable errors different ts-sim-build-baerrors different ts-sim-build-baerrors different ts-sim-build-baerrors different ts-sim-build-baerrors different ts-sim-build-baerrors different ts-sim-build-ba
get_variable TrafficLight errors_subseconds UnknownTL errors different ts-sim-build-baerrors different ts-sim-build-baerrors different ts-sim-build-baerrors different ts-sim-build-baerrors different ts-sim-build-baerrors different ts-sim-build-ba
get_variable TrafficLight errors_subseconds UnsupportedVariable errors different ts-sim-build-baerrors different ts-sim-build-baerrors different ts-sim-build-baerrors different ts-sim-build-baerrors different ts-sim-build-baerrors different ts-sim-build-ba
get_variable Vehicle DISTANCE_REQUEST 3DAir errors different ts-sim-build-baerrors different ts-sim-build-baerrors different ts-sim-build-baerrors different ts-sim-build-baerrors different ts-sim-build-baerrors different ts-sim-build-ba
get_variable Vehicle DISTANCE_REQUEST 3DDrive errors different ts-sim-build-baerrors different ts-sim-build-baerrors different ts-sim-build-baerrors different ts-sim-build-baerrors different ts-sim-build-baerrors different ts-sim-build-ba
get_variable Vehicle DISTANCE_REQUEST RoadPosAir errors different ts-sim-build-baerrors different ts-sim-build-baerrors different ts-sim-build-baerrors different ts-sim-build-baerrors different ts-sim-build-baerrors different ts-sim-build-ba
get_variable Vehicle DISTANCE_REQUEST RoadPosDrive errors different ts-sim-build-baerrors different ts-sim-build-baerrors different ts-sim-build-baerrors different ts-sim-build-baerrors different ts-sim-build-baerrors different ts-sim-build-ba
get_variable Vehicle ID_COUNT errors different ts-sim-build-baerrors different ts-sim-build-baerrors different ts-sim-build-baerrors different ts-sim-build-baerrors different ts-sim-build-baerrors different ts-sim-build-ba
get_variable Vehicle ID_COUNT_subseconds errors different ts-sim-build-baerrors different ts-sim-build-baerrors different ts-sim-build-baerrors different ts-sim-build-baerrors different ts-sim-build-baerrors different ts-sim-build-ba
get_variable Vehicle ID_LIST errors different ts-sim-build-baerrors different ts-sim-build-baerrors different ts-sim-build-baerrors different ts-sim-build-baerrors different ts-sim-build-baerrors different ts-sim-build-ba
get_variable Vehicle ID_LIST_subseconds errors different ts-sim-build-baerrors different ts-sim-build-baerrors different ts-sim-build-baerrors different ts-sim-build-baerrors different ts-sim-build-baerrors different ts-sim-build-ba
get_variable Vehicle VAR_ACCUMULATED_WAITINGTIME errors different ts-sim-build-baerrors different ts-sim-build-baerrors different ts-sim-build-baerrors different ts-sim-build-baerrors different ts-sim-build-baerrors different ts-sim-build-ba
get_variable Vehicle VAR_ANGLE errors different ts-sim-build-baerrors different ts-sim-build-baerrors different ts-sim-build-baerrors different ts-sim-build-baerrors different ts-sim-build-baerrors different ts-sim-build-ba
get_variable Vehicle VAR_ANGLE_subseconds errors different ts-sim-build-baerrors different ts-sim-build-baerrors different ts-sim-build-baerrors different ts-sim-build-baerrors different ts-sim-build-baerrors different ts-sim-build-ba
get_variable Vehicle VAR_APPARENT_DECEL errors different ts-sim-build-baerrors different ts-sim-build-baerrors different ts-sim-build-baerrors different ts-sim-build-baerrors different ts-sim-build-baerrors different ts-sim-build-ba
get_variable Vehicle VAR_APPARENT_DECEL_subseconds errors different ts-sim-build-baerrors different ts-sim-build-baerrors different ts-sim-build-baerrors different ts-sim-build-baerrors different ts-sim-build-baerrors different ts-sim-build-ba
get_variable Vehicle VAR_CO2EMISSION errors different ts-sim-build-baerrors different ts-sim-build-baerrors different ts-sim-build-baerrors different ts-sim-build-baerrors different ts-sim-build-baerrors different ts-sim-build-ba
get_variable Vehicle VAR_CO2EMISSION_subseconds errors different ts-sim-build-baerrors different ts-sim-build-baerrors different ts-sim-build-baerrors different ts-sim-build-baerrors different ts-sim-build-baerrors different ts-sim-build-ba
get_variable Vehicle VAR_COEMISSION errors different ts-sim-build-baerrors different ts-sim-build-baerrors different ts-sim-build-baerrors different ts-sim-build-baerrors different ts-sim-build-baerrors different ts-sim-build-ba
get_variable Vehicle VAR_COEMISSION_subseconds errors different ts-sim-build-baerrors different ts-sim-build-baerrors different ts-sim-build-baerrors different ts-sim-build-baerrors different ts-sim-build-baerrors different ts-sim-build-ba
get_variable Vehicle VAR_COLOR errors different ts-sim-build-baerrors different ts-sim-build-baerrors different ts-sim-build-baerrors different ts-sim-build-baerrors different ts-sim-build-baerrors different ts-sim-build-ba
get_variable Vehicle VAR_COLOR_subseconds errors different ts-sim-build-baerrors different ts-sim-build-baerrors different ts-sim-build-baerrors different ts-sim-build-baerrors different ts-sim-build-baerrors different ts-sim-build-ba
get_variable Vehicle VAR_DISTANCE errors different ts-sim-build-baerrors different ts-sim-build-baerrors different ts-sim-build-baerrors different ts-sim-build-baerrors different ts-sim-build-baerrors different ts-sim-build-ba
get_variable Vehicle VAR_EDGES errors different ts-sim-build-baerrors different ts-sim-build-baerrors different ts-sim-build-baerrors different ts-sim-build-baerrors different ts-sim-build-baerrors different ts-sim-build-ba
get_variable Vehicle VAR_EDGES_subseconds errors different ts-sim-build-baerrors different ts-sim-build-baerrors different ts-sim-build-baerrors different ts-sim-build-baerrors different ts-sim-build-baerrors different ts-sim-build-ba
get_variable Vehicle VAR_EDGE_EFFORT errors different ts-sim-build-baerrors different ts-sim-build-baerrors different ts-sim-build-baerrors different ts-sim-build-baerrors different ts-sim-build-baerrors different ts-sim-build-ba
get_variable Vehicle VAR_EDGE_EFFORT_subseconds errors different ts-sim-build-baerrors different ts-sim-build-baerrors different ts-sim-build-baerrors different ts-sim-build-baerrors different ts-sim-build-baerrors different ts-sim-build-ba
get_variable Vehicle VAR_EDGE_TRAVELTIME errors different ts-sim-build-baerrors different ts-sim-build-baerrors different ts-sim-build-baerrors different ts-sim-build-baerrors different ts-sim-build-baerrors different ts-sim-build-ba
get_variable Vehicle VAR_EDGE_TRAVELTIME_subseconds errors different ts-sim-build-baerrors different ts-sim-build-baerrors different ts-sim-build-baerrors different ts-sim-build-baerrors different ts-sim-build-baerrors different ts-sim-build-ba
get_variable Vehicle VAR_EMERGENCY_DECEL errors different ts-sim-build-baerrors different ts-sim-build-baerrors different ts-sim-build-baerrors different ts-sim-build-baerrors different ts-sim-build-baerrors different ts-sim-build-ba
get_variable Vehicle VAR_EMERGENCY_DECEL_subseconds errors different ts-sim-build-baerrors different ts-sim-build-baerrors different ts-sim-build-baerrors different ts-sim-build-baerrors different ts-sim-build-baerrors different ts-sim-build-ba
get_variable Vehicle VAR_FUELCONSUMPTION errors different ts-sim-build-baerrors different ts-sim-build-baerrors different ts-sim-build-baerrors different ts-sim-build-baerrors different ts-sim-build-baerrors different ts-sim-build-ba
get_variable Vehicle VAR_FUELCONSUMPTION_subseconds errors different ts-sim-build-baerrors different ts-sim-build-baerrors different ts-sim-build-baerrors different ts-sim-build-baerrors different ts-sim-build-baerrors different ts-sim-build-ba
get_variable Vehicle VAR_HCEMISSION errors different ts-sim-build-baerrors different ts-sim-build-baerrors different ts-sim-build-baerrors different ts-sim-build-baerrors different ts-sim-build-baerrors different ts-sim-build-ba
get_variable Vehicle VAR_HCEMISSION_subseconds errors different ts-sim-build-baerrors different ts-sim-build-baerrors different ts-sim-build-baerrors different ts-sim-build-baerrors different ts-sim-build-baerrors different ts-sim-build-ba
get_variable Vehicle VAR_LANEPOSITION errors different ts-sim-build-baerrors different ts-sim-build-baerrors different ts-sim-build-baerrors different ts-sim-build-baerrors different ts-sim-build-baerrors different ts-sim-build-ba
get_variable Vehicle VAR_LANEPOSITION_subseconds errors different ts-sim-build-baerrors different ts-sim-build-baerrors different ts-sim-build-baerrors different ts-sim-build-baerrors different ts-sim-build-baerrors different ts-sim-build-ba
get_variable Vehicle VAR_LANE_ID errors different ts-sim-build-baerrors different ts-sim-build-baerrors different ts-sim-build-baerrors different ts-sim-build-baerrors different ts-sim-build-baerrors different ts-sim-build-ba
get_variable Vehicle VAR_LANE_ID_subseconds errors different ts-sim-build-baerrors different ts-sim-build-baerrors different ts-sim-build-baerrors different ts-sim-build-baerrors different ts-sim-build-baerrors different ts-sim-build-ba
get_variable Vehicle VAR_NOISEEMISSION errors different ts-sim-build-baerrors different ts-sim-build-baerrors different ts-sim-build-baerrors different ts-sim-build-baerrors different ts-sim-build-baerrors different ts-sim-build-ba
get_variable Vehicle VAR_NOISEEMISSION_subseconds errors different ts-sim-build-baerrors different ts-sim-build-baerrors different ts-sim-build-baerrors different ts-sim-build-baerrors different ts-sim-build-baerrors different ts-sim-build-ba
get_variable Vehicle VAR_NOXEMISSION errors different ts-sim-build-baerrors different ts-sim-build-baerrors different ts-sim-build-baerrors different ts-sim-build-baerrors different ts-sim-build-baerrors different ts-sim-build-ba
get_variable Vehicle VAR_NOXEMISSION_subseconds errors different ts-sim-build-baerrors different ts-sim-build-baerrors different ts-sim-build-baerrors different ts-sim-build-baerrors different ts-sim-build-baerrors different ts-sim-build-ba
get_variable Vehicle VAR_PMXEMISSION errors different ts-sim-build-baerrors different ts-sim-build-baerrors different ts-sim-build-baerrors different ts-sim-build-baerrors different ts-sim-build-baerrors different ts-sim-build-ba
get_variable Vehicle VAR_PMXEMISSION_subseconds errors different ts-sim-build-baerrors different ts-sim-build-baerrors different ts-sim-build-baerrors different ts-sim-build-baerrors different ts-sim-build-baerrors different ts-sim-build-ba
get_variable Vehicle VAR_POSITION errors different ts-sim-build-baerrors different ts-sim-build-baerrors different ts-sim-build-baerrors different ts-sim-build-baerrors different ts-sim-build-baerrors different ts-sim-build-ba
get_variable Vehicle VAR_POSITION3D errors different ts-sim-build-baerrors different ts-sim-build-baerrors different ts-sim-build-baerrors different ts-sim-build-baerrors different ts-sim-build-baerrors different ts-sim-build-ba
get_variable Vehicle VAR_POSITION3D_subseconds errors different ts-sim-build-baerrors different ts-sim-build-baerrors different ts-sim-build-baerrors different ts-sim-build-baerrors different ts-sim-build-baerrors different ts-sim-build-ba
get_variable Vehicle VAR_POSITION_subseconds errors different ts-sim-build-baerrors different ts-sim-build-baerrors different ts-sim-build-baerrors different ts-sim-build-baerrors different ts-sim-build-baerrors different ts-sim-build-ba
get_variable Vehicle VAR_ROAD_ID errors different ts-sim-build-baerrors different ts-sim-build-baerrors different ts-sim-build-baerrors different ts-sim-build-baerrors different ts-sim-build-baerrors different ts-sim-build-ba
get_variable Vehicle VAR_ROAD_ID_subseconds errors different ts-sim-build-baerrors different ts-sim-build-baerrors different ts-sim-build-baerrors different ts-sim-build-baerrors different ts-sim-build-baerrors different ts-sim-build-ba
get_variable Vehicle VAR_ROUTE errors different ts-sim-build-baerrors different ts-sim-build-baerrors different ts-sim-build-baerrors different ts-sim-build-baerrors different ts-sim-build-baerrors different ts-sim-build-ba
get_variable Vehicle VAR_ROUTE_INDEX errors different ts-sim-build-baerrors different ts-sim-build-baerrors different ts-sim-build-baerrors different ts-sim-build-baerrors different ts-sim-build-baerrors different ts-sim-build-ba
get_variable Vehicle VAR_ROUTE_subseconds errors different ts-sim-build-baerrors different ts-sim-build-baerrors different ts-sim-build-baerrors different ts-sim-build-baerrors different ts-sim-build-baerrors different ts-sim-build-ba
get_variable Vehicle VAR_SPEED errors different ts-sim-build-baerrors different ts-sim-build-baerrors different ts-sim-build-baerrors different ts-sim-build-baerrors different ts-sim-build-baerrors different ts-sim-build-ba
get_variable Vehicle VAR_SPEED_subseconds errors different ts-sim-build-baerrors different ts-sim-build-baerrors different ts-sim-build-baerrors different ts-sim-build-baerrors different ts-sim-build-baerrors different ts-sim-build-ba
get_variable Vehicle VAR_STOPSTATE errors different ts-sim-build-baerrors different ts-sim-build-baerrors different ts-sim-build-baerrors different ts-sim-build-baerrors different ts-sim-build-baerrors different ts-sim-build-ba
get_variable Vehicle VAR_STOPSTATE_subseconds errors different ts-sim-build-baerrors different ts-sim-build-baerrors different ts-sim-build-baerrors different ts-sim-build-baerrors different ts-sim-build-baerrors different ts-sim-build-ba
get_variable Vehicle VAR_TYPE errors different ts-sim-build-baerrors different ts-sim-build-baerrors different ts-sim-build-baerrors different ts-sim-build-baerrors different ts-sim-build-baerrors different ts-sim-build-ba
get_variable Vehicle VAR_TYPE_subseconds errors different ts-sim-build-baerrors different ts-sim-build-baerrors different ts-sim-build-baerrors different ts-sim-build-baerrors different ts-sim-build-baerrors different ts-sim-build-ba
get_variable Vehicle VAR_WAITINGTIME errors different ts-sim-build-baerrors different ts-sim-build-baerrors different ts-sim-build-baerrors different ts-sim-build-baerrors different ts-sim-build-baerrors different ts-sim-build-ba
get_variable Vehicle errors UnknownID errors different ts-sim-build-baerrors different ts-sim-build-baerrors different ts-sim-build-baerrors different ts-sim-build-baerrors different ts-sim-build-baerrors different ts-sim-build-ba
get_variable Vehicle errors UnsupportedVariable errors different ts-sim-build-baerrors different ts-sim-build-baerrors different ts-sim-build-baerrors different ts-sim-build-baerrors different ts-sim-build-baerrors different ts-sim-build-ba
get_variable Vehicle errors_subseconds UnknownID errors different ts-sim-build-baerrors different ts-sim-build-baerrors different ts-sim-build-baerrors different ts-sim-build-baerrors different ts-sim-build-baerrors different ts-sim-build-ba
get_variable Vehicle errors_subseconds UnsupportedVariable errors different ts-sim-build-baerrors different ts-sim-build-baerrors different ts-sim-build-baerrors different ts-sim-build-baerrors different ts-sim-build-baerrors different ts-sim-build-ba
get_variable VehicleType ID_COUNT errors different ts-sim-build-baerrors different ts-sim-build-baerrors different ts-sim-build-baerrors different ts-sim-build-baerrors different ts-sim-build-baerrors different ts-sim-build-ba
get_variable VehicleType ID_COUNT_subseconds errors different ts-sim-build-baerrors different ts-sim-build-baerrors different ts-sim-build-baerrors different ts-sim-build-baerrors different ts-sim-build-baerrors different ts-sim-build-ba
get_variable VehicleType ID_LIST errors different ts-sim-build-baerrors different ts-sim-build-baerrors different ts-sim-build-baerrors different ts-sim-build-baerrors different ts-sim-build-baerrors different ts-sim-build-ba
get_variable VehicleType ID_LIST_subseconds errors different ts-sim-build-baerrors different ts-sim-build-baerrors different ts-sim-build-baerrors different ts-sim-build-baerrors different ts-sim-build-baerrors different ts-sim-build-ba
get_variable VehicleType VAR_ACCEL errors different ts-sim-build-baerrors different ts-sim-build-baerrors different ts-sim-build-baerrors different ts-sim-build-baerrors different ts-sim-build-baerrors different ts-sim-build-ba
get_variable VehicleType VAR_ACCEL_subseconds errors different ts-sim-build-baerrors different ts-sim-build-baerrors different ts-sim-build-baerrors different ts-sim-build-baerrors different ts-sim-build-baerrors different ts-sim-build-ba
get_variable VehicleType VAR_APPARENT_DECEL errors different ts-sim-build-baerrors different ts-sim-build-baerrors different ts-sim-build-baerrors different ts-sim-build-baerrors different ts-sim-build-baerrors different ts-sim-build-ba
get_variable VehicleType VAR_APPARENT_DECEL_subseconds errors different ts-sim-build-baerrors different ts-sim-build-baerrors different ts-sim-build-baerrors different ts-sim-build-baerrors different ts-sim-build-baerrors different ts-sim-build-ba
get_variable VehicleType VAR_COLOR errors different ts-sim-build-baerrors different ts-sim-build-baerrors different ts-sim-build-baerrors different ts-sim-build-baerrors different ts-sim-build-baerrors different ts-sim-build-ba
get_variable VehicleType VAR_COLOR_subseconds errors different ts-sim-build-baerrors different ts-sim-build-baerrors different ts-sim-build-baerrors different ts-sim-build-baerrors different ts-sim-build-baerrors different ts-sim-build-ba
get_variable VehicleType VAR_DECEL errors different ts-sim-build-baerrors different ts-sim-build-baerrors different ts-sim-build-baerrors different ts-sim-build-baerrors different ts-sim-build-baerrors different ts-sim-build-ba
get_variable VehicleType VAR_DECEL_subseconds errors different ts-sim-build-baerrors different ts-sim-build-baerrors different ts-sim-build-baerrors different ts-sim-build-baerrors different ts-sim-build-baerrors different ts-sim-build-ba
get_variable VehicleType VAR_EMERGENCY_DECEL errors different ts-sim-build-baerrors different ts-sim-build-baerrors different ts-sim-build-baerrors different ts-sim-build-baerrors different ts-sim-build-baerrors different ts-sim-build-ba
get_variable VehicleType VAR_EMERGENCY_DECEL_subseconds errors different ts-sim-build-baerrors different ts-sim-build-baerrors different ts-sim-build-baerrors different ts-sim-build-baerrors different ts-sim-build-baerrors different ts-sim-build-ba
get_variable VehicleType VAR_EMISSIONCLASS errors different ts-sim-build-baerrors different ts-sim-build-baerrors different ts-sim-build-baerrors different ts-sim-build-baerrors different ts-sim-build-baerrors different ts-sim-build-ba
get_variable VehicleType VAR_EMISSIONCLASS_subseconds errors different ts-sim-build-baerrors different ts-sim-build-baerrors different ts-sim-build-baerrors different ts-sim-build-baerrors different ts-sim-build-baerrors different ts-sim-build-ba
get_variable VehicleType VAR_HEIGHT errors different ts-sim-build-baerrors different ts-sim-build-baerrors different ts-sim-build-baerrors different ts-sim-build-baerrors different ts-sim-build-baerrors different ts-sim-build-ba
get_variable VehicleType VAR_LENGTH errors different ts-sim-build-baerrors different ts-sim-build-baerrors different ts-sim-build-baerrors different ts-sim-build-baerrors different ts-sim-build-baerrors different ts-sim-build-ba
get_variable VehicleType VAR_LENGTH_subseconds errors different ts-sim-build-baerrors different ts-sim-build-baerrors different ts-sim-build-baerrors different ts-sim-build-baerrors different ts-sim-build-baerrors different ts-sim-build-ba
get_variable VehicleType VAR_MAXSPEED errors different ts-sim-build-baerrors different ts-sim-build-baerrors different ts-sim-build-baerrors different ts-sim-build-baerrors different ts-sim-build-baerrors different ts-sim-build-ba
get_variable VehicleType VAR_MAXSPEED_subseconds errors different ts-sim-build-baerrors different ts-sim-build-baerrors different ts-sim-build-baerrors different ts-sim-build-baerrors different ts-sim-build-baerrors different ts-sim-build-ba
get_variable VehicleType VAR_MINGAP errors different ts-sim-build-baerrors different ts-sim-build-baerrors different ts-sim-build-baerrors different ts-sim-build-baerrors different ts-sim-build-baerrors different ts-sim-build-ba
get_variable VehicleType VAR_MINGAP_subseconds errors different ts-sim-build-baerrors different ts-sim-build-baerrors different ts-sim-build-baerrors different ts-sim-build-baerrors different ts-sim-build-baerrors different ts-sim-build-ba
get_variable VehicleType VAR_SHAPECLASS errors different ts-sim-build-baerrors different ts-sim-build-baerrors different ts-sim-build-baerrors different ts-sim-build-baerrors different ts-sim-build-baerrors different ts-sim-build-ba
get_variable VehicleType VAR_SHAPECLASS_subseconds errors different ts-sim-build-baerrors different ts-sim-build-baerrors different ts-sim-build-baerrors different ts-sim-build-baerrors different ts-sim-build-baerrors different ts-sim-build-ba
get_variable VehicleType VAR_TAU errors different ts-sim-build-baerrors different ts-sim-build-baerrors different ts-sim-build-baerrors different ts-sim-build-baerrors different ts-sim-build-baerrors different ts-sim-build-ba
get_variable VehicleType VAR_TAU_subseconds errors different ts-sim-build-baerrors different ts-sim-build-baerrors different ts-sim-build-baerrors different ts-sim-build-baerrors different ts-sim-build-baerrors different ts-sim-build-ba
get_variable VehicleType VAR_VEHICLECLASS errors different ts-sim-build-baerrors different ts-sim-build-baerrors different ts-sim-build-baerrors different ts-sim-build-baerrors different ts-sim-build-baerrors different ts-sim-build-ba
get_variable VehicleType VAR_VEHICLECLASS_subseconds errors different ts-sim-build-baerrors different ts-sim-build-baerrors different ts-sim-build-baerrors different ts-sim-build-baerrors different ts-sim-build-baerrors different ts-sim-build-ba
get_variable VehicleType VAR_WIDTH errors different ts-sim-build-baerrors different ts-sim-build-baerrors different ts-sim-build-baerrors different ts-sim-build-baerrors different ts-sim-build-baerrors different ts-sim-build-ba
get_variable VehicleType VAR_WIDTH_subseconds errors different ts-sim-build-baerrors different ts-sim-build-baerrors different ts-sim-build-baerrors different ts-sim-build-baerrors different ts-sim-build-baerrors different ts-sim-build-ba
get_variable VehicleType errors UnknownID errors different ts-sim-build-baerrors different ts-sim-build-baerrors different ts-sim-build-baerrors different ts-sim-build-baerrors different ts-sim-build-baerrors different ts-sim-build-ba
get_variable VehicleType errors UnsupportedVariable errors different ts-sim-build-baerrors different ts-sim-build-baerrors different ts-sim-build-baerrors different ts-sim-build-baerrors different ts-sim-build-baerrors different ts-sim-build-ba
get_variable VehicleType errors_subseconds UnknownID errors different ts-sim-build-baerrors different ts-sim-build-baerrors different ts-sim-build-baerrors different ts-sim-build-baerrors different ts-sim-build-baerrors different ts-sim-build-ba
get_variable VehicleType errors_subseconds UnsupportedVariable errors different ts-sim-build-baerrors different ts-sim-build-baerrors different ts-sim-build-baerrors different ts-sim-build-baerrors different ts-sim-build-baerrors different ts-sim-build-ba
set_variable Edge EdgeEffortInfo Basic errors different ts-sim-build-baerrors different ts-sim-build-baerrors different ts-sim-build-baerrors different ts-sim-build-baerrors different ts-sim-build-baerrors different ts-sim-build-ba
set_variable Edge EdgeEffortInfo InvalidNode errors different ts-sim-build-baerrors different ts-sim-build-baerrors different ts-sim-build-baerrors different ts-sim-build-baerrors different ts-sim-build-baerrors different ts-sim-build-ba
set_variable Edge EdgeTravelTimeInfo Basic errors different ts-sim-build-baerrors different ts-sim-build-baerrors different ts-sim-build-baerrors different ts-sim-build-baerrors different ts-sim-build-baerrors different ts-sim-build-ba
set_variable Edge EdgeTravelTimeInfo InvalidNode errors different ts-sim-build-baerrors different ts-sim-build-baerrors different ts-sim-build-baerrors different ts-sim-build-baerrors different ts-sim-build-baerrors different ts-sim-build-ba
set_variable Edge VAR_PARAMETER errors different ts-sim-build-baerrors different ts-sim-build-baerrors different ts-sim-build-baerrors different ts-sim-build-baerrors different ts-sim-build-baerrors different ts-sim-build-ba
set_variable Edge error errors different ts-sim-build-baerrors different ts-sim-build-baerrors different ts-sim-build-baerrors different ts-sim-build-baerrors different ts-sim-build-baerrors different ts-sim-build-ba
set_variable Lane LANE_ALLOWED Basic errors different ts-sim-build-baerrors different ts-sim-build-baerrors different ts-sim-build-baerrors different ts-sim-build-baerrors different ts-sim-build-baerrors different ts-sim-build-ba
set_variable Lane LANE_ALLOWED InvalidID errors different ts-sim-build-baerrors different ts-sim-build-baerrors different ts-sim-build-baerrors different ts-sim-build-baerrors different ts-sim-build-baerrors different ts-sim-build-ba
set_variable Lane LANE_ALLOWED InvalidType errors different ts-sim-build-baerrors different ts-sim-build-baerrors different ts-sim-build-baerrors different ts-sim-build-baerrors different ts-sim-build-baerrors different ts-sim-build-ba
set_variable Lane LANE_DISALLOWED Basic errors different ts-sim-build-baerrors different ts-sim-build-baerrors different ts-sim-build-baerrors different ts-sim-build-baerrors different ts-sim-build-baerrors different ts-sim-build-ba
set_variable Lane LANE_DISALLOWED InvalidID errors different ts-sim-build-baerrors different ts-sim-build-baerrors different ts-sim-build-baerrors different ts-sim-build-baerrors different ts-sim-build-baerrors different ts-sim-build-ba
set_variable Lane LANE_DISALLOWED InvalidType errors different ts-sim-build-baerrors different ts-sim-build-baerrors different ts-sim-build-baerrors different ts-sim-build-baerrors different ts-sim-build-baerrors different ts-sim-build-ba
set_variable Lane LENGTH Basic errors different ts-sim-build-baerrors different ts-sim-build-baerrors different ts-sim-build-baerrors different ts-sim-build-baerrors different ts-sim-build-baerrors different ts-sim-build-ba
set_variable Lane LENGTH InvalidID errors different ts-sim-build-baerrors different ts-sim-build-baerrors different ts-sim-build-baerrors different ts-sim-build-baerrors different ts-sim-build-baerrors different ts-sim-build-ba
set_variable Lane LENGTH InvalidType errors different ts-sim-build-baerrors different ts-sim-build-baerrors different ts-sim-build-baerrors different ts-sim-build-baerrors different ts-sim-build-baerrors different ts-sim-build-ba
set_variable Lane MAX_SPEED Basic errors different ts-sim-build-baerrors different ts-sim-build-baerrors different ts-sim-build-baerrors different ts-sim-build-baerrors different ts-sim-build-baerrors different ts-sim-build-ba
set_variable Lane MAX_SPEED InvalidID errors different ts-sim-build-baerrors different ts-sim-build-baerrors different ts-sim-build-baerrors different ts-sim-build-baerrors different ts-sim-build-baerrors different ts-sim-build-ba
set_variable Lane MAX_SPEED InvalidType errors different ts-sim-build-baerrors different ts-sim-build-baerrors different ts-sim-build-baerrors different ts-sim-build-baerrors different ts-sim-build-baerrors different ts-sim-build-ba
set_variable Lane VAR_PARAMETER errors different ts-sim-build-baerrors different ts-sim-build-baerrors different ts-sim-build-baerrors different ts-sim-build-baerrors different ts-sim-build-baerrors different ts-sim-build-ba
set_variable POI ADD errors different ts-sim-build-baerrors different ts-sim-build-baerrors different ts-sim-build-baerrors different ts-sim-build-baerrors different ts-sim-build-baerrors different ts-sim-build-ba
set_variable POI REMOVE Basic errors different ts-sim-build-baerrors different ts-sim-build-baerrors different ts-sim-build-baerrors different ts-sim-build-baerrors different ts-sim-build-baerrors different ts-sim-build-ba
set_variable POI REMOVE InvalidID errors different ts-sim-build-baerrors different ts-sim-build-baerrors different ts-sim-build-baerrors different ts-sim-build-baerrors different ts-sim-build-baerrors different ts-sim-build-ba
set_variable POI REMOVE InvalidType errors different ts-sim-build-baerrors different ts-sim-build-baerrors different ts-sim-build-baerrors different ts-sim-build-baerrors different ts-sim-build-baerrors different ts-sim-build-ba
set_variable POI VAR_COLOR Basic errors different ts-sim-build-baerrors different ts-sim-build-baerrors different ts-sim-build-baerrors different ts-sim-build-baerrors different ts-sim-build-baerrors different ts-sim-build-ba
set_variable POI VAR_COLOR InvalidID errors different ts-sim-build-baerrors different ts-sim-build-baerrors different ts-sim-build-baerrors different ts-sim-build-baerrors different ts-sim-build-baerrors different ts-sim-build-ba
set_variable POI VAR_COLOR InvalidType errors different ts-sim-build-baerrors different ts-sim-build-baerrors different ts-sim-build-baerrors different ts-sim-build-baerrors different ts-sim-build-baerrors different ts-sim-build-ba
set_variable POI VAR_PARAMETER errors different ts-sim-build-baerrors different ts-sim-build-baerrors different ts-sim-build-baerrors different ts-sim-build-baerrors different ts-sim-build-baerrors different ts-sim-build-ba
set_variable POI VAR_POSITION Basic errors different ts-sim-build-baerrors different ts-sim-build-baerrors different ts-sim-build-baerrors different ts-sim-build-baerrors different ts-sim-build-baerrors different ts-sim-build-ba
set_variable POI VAR_POSITION InvalidID errors different ts-sim-build-baerrors different ts-sim-build-baerrors different ts-sim-build-baerrors different ts-sim-build-baerrors different ts-sim-build-baerrors different ts-sim-build-ba
set_variable POI VAR_POSITION InvalidType errors different ts-sim-build-baerrors different ts-sim-build-baerrors different ts-sim-build-baerrors different ts-sim-build-baerrors different ts-sim-build-baerrors different ts-sim-build-ba
set_variable POI VAR_TYPE Basic errors different ts-sim-build-baerrors different ts-sim-build-baerrors different ts-sim-build-baerrors different ts-sim-build-baerrors different ts-sim-build-baerrors different ts-sim-build-ba
set_variable POI VAR_TYPE InvalidID errors different ts-sim-build-baerrors different ts-sim-build-baerrors different ts-sim-build-baerrors different ts-sim-build-baerrors different ts-sim-build-baerrors different ts-sim-build-ba
set_variable POI VAR_TYPE InvalidType errors different ts-sim-build-baerrors different ts-sim-build-baerrors different ts-sim-build-baerrors different ts-sim-build-baerrors different ts-sim-build-baerrors different ts-sim-build-ba
set_variable Polygon ADD errors different ts-sim-build-baerrors different ts-sim-build-baerrors different ts-sim-build-baerrors different ts-sim-build-baerrors different ts-sim-build-baerrors different ts-sim-build-ba
set_variable Polygon REMOVE Basic errors different ts-sim-build-baerrors different ts-sim-build-baerrors different ts-sim-build-baerrors different ts-sim-build-baerrors different ts-sim-build-baerrors different ts-sim-build-ba
set_variable Polygon REMOVE InvalidID errors different ts-sim-build-baerrors different ts-sim-build-baerrors different ts-sim-build-baerrors different ts-sim-build-baerrors different ts-sim-build-baerrors different ts-sim-build-ba
set_variable Polygon REMOVE InvalidType errors different ts-sim-build-baerrors different ts-sim-build-baerrors different ts-sim-build-baerrors different ts-sim-build-baerrors different ts-sim-build-baerrors different ts-sim-build-ba
set_variable Polygon VAR_COLOR Basic errors different ts-sim-build-baerrors different ts-sim-build-baerrors different ts-sim-build-baerrors different ts-sim-build-baerrors different ts-sim-build-baerrors different ts-sim-build-ba
set_variable Polygon VAR_COLOR InvalidID errors different ts-sim-build-baerrors different ts-sim-build-baerrors different ts-sim-build-baerrors different ts-sim-build-baerrors different ts-sim-build-baerrors different ts-sim-build-ba
set_variable Polygon VAR_COLOR InvalidType errors different ts-sim-build-baerrors different ts-sim-build-baerrors different ts-sim-build-baerrors different ts-sim-build-baerrors different ts-sim-build-baerrors different ts-sim-build-ba
set_variable Polygon VAR_FILL Basic errors different ts-sim-build-baerrors different ts-sim-build-baerrors different ts-sim-build-baerrors different ts-sim-build-baerrors different ts-sim-build-baerrors different ts-sim-build-ba
set_variable Polygon VAR_FILL InvalidID errors different ts-sim-build-baerrors different ts-sim-build-baerrors different ts-sim-build-baerrors different ts-sim-build-baerrors different ts-sim-build-baerrors different ts-sim-build-ba
set_variable Polygon VAR_FILL InvalidType errors different ts-sim-build-baerrors different ts-sim-build-baerrors different ts-sim-build-baerrors different ts-sim-build-baerrors different ts-sim-build-baerrors different ts-sim-build-ba
set_variable Polygon VAR_PARAMETER errors different ts-sim-build-baerrors different ts-sim-build-baerrors different ts-sim-build-baerrors different ts-sim-build-baerrors different ts-sim-build-baerrors different ts-sim-build-ba
set_variable Polygon VAR_SHAPE Basic errors different ts-sim-build-baerrors different ts-sim-build-baerrors different ts-sim-build-baerrors different ts-sim-build-baerrors different ts-sim-build-baerrors different ts-sim-build-ba
set_variable Polygon VAR_SHAPE InvalidID errors different ts-sim-build-baerrors different ts-sim-build-baerrors different ts-sim-build-baerrors different ts-sim-build-baerrors different ts-sim-build-baerrors different ts-sim-build-ba
set_variable Polygon VAR_SHAPE InvalidType errors different ts-sim-build-baerrors different ts-sim-build-baerrors different ts-sim-build-baerrors different ts-sim-build-baerrors different ts-sim-build-baerrors different ts-sim-build-ba
set_variable Polygon VAR_TYPE Basic errors different ts-sim-build-baerrors different ts-sim-build-baerrors different ts-sim-build-baerrors different ts-sim-build-baerrors different ts-sim-build-baerrors different ts-sim-build-ba
set_variable Polygon VAR_TYPE InvalidID errors different ts-sim-build-baerrors different ts-sim-build-baerrors different ts-sim-build-baerrors different ts-sim-build-baerrors different ts-sim-build-baerrors different ts-sim-build-ba
set_variable Polygon VAR_TYPE InvalidType errors different ts-sim-build-baerrors different ts-sim-build-baerrors different ts-sim-build-baerrors different ts-sim-build-baerrors different ts-sim-build-baerrors different ts-sim-build-ba
set_variable Route ADD errors different ts-sim-build-baerrors different ts-sim-build-baerrors different ts-sim-build-baerrors different ts-sim-build-baerrors different ts-sim-build-baerrors different ts-sim-build-ba
set_variable Route VAR_PARAMETER errors different ts-sim-build-baerrors different ts-sim-build-baerrors different ts-sim-build-baerrors different ts-sim-build-baerrors different ts-sim-build-baerrors different ts-sim-build-ba
set_variable Simulation CMD_CLEAR_PENDING_VEHICLES errors different ts-sim-build-baerrors different ts-sim-build-baerrors different ts-sim-build-baerrors different ts-sim-build-baerrors different ts-sim-build-baerrors different ts-sim-build-ba
set_variable Simulation CMD_SAVE_SIMSTATE errors different ts-sim-build-baerrors different ts-sim-build-baerrors different ts-sim-build-baerrors different ts-sim-build-baerrors different ts-sim-build-baerrors different ts-sim-build-ba
set_variable TrafficLight TL_COMPLETE_PROGRAM basic_addTwo errors different ts-sim-build-baerrors different ts-sim-build-baerrors different ts-sim-build-baerrors different ts-sim-build-baerrors different ts-sim-build-baerrors different ts-sim-build-ba
set_variable TrafficLight TL_COMPLETE_PROGRAM basic_replace errors different ts-sim-build-baerrors different ts-sim-build-baerrors different ts-sim-build-baerrors different ts-sim-build-baerrors different ts-sim-build-baerrors different ts-sim-build-ba
set_variable TrafficLight TL_COMPLETE_PROGRAM basic_replaceAdded errors different ts-sim-build-baerrors different ts-sim-build-baerrors different ts-sim-build-baerrors different ts-sim-build-baerrors different ts-sim-build-baerrors different ts-sim-build-ba
set_variable TrafficLight TL_COMPLETE_PROGRAM replace_less_phases errors different ts-sim-build-baerrors different ts-sim-build-baerrors different ts-sim-build-baerrors different ts-sim-build-baerrors different ts-sim-build-baerrors different ts-sim-build-ba
set_variable TrafficLight TL_PHASE_DURATION basic errors different ts-sim-build-baerrors different ts-sim-build-baerrors different ts-sim-build-baerrors different ts-sim-build-baerrors different ts-sim-build-baerrors different ts-sim-build-ba
set_variable TrafficLight TL_PHASE_DURATION error_FalseValueType errors different ts-sim-build-baerrors different ts-sim-build-baerrors different ts-sim-build-baerrors different ts-sim-build-baerrors different ts-sim-build-baerrors different ts-sim-build-ba
set_variable TrafficLight TL_PHASE_INDEX basic errors different ts-sim-build-baerrors different ts-sim-build-baerrors different ts-sim-build-baerrors different ts-sim-build-baerrors different ts-sim-build-baerrors different ts-sim-build-ba
set_variable TrafficLight TL_PHASE_INDEX error_FalseValueType errors different ts-sim-build-baerrors different ts-sim-build-baerrors different ts-sim-build-baerrors different ts-sim-build-baerrors different ts-sim-build-baerrors different ts-sim-build-ba
set_variable TrafficLight TL_PHASE_INDEX error_IndexNegative errors different ts-sim-build-baerrors different ts-sim-build-baerrors different ts-sim-build-baerrors different ts-sim-build-baerrors different ts-sim-build-baerrors different ts-sim-build-ba
set_variable TrafficLight TL_PHASE_INDEX error_IndexTooLarge errors different ts-sim-build-baerrors different ts-sim-build-baerrors different ts-sim-build-baerrors different ts-sim-build-baerrors different ts-sim-build-baerrors different ts-sim-build-ba
set_variable TrafficLight TL_PROGRAM basic errors different ts-sim-build-baerrors different ts-sim-build-baerrors different ts-sim-build-baerrors different ts-sim-build-baerrors different ts-sim-build-baerrors different ts-sim-build-ba
set_variable TrafficLight TL_PROGRAM error_UnknownProgram errors different ts-sim-build-baerrors different ts-sim-build-baerrors different ts-sim-build-baerrors different ts-sim-build-baerrors different ts-sim-build-baerrors different ts-sim-build-ba
set_variable TrafficLight TL_STATE basic errors different ts-sim-build-baerrors different ts-sim-build-baerrors different ts-sim-build-baerrors different ts-sim-build-baerrors different ts-sim-build-baerrors different ts-sim-build-ba
set_variable TrafficLight TL_STATE error_FalseValueType errors different ts-sim-build-baerrors different ts-sim-build-baerrors different ts-sim-build-baerrors different ts-sim-build-baerrors different ts-sim-build-baerrors different ts-sim-build-ba
set_variable TrafficLight VAR_PARAMETER errors different ts-sim-build-baerrors different ts-sim-build-baerrors different ts-sim-build-baerrors different ts-sim-build-baerrors different ts-sim-build-baerrors different ts-sim-build-ba
set_variable TrafficLight errors UnknownTL errors different ts-sim-build-baerrors different ts-sim-build-baerrors different ts-sim-build-baerrors different ts-sim-build-baerrors different ts-sim-build-baerrors different ts-sim-build-ba
set_variable TrafficLight errors UnsupportedVariable errors different ts-sim-build-baerrors different ts-sim-build-baerrors different ts-sim-build-baerrors different ts-sim-build-baerrors different ts-sim-build-baerrors different ts-sim-build-ba
set_variable TrafficLight errors invalid_phase_index errors different ts-sim-build-baerrors different ts-sim-build-baerrors different ts-sim-build-baerrors different ts-sim-build-baerrors different ts-sim-build-baerrors different ts-sim-build-ba
set_variable Vehicle ADD ADD errors different ts-sim-build-baerrors different ts-sim-build-baerrors different ts-sim-build-baerrors different ts-sim-build-baerrors different ts-sim-build-baerrors different ts-sim-build-ba
set_variable Vehicle ADD InvalidID errors different ts-sim-build-baerrors different ts-sim-build-baerrors different ts-sim-build-baerrors different ts-sim-build-baerrors different ts-sim-build-baerrors different ts-sim-build-ba
set_variable Vehicle ADD InvalidLane errors different ts-sim-build-baerrors different ts-sim-build-baerrors different ts-sim-build-baerrors different ts-sim-build-baerrors different ts-sim-build-baerrors different ts-sim-build-ba
set_variable Vehicle ADD InvalidPos errors different ts-sim-build-baerrors different ts-sim-build-baerrors different ts-sim-build-baerrors different ts-sim-build-baerrors different ts-sim-build-baerrors different ts-sim-build-ba
set_variable Vehicle ADD InvalidRoute errors different ts-sim-build-baerrors different ts-sim-build-baerrors different ts-sim-build-baerrors different ts-sim-build-baerrors different ts-sim-build-baerrors different ts-sim-build-ba
set_variable Vehicle ADD InvalidSpeed errors different ts-sim-build-baerrors different ts-sim-build-baerrors different ts-sim-build-baerrors different ts-sim-build-baerrors different ts-sim-build-baerrors different ts-sim-build-ba
set_variable Vehicle ADD InvalidType errors different ts-sim-build-baerrors different ts-sim-build-baerrors different ts-sim-build-baerrors different ts-sim-build-baerrors different ts-sim-build-baerrors different ts-sim-build-ba
set_variable Vehicle ChangeLane Basic errors different ts-sim-build-baerrors different ts-sim-build-baerrors different ts-sim-build-baerrors different ts-sim-build-baerrors different ts-sim-build-baerrors different ts-sim-build-ba
set_variable Vehicle ChangeLane InvalidLaneId errors different ts-sim-build-baerrors different ts-sim-build-baerrors different ts-sim-build-baerrors different ts-sim-build-baerrors different ts-sim-build-baerrors different ts-sim-build-ba
set_variable Vehicle ChangeLane InvalidNode errors different ts-sim-build-baerrors different ts-sim-build-baerrors different ts-sim-build-baerrors different ts-sim-build-baerrors different ts-sim-build-baerrors different ts-sim-build-ba
set_variable Vehicle ChangeLane PassingJunction errors different ts-sim-build-baerrors different ts-sim-build-baerrors different ts-sim-build-baerrors different ts-sim-build-baerrors different ts-sim-build-baerrors different ts-sim-build-ba
set_variable Vehicle ChangeLane RouteDisallows errors different ts-sim-build-baerrors different ts-sim-build-baerrors different ts-sim-build-baerrors different ts-sim-build-baerrors different ts-sim-build-baerrors different ts-sim-build-ba
set_variable Vehicle ChangeLane hold errors different ts-sim-build-baerrors different ts-sim-build-baerrors different ts-sim-build-baerrors different ts-sim-build-baerrors different ts-sim-build-baerrors different ts-sim-build-ba
set_variable Vehicle ChangeLane relativeLaneChange errors different ts-sim-build-baerrors different ts-sim-build-baerrors different ts-sim-build-baerrors different ts-sim-build-baerrors different ts-sim-build-baerrors different ts-sim-build-ba
set_variable Vehicle ChangeLane relativeLaneChangeOpposite errors different ts-sim-build-baerrors different ts-sim-build-baerrors different ts-sim-build-baerrors different ts-sim-build-baerrors different ts-sim-build-baerrors different ts-sim-build-ba
set_variable Vehicle ChangeRoute Basic errors different ts-sim-build-baerrors different ts-sim-build-baerrors different ts-sim-build-baerrors different ts-sim-build-baerrors different ts-sim-build-baerrors different ts-sim-build-ba
set_variable Vehicle ChangeRoute FalseEdge errors different ts-sim-build-baerrors different ts-sim-build-baerrors different ts-sim-build-baerrors different ts-sim-build-baerrors different ts-sim-build-baerrors different ts-sim-build-ba
set_variable Vehicle ChangeRoute InvalidNodeId errors different ts-sim-build-baerrors different ts-sim-build-baerrors different ts-sim-build-baerrors different ts-sim-build-baerrors different ts-sim-build-baerrors different ts-sim-build-ba
set_variable Vehicle ChangeRoute UnknownEdge errors different ts-sim-build-baerrors different ts-sim-build-baerrors different ts-sim-build-baerrors different ts-sim-build-baerrors different ts-sim-build-baerrors different ts-sim-build-ba
set_variable Vehicle ChangeRoute disconnected errors different ts-sim-build-baerrors different ts-sim-build-baerrors different ts-sim-build-baerrors different ts-sim-build-baerrors different ts-sim-build-baerrors different ts-sim-build-ba
set_variable Vehicle ChangeRoute invalidOnInternal errors different ts-sim-build-baerrors different ts-sim-build-baerrors different ts-sim-build-baerrors different ts-sim-build-baerrors different ts-sim-build-baerrors different ts-sim-build-ba
set_variable Vehicle ChangeRouteBus Basic errors different ts-sim-build-baerrors different ts-sim-build-baerrors different ts-sim-build-baerrors different ts-sim-build-baerrors different ts-sim-build-baerrors different ts-sim-build-ba
set_variable Vehicle ChangeRouteByID Basic errors different ts-sim-build-baerrors different ts-sim-build-baerrors different ts-sim-build-baerrors different ts-sim-build-baerrors different ts-sim-build-baerrors different ts-sim-build-ba
set_variable Vehicle ChangeRouteByID FalseEdge errors different ts-sim-build-baerrors different ts-sim-build-baerrors different ts-sim-build-baerrors different ts-sim-build-baerrors different ts-sim-build-ba