15Jul23rv1_18_0+0328-6f3b7288ebb - detailed test results for TRACI

To reconnect the TextTest GUI to these results, run:

texttest -a traci -d /home/delphi/clangDebug/sumo/tests -reconnect /home/delphi/clangDebug/texttesttmp/clang3_64D.31Jul074436.987743 -g

To start TextTest for these tests, run:

texttest -a traci -d /home/delphi/clangDebug/sumo/tests


default: 592 tests: 591 succeeded 1 FAILED

Detailed information for the tests that FAILED:

TEST FAILED on ts-sim-build-ba : get_variable Vehicle VAR_FUELCONSUMPTION_subseconds ( Last six runs Jul2023 )

---------- Differences in errors ----------
0a1
> Quitting (on error).
---------- Differences in testclient_out ----------
2,15c2
< 
< -> Command sent: <SimulationStep>:
< .. Command acknowledged (2), [description: ]
< 
< -> Command sent: <GetVariable>:
<   domID=164 varID=101 objID=0
< .. Command acknowledged (164), [description: ]
<   CommandID=180  VariableID=101  ObjectID=0 valueDataType=11 Double value: 0.91
< 
< -> Command sent: <SimulationStep>:
< .. Command acknowledged (2), [description: ]
< 
< -> Command sent: <Close>:
< .. Command acknowledged (127), [description: ]
---
> ----