Test results for POLYCONVERT

(generated by unknown at 08Aug08:09)

gdal

Last six runs

Jul2020 Aug2020

test_default.gdal.png

Test02Aug202003Aug202004Aug202005Aug202006Aug202007Aug2020
Summary3 tests: 3 FAILED 3 tests: 3 FAILED 3 tests: 3 FAILED 3 tests: 3 FAILED 3 tests: 3 FAILED 3 tests: 3 FAILED
import shape default errors different ts-sim-build-baerrors different ts-sim-build-baerrors different ts-sim-build-baerrors different ts-sim-build-baerrors different ts-sim-build-baerrors different(+) ts-sim-build-ba
import shape handmade errors different ts-sim-build-baerrors different ts-sim-build-baerrors different ts-sim-build-baerrors different ts-sim-build-baerrors different ts-sim-build-baerrors different(+) ts-sim-build-ba
import shape network errors different(+) ts-sim-build-baerrors different(+) ts-sim-build-baerrors different(+) ts-sim-build-baerrors different(+) ts-sim-build-baerrors different(+) ts-sim-build-baerrors different(+) ts-sim-build-ba