Test results for SUMO.extra.sf

(generated by unknown at 23Sep12:48)

Last six runs

Aug2026 Sep2026

test_extra.sf.png

Test18Sep202619Sep202620Sep202621Sep202622Sep202623Sep2026
Summary2 tests: 2 FAILED 2 tests: 2 FAILED 2 tests: 2 FAILED 2 tests: 2 FAILED 2 tests: 2 FAILED 2 tests: 2 FAILED
pedestrian_model jupedsim speed_change errors different(+) ts-sim-build-baerrors different(+) ts-sim-build-baerrors different(+) ts-sim-build-baerrors different(+) ts-sim-build-baerrors different(+) ts-sim-build-baerrors different(+) ts-sim-build-ba
pedestrian_model jupedsim two_edges errors different(+) ts-sim-build-baerrors different(+) ts-sim-build-baerrors different(+) ts-sim-build-baerrors different(+) ts-sim-build-baerrors different(+) ts-sim-build-baerrors different(+) ts-sim-build-ba