Test results for NETEDIT.daily.demand.basic

(generated by unknown at 01Feb01:23)

Last six runs

Dec2022 Jan2023

test_daily.demand.basic_all_Jan2023.png

Test01Jan23rv1_15_0+1222-7bb0f531b1e02Jan23rv1_15_0+1222-7bb0f531b1e03Jan23rv1_15_0+1238-e31bdb304e304Jan23rv1_15_0+1275-5d6377d1de205Jan23rv1_15_0+1319-f208a670e4506Jan23rv1_15_0+1368-96ccd54512007Jan23rv1_15_0+1440-6fccaeff98608Jan23rv1_15_0+1445-9ed6055add509Jan23rv1_15_0+1445-9ed6055add511Jan23rv1_15_0+1539-cedc415c67115Jan23rv1_15_0+1649-0a5e4354c8816Jan23rv1_15_0+1650-eb20afbe8cf17Jan23rv1_15_0+1673-4c2717c2fef18Jan23rv1_15_0+1705-744bd5770b519Jan23rv1_15_0+1740-16bc1d7f78f20Jan23rv1_15_0+1760-27b7fb0444f21Jan23rv1_15_0+1776-6c18d02e6cc22Jan23rv1_15_0+1778-bc9e715673b23Jan23rv1_15_0+1787-2173736005f24Jan23rv1_15_0+1834-4a03b819d2526Jan23rv1_15_0+1951-7b41073e07627Jan23rv1_15_0+1996-a10e7737c8b
Summary1 tests: 1 succeeded 1 tests: 1 succeeded 1 tests: 1 succeeded 1 tests: 1 succeeded 1 tests: 1 succeeded 1 tests: 1 succeeded 1 tests: 1 FAILED 1 tests: 1 FAILED 1 tests: 1 FAILED 1 tests: 1 FAILED 1 tests: 1 FAILED 1 tests: 1 FAILED 1 tests: 1 FAILED 1 tests: 1 FAILED 1 tests: 1 FAILED 1 tests: 1 FAILED 1 tests: 1 FAILED 1 tests: 1 FAILED 1 tests: 1 FAILED 1 tests: 1 FAILED 1 tests: 1 FAILED 1 tests: 1 FAILED
demandelements basic separated_vtypes ok ts-sim-build-baok ts-sim-build-baok ts-sim-build-baok ts-sim-build-baok ts-sim-build-baok ts-sim-build-baerrors different(+) ts-sim-build-baerrors different(+) ts-sim-build-baerrors different(+) ts-sim-build-baerrors different(+) ts-sim-build-baerrors different(+) ts-sim-build-baerrors different(+) ts-sim-build-baerrors different(+) ts-sim-build-baerrors different(+) ts-sim-build-baerrors different(+) ts-sim-build-baerrors different(+) ts-sim-build-baerrors different(+) ts-sim-build-baerrors different(+) ts-sim-build-baerrors different(+) ts-sim-build-baerrors different(+) ts-sim-build-baerrors different(+) ts-sim-build-baerrors different(+) ts-sim-build-ba